Place,Name,Sex,BirthDate,Age,Country,State,Equipment,Division,BodyweightKg,WeightClassKg,Squat1Kg,Squat2Kg,Squat3Kg,Squat4Kg,Best3SquatKg,Bench1Kg,Bench2Kg,Bench3Kg,Bench4Kg,Best3BenchKg,Deadlift1Kg,Deadlift2Kg,Deadlift3Kg,Best3DeadliftKg,TotalKg,Event,Team
1,Nat Mitchell,F,1999-01-06,21,Australia,TAS,Wraps,FR-J,60,60,120,-130,-130,,120,65,70,-75,,70,135,147.5,,147.5,337.5,SBD,The Strength Den
2,Isobelle Murray,F,1998-10-13,21,Australia,TAS,Wraps,FR-J,57.7,60,72.5,80,85,,85,45,50,52.5,,52.5,112.5,120,125,125,262.5,SBD,Method + Action
1,Nickola Orr,F,1997-04-24,23,Australia,TAS,Wraps,FR-J,71.3,75,142.5,152.5,-157.5,,152.5,72.5,75,-77.5,,75,162.5,170,172.5,172.5,400,SBD,Leviathan Strength Gym
2,Emily Burr,F,1999-06-22,21,Australia,TAS,Wraps,FR-J,73.4,75,-120,125,132.5,,132.5,67.5,72.5,77.5,-80,77.5,120,130,135,135,345,SBD,
3,Chloe Lambert,F,1998-06-30,22,Australia,TAS,Wraps,FR-J,71.3,75,105,117.5,122.5,,122.5,42.5,45,-47.5,,45,95,105,112.5,112.5,280,SBD,Method + Action
1,Tammy Brooks,F,1980-01-08,40,Australia,TAS,Wraps,FR-M1,82,82.5,80,92.5,-100,,92.5,50,55,-57.5,,55,100,112.5,120,120,267.5,SBD,Portside Barbell
1,Lenise Ansell,F,1967-11-05,52,Australia,TAS,Wraps,FR-M2,78.2,82.5,-85,85,90,,90,55,62.5,-67.5,,62.5,125,132.5,140,140,292.5,SBD,Buff Fitness
1,Isabella Burk,F,2001-01-18,19,Australia,TAS,Wraps,FR-SJ,59.9,60,-107.5,-107.5,107.5,,107.5,47.5,52.5,57.5,,57.5,115,120,130,130,295,SBD,Portside Barbell
1,Coorinna Summers,F,,30,Australia,TAS,Wraps,FR-O,59.8,60,142.5,155,165,-168,165,73,-77.5,77.5,80,77.5,145,-152.5,-152.5,145,387.5,SBD,Artgym
1,Despina Amerikanos,F,1991-05-14,29,Australia,TAS,Wraps,FR-O,65.8,67.5,95,105,112.5,,112.5,65,70,-75,,70,145,152.5,160,160,342.5,SBD,Portside Barbell
2,Melissa Pearce,F,1987-06-23,33,Australia,TAS,Wraps,FR-O,67,67.5,85,90,95,,95,57.5,62.5,-65,,62.5,125,132.5,140,140,297.5,SBD,Home Gym
3,Danielle Hansson,F,1990-10-12,29,Australia,TAS,Wraps,FR-O,62.7,67.5,75,85,-95,,85,60,65,-67.5,,65,90,102.5,112.5,112.5,262.5,SBD,Portside Barbell
4,Alexandra Brand-Jones,F,1996-07-14,24,Australia,TAS,Wraps,FR-O,66.2,67.5,70,75,-80,,75,40,45,-50,,45,90,95,100,100,220,SBD,
1,Tia Cane,F,1993-03-19,27,Australia,TAS,Wraps,FR-O,69.9,75,150,160,165,,165,65,70,75,,75,165,172.5,180,180,420,SBD,Method + Action
2,Chloe Harris,F,,26,Australia,TAS,Wraps,FR-O,74.6,75,125,132.5,140,,140,80,-85,85,,85,130,140,-145,140,365,SBD,Portside Barbell
3,Sharee Eugster,F,1983-06-16,37,Australia,TAS,Wraps,FR-O,70.7,75,120,130,135,,135,65,70,-75,,70,135,142.5,-150,142.5,347.5,SBD,Elements of Strength
4,Nadene Van Rooyen,F,1995-12-06,24,Australia,TAS,Wraps,FR-O,73.7,75,105,-115,115,,115,55,60,-65,,60,110,120,125,125,300,SBD,Method + Action
1,Stevie Freeman,F,1994-05-30,26,Australia,TAS,Wraps,FR-O,80.3,82.5,140,150,-160,,150,75,85,92.5,,92.5,140,150,160,160,402.5,SBD,
1,Anna Travers,F,1985-06-22,35,Australia,TAS,Wraps,FR-O,86.4,90,100,110,120,,120,65,70,-80,,70,-120,130,140,140,330,SBD,
1,Morgan Brown #3,F,2004-04-16,16,Australia,TAS,Wraps,FR-T,59.2,60,65,70,75,,75,37.5,42.5,47.5,50,47.5,100,110,115,115,237.5,SBD,Method + Action
1,Bethany Howell,F,2004-01-22,16,Australia,TAS,Wraps,FR-T,61.7,67.5,72.5,80,85,-87.5,85,42.5,47.5,-50.5,,47.5,80,92.5,100.5,100.5,233,SBD,Method + Action
1,Theo Randall,M,1997-10-24,22,Australia,TAS,Wraps,MR-J,81.2,82.5,140,150,165,,165,85,90,97.5,,97.5,175,195,205,205,467.5,SBD,Portside Barbell
1,Kayden Randall,M,2001-07-06,19,Australia,TAS,Wraps,MR-O,80.5,82.5,170,180,-185,,180,-100,110,-120,,110,150,160,170,170,460,SBD,Portside Barbell
1,Matthew Knight #5,M,2002-10-22,17,Australia,TAS,Wraps,MR-O,87.7,90,110,120,130,,130,110,-115,115,,115,160,170,180,180,425,SBD,Method + Action
1,Jack Jones,M,2001-03-30,19,Australia,TAS,Wraps,MR-O,93.3,100,155,165,170,,170,95,100,-102.5,,100,195,215,225,225,495,SBD,Portside Barbell
1,Sam Goldsack,M,1994-09-24,,Australia,TAS,Wraps,MR-O,66.3,67.5,130,140,150,,150,80,85,87.5,,87.5,165,175,187.5,187.5,425,SBD,The Strength Den
1,Ryan Jordan #2,M,1992-01-12,28,Australia,TAS,Wraps,MR-O,81.1,82.5,200,210,-215,,210,137.5,142.5,-147.5,,142.5,250,-260,260,260,612.5,SBD,
1,Jamie Clark,M,,36,Australia,TAS,Wraps,MR-O,87.8,90,220,235,-250,,235,175,180,185,,185,240,255,270,270,690,SBD,Portside Barbell
2,Luke Howard,M,1986-04-17,34,Australia,TAS,Wraps,MR-O,89.9,90,225,237.5,245,,245,130,137.5,-140,,137.5,230,242.5,245,245,627.5,SBD,The Strength Den
1,Ryan Summers,M,1989-08-14,,Australia,TAS,Wraps,MR-O,97.1,100,227.5,242.5,252.5,,252.5,155,160,,,160,275,287.5,-300,287.5,700,SBD,Iron Born
2,Tyrone Stephens,M,1990-10-29,29,Australia,TAS,Wraps,MR-O,99.9,100,185,195,205,,205,145,152.5,157.5,,157.5,220,235,250,250,612.5,SBD,Portside Barbell
3,Daniel Williams,M,1993-12-27,26,Australia,TAS,Wraps,MR-O,98.7,100,230,240,-250,,240,135,145,-155,,145,200,210,220,220,605,SBD,
4,Anthony Xepapas,M,1989-08-28,,Australia,TAS,Wraps,MR-O,96,100,-170,-170,170,,170,100,105,115,,115,180,210,240,240,525,SBD,Slaughterhouse Gym Hobart
1,Jarred Ranson,M,1990-09-14,30,Australia,TAS,Wraps,MR-O,109,110,310,325,-335,,325,190,197.5,-200,,197.5,290,305,312.5,312.5,835,SBD,Method + Action
2,Kayden Weller,M,,25,Australia,TAS,Wraps,MR-O,107.6,110,250,265,280,,280,135,145,-150,,145,272.5,285,-300,285,710,SBD,Portside Barbell
1,Jonathan Cooper #1,M,1984-08-09,,Australia,TAS,Wraps,MR-O,118.2,125,200,215,225,,225,180,-190,-190,,180,235,245,255,255,660,SBD,Dog Den
2,Nathan Kilby,M,1995-11-17,24,Australia,TAS,Wraps,MR-O,122.6,125,215,230,240,,240,125,-135,-135,,125,230,-245,,230,595,SBD,Method + Action
1,Patrick Neumayer,M,1982-08-27,,Australia,TAS,Wraps,MR-O,163.6,140+,220,245,270,,270,140,150,-165,,150,-255,270,280,280,700,SBD,Mammoth Gym
2,Carl Pearson,M,1984-03-24,36,Australia,TAS,Wraps,MR-O,155.8,140+,240,-255,255,,255,170,180,200,,200,220,230,240,240,695,SBD,Dog Den
