Division,WeightClassKg,Place,Name,Team,BodyweightKg,Best3SquatKg,Best3BenchKg,Best3DeadliftKg,TotalKg,Equipment,Event,Sex,BirthDate
Girls,51.94,1,Hannah Sharpless,Beckville,51.35,90.72,31.75,86.18,208.65,Single-ply,SBD,F,
Girls,51.94,2,Emily Tate,Beckville,50.26,70.31,24.95,90.72,185.97,Single-ply,SBD,F,
Girls,56.02,1,Laney Jones,Beckville,54.25,65.77,31.75,79.38,176.9,Single-ply,SBD,F,
Girls,56.02,2,Kiara Willis,Beckville,54.98,65.77,29.48,54.43,149.69,Single-ply,SBD,F,
Girls,60.1,1,Anna McCullough,Hughes Springs,58.06,81.65,47.63,72.57,201.85,Single-ply,SBD,F,
Girls,60.1,2,Alex English,Beckville,58.6,52.16,24.95,79.38,156.49,Single-ply,SBD,F,
Girls,67.36,1,Baylie Seegers,Beckville,66.68,115.67,43.09,117.93,276.69,Single-ply,SBD,F,
Girls,67.36,2,Kaylee Fletcher,Beckville,66.77,104.33,40.82,117.93,263.08,Single-ply,SBD,F,
Girls,67.36,3,Gracie Reagan,Hughes Springs,66.22,95.25,52.16,90.72,238.14,Single-ply,SBD,F,
Girls,67.36,4,Karissa McDowell,Beckville,64.95,65.77,31.75,79.38,176.9,Single-ply,SBD,F,
Girls,67.36,5,Jasmine Cooper,Beckville,65.59,54.43,31.75,77.11,163.29,Single-ply,SBD,F,
Girls,67.36,6,Mj Weatherford,Beckville,67.31,54.43,31.75,72.57,158.76,Single-ply,SBD,F,
Girls,75.07,1,Abby Smith,Beckville,71.4,124.74,52.16,124.74,301.64,Single-ply,SBD,F,
Girls,75.07,2,Andrea Bennett,Beckville,74.03,117.93,47.63,115.67,281.23,Single-ply,SBD,F,
Girls,75.07,3,Emily Dean,Beckville,70.94,99.79,47.63,115.67,263.08,Single-ply,SBD,F,
Girls,82.33,1,Korbyn Jones,Beckville,80.01,88.45,31.75,90.72,210.92,Single-ply,SBD,F,
Girls,90.04,1,Karmen Searcy,Hughes Springs,85.37,136.08,95.25,147.42,378.75,Single-ply,SBD,F,
Girls,90.04,2,Presley Richardson,Hughes Springs,84.28,104.33,72.57,97.52,274.42,Single-ply,SBD,F,
Girls,90.04,3,Abby Osthoff,Pittsburg,84.19,63.5,36.29,70.31,170.1,Single-ply,SBD,F,
Girls,90.04,4,Jaicey Rich,Elysian Fields,87.27,61.23,27.22,77.11,165.56,Single-ply,SBD,F,
Girls,90.04,5,Lillie Pierce,Elysian Fields,85.09,52.16,24.95,52.16,129.27,Single-ply,SBD,F,
Girls,117.71,1,Savannah Sipes,Elysian Fields,104.6,79.38,38.56,79.38,197.31,Single-ply,SBD,F,
Girls,117.71+,1,Kayla Griffin,Pittsburg,123.47,102.06,72.57,124.74,299.37,Single-ply,SBD,F,
Girls,117.71+,2,Sierra Mathis,Elysian Fields,141.07,74.84,43.09,86.18,204.12,Single-ply,SBD,F,
