Place,Name,BirthYear,Country,BodyweightKg,Best3BenchKg,Bench4Kg,WeightClassKg,Sex,CyrillicName,Event,TotalKg,Equipment,Division
1,Lyudmila Anisimova,1972,Russia,48,55,,48,F,Людмила Анисимова,B,55,Single-ply,Open
2,Tatyana Vikhlicheva,1980,Russia,47.75,50,,48,F,Татьяна Вихличева,B,50,Single-ply,Open
1,Margarita Buevich,1982,Russia,51.45,72.5,,52,F,Маргарита Буевич,B,72.5,Single-ply,Open
1,Svetlana Kachurina,1976,Russia,56,92.5,,56,F,Светлана Качурина,B,92.5,Single-ply,Open
2,Tatyana Verzhikhovskaya,1981,Russia,55.1,85,,56,F,Татьяна Вержиховская,B,85,Single-ply,Open
1,Anastasia Pavlova,1971,Russia,60,90,,60,F,Анастасия Павлова,B,90,Single-ply,Open
2,Iryna Parkhomenko,1966,Russia,60,80,,60,F,Ірина Пархоменко,B,80,Single-ply,Open
1,Natalya Kashirina,1954,Russia,61.95,100,,67.5,F,Наталья Каширина,B,100,Single-ply,Open
DQ,Valentina Kharina,1977,Russia,62.6,,,67.5,F,Валентина Харина,B,,Single-ply,Open
1,Mariya Volkova,1972,Russia,68.8,122.5,125,75,F,Мария Волкова,B,122.5,Single-ply,Open
2,Mariya Panferova,1977,Russia,73.8,115,,75,F,Мария Панферова,B,115,Single-ply,Open
3,Elena Tseytlina,1961,Russia,72.15,100,,75,F,Елена Цейтлин,B,100,Single-ply,Open
1,Sanzhar Isroilov,1979,Russia,51.5,100,,52,M,,B,100,Single-ply,Open
1,Dmitriy Slutskiy,1974,Russia,55.95,115,,56,M,Дмитрий Слуцкий,B,115,Single-ply,Open
2,Alexander Rode,1981,Russia,54,110,,56,M,Александр Роде,B,110,Single-ply,Open
3,Ivan Olkin,1983,Russia,55.1,105,,56,M,Иван Олькин,B,105,Single-ply,Open
4,Evgeniy Aleshin,1983,Russia,55.1,90,,56,M,Евгений Алешин,B,90,Single-ply,Open
1,Aleksandr Kolyshkin,1981,Russia,60,142.5,,60,M,Александр Колышкин,B,142.5,Single-ply,Open
1,Ilya Kokorev,1973,Russia,67.15,180,,67.5,M,Илья Кокорев,B,180,Single-ply,Open
2,Sergey Kolesnikov,1974,Russia,67.5,170,,67.5,M,Сергей Колесников,B,170,Single-ply,Open
3,Nikolay Sokolov,1979,Russia,66.5,165,,67.5,M,Николай Соколов,B,165,Single-ply,Open
4,Aleksandr Mamontov,1981,Russia,67.5,162.5,,67.5,M,Александр Мамонтов,B,162.5,Single-ply,Open
5,Vadim Floryan,1983,Russia,67.15,150,,67.5,M,Вадим Флорян,B,150,Single-ply,Open
6,Aleksandr Fedorov,1976,Russia,64.35,137.5,,67.5,M,Александр Федоров,B,137.5,Single-ply,Open
7,Ravil Azizov,1980,Russia,66.65,130,,67.5,M,Равиль Азизов,B,130,Single-ply,Open
8,Vladimir Semenichenko,1986,Russia,66,110,,67.5,M,Владимир Семениченко,B,110,Single-ply,Open
DQ,Vladimir Zakharov #8,1963,Russia,66.95,,,67.5,M,Владимир Захаров,B,,Single-ply,Open
1,Mikhail Stebletsov,1980,Russia,74.3,175,,75,M,Михаил Стеблецов,B,175,Single-ply,Open
2,Oleg Ryabinnikov,1978,Russia,75,175,,75,M,Олег Рябинников,B,175,Single-ply,Open
3,Pavel Petukhov,1978,Russia,73.2,162.5,,75,M,Павел Петухов,B,162.5,Single-ply,Open
4,Fedor Balakov,1981,Russia,73.45,142.5,,75,M,Федор Балаков,B,142.5,Single-ply,Open
5,Vladimir Lapin,1981,Russia,74.4,142.5,,75,M,Владимир Лапин,B,142.5,Single-ply,Open
DQ,Ernest Gazaryan,1979,Russia,71.75,,,75,M,Эрнест Газарян,B,,Single-ply,Open
DQ,Vitaliy Pavlikov,1974,Russia,75,,,75,M,Виталий Павликов,B,,Single-ply,Open
1,Pavel Sled,1972,Russia,81.7,227.5,228,82.5,M,Павел Следь,B,227.5,Single-ply,Open
2,Vitaliy Ponomarev,1957,Russia,82,205,,82.5,M,Виталий Пономарев,B,205,Single-ply,Open
3,Georgiy Belyy,1970,Russia,80.25,185,,82.5,M,Георгий Белый,B,185,Single-ply,Open
4,Aleksandr Shpak,1980,Russia,82.2,180,,82.5,M,Александр Шпак,B,180,Single-ply,Open
4,Aleksandr Novozhilov,1972,Russia,82.5,170,,82.5,M,Александр Новожилов,B,170,Single-ply,Open
5,Yuriy Tugarev,1980,Russia,81.6,172.5,,82.5,M,Юрий Тугарев,B,172.5,Single-ply,Open
1,Aleksey Vorobyev,1969,Russia,86.4,260,260,90,M,Алексей Воробьев,B,260,Single-ply,Open
2,Mikhail Pshekhonov,1971,Russia,89.4,210,,90,M,Михаил Пшехонов,B,210,Single-ply,Open
3,Sergey Berezin,1976,Russia,88.15,192.5,,90,M,Сергей Березин,B,192.5,Single-ply,Open
4,Aleksandr Lipatov,1976,Russia,88.6,190,,90,M,Александр Липатов,B,190,Single-ply,Open
5,Ivan Danilenko,1981,Russia,88.7,190,,90,M,Иван Даниленко,B,190,Single-ply,Open
6,Igor Dolzhenko #2,1972,Russia,88.5,180,,90,M,Игорь Долженко,B,180,Single-ply,Open
7,Filipp Izhikov,1975,Russia,88.6,180,,90,M,Филипп Ижиков,B,180,Single-ply,Open
8,Artur Lantratov,1967,Russia,85.9,170,,90,M,Артур Лантратов,B,170,Single-ply,Open
9,Artem Anisimov,1981,Russia,89.95,170,,90,M,Артем Анисимов,B,170,Single-ply,Open
1,Aleksey Ryzhov,1974,Russia,95.1,258,258,100,M,Алексей Рыжов,B,258,Single-ply,Open
2,Vladimir Volkov #1,1959,Russia,94.7,220,,100,M,Владимир Волков,B,220,Single-ply,Open
3,Valeriy Melnik #2,1974,Russia,94.2,215,,100,M,Валерий Мельник,B,215,Single-ply,Open
4,Vladislav Putilin,1976,Russia,97.35,215,,100,M,Владислав Путилин,B,215,Single-ply,Open
5,Valeriy Kuznetsov #4,1952,Russia,99.95,205,,100,M,Валерий Кузнецов,B,205,Single-ply,Open
6,Denis Podvizhnoy,1977,Russia,93.9,195,,100,M,Денис Подвижной,B,195,Single-ply,Open
7,Maxim Sinetskin,1978,Russia,94.35,185,,100,M,Максим Синецкин,B,185,Single-ply,Open
8,Aleksandr Zykov,1983,Russia,95.6,185,,100,M,Александр Зыков,B,185,Single-ply,Open
DQ,Aleksandr Kislitsyn,1977,Russia,98.6,,,100,M,Александр Кислицын,B,,Single-ply,Open
DQ,Igor Malyanov,1980,Russia,99.35,,,100,M,Игорь Малянов,B,,Single-ply,Open
1,Vladimir Lisitskiy,1970,Russia,102.55,240,,110,M,Владимир Лисицкий,B,240,Single-ply,Open
2,Oleg Zaytsev,1976,Russia,109.55,225,,110,M,Олег Зайцев,B,225,Single-ply,Open
3,Pavel Yakovlev,1974,Russia,108.05,222.5,,110,M,Павел Яковлев,B,222.5,Single-ply,Open
4,Dmitry Gorbachev,1970,Russia,102.75,220,,110,M,Дмитрий Горбачев,B,220,Single-ply,Open
5,Dmitriy Rakcheev,1971,Russia,104.7,215,,110,M,Дмитрий Ракчеев,B,215,Single-ply,Open
6,Dmitriy Koshelev,1974,Russia,110,210,,110,M,Дмитрий Кошелев,B,210,Single-ply,Open
7,Valeriy Kurochkin,1978,Russia,101.95,202.5,,110,M,Валерий Курочкин,B,202.5,Single-ply,Open
8,Vladimir Shiryaev,1978,Russia,105.35,200,,110,M,Владимир Ширяев,B,200,Single-ply,Open
9,Yuriy Panteleev #1,1975,Russia,107.15,200,,110,M,Юрий Пантелеев,B,200,Single-ply,Open
10,Stepan Sorokin,1982,Russia,110,200,,110,M,Степан Сорокин,B,200,Single-ply,Open
11,Pavel Chepikov,1979,Russia,110,197.5,,110,M,Павел Чепиков,B,197.5,Single-ply,Open
DQ,Aleksey Smirnov,1977,Russia,103.4,,,110,M,Алексей Смирнов,B,,Single-ply,Open
DQ,Roman Milyaev,1981,Russia,109.35,,,110,M,Роман Миляев,B,,Single-ply,Open
DQ,Vyacheslav Rakhmanov,1968,Russia,110,,,110,M,Вячеслав Рахманов,B,,Single-ply,Open
1,Aleksandr Sergeev #2,1971,Russia,117.75,260,,125,M,Александр Сергеев,B,260,Single-ply,Open
2,Vitaliy Kuznetsov,1973,Russia,120.25,250,,125,M,Виталий Кузнецов,B,250,Single-ply,Open
3,Aleksey Kruglov,1959,Russia,116.6,230,,125,M,Алексей Круглов,B,230,Single-ply,Open
4,Vyacheslav Podlegaev,1980,Russia,117.7,230,,125,M,Вячеслав Подлегаев,B,230,Single-ply,Open
5,Dmitriy Permyakov,1975,Russia,119.2,220,,125,M,Дмитрий Пермяков,B,220,Single-ply,Open
6,Mikhail Osiptsev,1973,Russia,121.7,207.5,,125,M,Михаил Осипцев,B,207.5,Single-ply,Open
DQ,Sergey Puzyrev,1966,Russia,119.8,,,125,M,Сергей Пузырев,B,,Single-ply,Open
1,Konstantin Zelenin,1965,Russia,150.5,275,,125+,M,Константин Зеленин,B,275,Single-ply,Open
2,Lev Shprints,1952,Russia,143.2,190,,125+,M,Лев Шпринц,B,190,Single-ply,Open
