Division,WeightClassKg,Place,Name,Team,BodyweightKg,Best3SquatKg,Best3BenchKg,Best3DeadliftKg,TotalKg,Equipment,Event,Sex,BirthDate
Boys,51.71,1,Cristian Orona,Victoria East,51.26,147.42,81.65,181.44,410.5,Single-ply,SBD,M,
Boys,51.71,2,Shiv Ranchhod,Gregory-Portland,50.44,129.27,65.77,136.08,331.12,Single-ply,SBD,M,
Boys,51.71,3,David Chittarath,Rockport-Fulton,51.53,115.67,70.31,133.81,319.78,Single-ply,SBD,M,
Boys,51.71,4,Nathaniel Botello,Corpus Christi Calallen,51.71,90.72,54.43,104.33,249.48,Single-ply,SBD,M,
Boys,55.79,1,Cody Davila,Rockport-Fulton,52.53,145.15,79.38,161.03,385.55,Single-ply,SBD,M,
Boys,55.79,2,Carson Guidry,Taft,54.34,83.91,56.7,102.06,242.67,Single-ply,SBD,M,
Boys,59.87,1,Jeremiah Zelaya,Victoria East,59.78,199.58,120.2,208.65,528.44,Single-ply,SBD,M,
Boys,59.87,2,Deonte Duhart,Ingleside,58.79,147.42,95.25,174.63,417.3,Single-ply,SBD,M,
Boys,59.87,3,Joseph Espinoza,Taft,58.97,136.08,95.25,165.56,396.89,Single-ply,SBD,M,
Boys,59.87,4,Mark Moreno,Odem,58.79,142.88,74.84,154.22,371.95,Single-ply,SBD,M,
Boys,59.87,5,Rogelio Sanchez,Odem,56.79,136.08,70.31,149.69,356.07,Single-ply,SBD,M,
Boys,59.87,6,Christian Perez,Gregory-Portland,58.15,133.81,81.65,136.08,351.53,Single-ply,SBD,M,
Boys,59.87,7,James Adams,Odem,59.06,133.81,79.38,129.27,342.46,Single-ply,SBD,M,
Boys,59.87,8,Justin Cantu,Corpus Christi Calallen,56.43,127.01,68.04,124.74,319.78,Single-ply,SBD,M,
Boys,67.13,1,Angel Trujillo,Rockport-Fulton,66.41,192.78,117.93,201.85,512.56,Single-ply,SBD,M,
Boys,67.13,2,Doug Escobedo,Gregory-Portland,64.86,174.63,92.99,174.63,442.25,Single-ply,SBD,M,
Boys,67.13,3,Abel Cervantes,Sinton,66.13,149.69,99.79,179.17,428.64,Single-ply,SBD,M,
Boys,67.13,4,Chris Acosta #1,Ingleside,62.14,158.76,95.25,170.1,424.11,Single-ply,SBD,M,
Boys,67.13,5,Joe Martinez,Corpus Christi Calallen,64.14,154.22,104.33,154.22,412.77,Single-ply,SBD,M,
Boys,67.13,6,Joseph Chavez,Taft,65.86,142.88,79.38,183.7,405.97,Single-ply,SBD,M,
Boys,67.13,7,Nick Molina,Gregory-Portland,65.41,129.27,81.65,142.88,353.8,Single-ply,SBD,M,
Boys,67.13,8,Jadon Torres,Odem,64.68,133.81,88.45,124.74,347,Single-ply,SBD,M,
Boys,67.13,9,Zach Guzman,Gregory-Portland,65.32,127.01,74.84,140.61,342.46,Single-ply,SBD,M,
Boys,67.13,10,Ezra Salazar,Corpus Christi Tuloso-Midway,60.6,131.54,77.11,124.74,333.39,Single-ply,SBD,M,
Boys,67.13,11,Leroy Burke,Rockport-Fulton,59.96,111.13,72.57,136.08,319.78,Single-ply,SBD,M,
Boys,67.13,DQ,Luke Davis,Sinton,66.59,142.88,,,,Single-ply,SBD,M,
Boys,67.13,DQ,Cristian Robles,Corpus Christi Calallen,65.95,156.49,,,,Single-ply,SBD,M,
Boys,67.13,DQ,Jerek Sanchez,Taft,62.14,158.76,,,,Single-ply,SBD,M,
Boys,67.13,DQ,Jonathan Mendoza,Ingleside,60.24,,,,,Single-ply,SBD,M,
Boys,74.84,1,Jaxon Mabile,Ingleside,74.03,254.01,124.74,238.14,616.89,Single-ply,SBD,M,
Boys,74.84,2,Chiso Nwampka,Corpus Christi Tuloso-Midway,74.75,199.58,138.35,229.06,566.99,Single-ply,SBD,M,
Boys,74.84,3,Ryan Wells,Rockport-Fulton,74.48,208.65,133.81,204.12,546.58,Single-ply,SBD,M,
Boys,74.84,4,Elijah Galvan,Ingleside,71.76,172.37,97.52,183.7,453.59,Single-ply,SBD,M,
Boys,74.84,5,Christian Canales,Ingleside,70.58,165.56,102.06,176.9,444.52,Single-ply,SBD,M,
Boys,74.84,6,Jose Vasquez,Corpus Christi Calallen,71.58,154.22,95.25,195.04,444.52,Single-ply,SBD,M,
Boys,74.84,7,Exander Gamaz,Sinton,74.66,174.63,108.86,151.95,435.45,Single-ply,SBD,M,
Boys,74.84,8,John Espinoza,Odem,73.3,156.49,83.91,151.95,392.36,Single-ply,SBD,M,
Boys,74.84,9,Nathaniel Garcia,Corpus Christi Calallen,73.03,138.35,92.99,142.88,374.21,Single-ply,SBD,M,
Boys,74.84,DQ,Seth Avila,Corpus Christi Calallen,73.03,129.27,,,,Single-ply,SBD,M,
Boys,74.84,DQ,Pedro Diaz,Odem,73.84,,,,,Single-ply,SBD,M,
Boys,82.1,1,Robert Torres,Sinton,81.28,226.8,124.74,210.92,562.45,Single-ply,SBD,M,
Boys,82.1,2,Alan Rodriguez,Corpus Christi Tuloso-Midway,80.74,190.51,120.2,192.78,503.49,Single-ply,SBD,M,
Boys,82.1,3,Gavin Gonzalez,Corpus Christi Tuloso-Midway,79.02,174.63,102.06,167.83,444.52,Single-ply,SBD,M,
Boys,82.1,4,Marcus Trejo,Sinton,81.56,161.03,111.13,165.56,437.72,Single-ply,SBD,M,
Boys,82.1,5,Jaron Marshall,Corpus Christi Tuloso-Midway,82.1,151.95,97.52,163.29,412.77,Single-ply,SBD,M,
Boys,82.1,6,Spencer Bosarge,Ingleside,80.1,136.08,106.59,154.22,396.89,Single-ply,SBD,M,
Boys,82.1,7,Jason Drummond,Gregory-Portland,77.84,142.88,81.65,147.42,371.95,Single-ply,SBD,M,
Boys,82.1,8,Jerimiah Nino,Sinton,76.2,124.74,83.91,133.81,342.46,Single-ply,SBD,M,
Boys,82.1,DQ,Adrian Gonzales,Gregory-Portland,79.38,147.42,,,,Single-ply,SBD,M,
Boys,82.1,DQ,Cale Kruger,Gregory-Portland,80.01,,,,,Single-ply,SBD,M,
Boys,82.1,DQ,Martin Garcia,Gregory-Portland,82.1,,,,,Single-ply,SBD,M,
Boys,89.81,1,Nick Lazo,Corpus Christi Tuloso-Midway,84.19,204.12,120.2,201.85,526.17,Single-ply,SBD,M,
Boys,89.81,2,Ean McPherson,Rockport-Fulton,88.99,206.38,120.2,174.63,501.22,Single-ply,SBD,M,
Boys,89.81,3,Trinidad Salazar,Corpus Christi Tuloso-Midway,82.74,170.1,106.59,201.85,478.54,Single-ply,SBD,M,
Boys,89.81,4,Seth Morgan,Ingleside,85.73,170.1,102.06,181.44,453.59,Single-ply,SBD,M,
Boys,89.81,5,Chris Bray,Gregory-Portland,89.81,170.1,102.06,172.37,444.52,Single-ply,SBD,M,
Boys,89.81,6,Nick Watts,Gregory-Portland,85.91,142.88,92.99,145.15,381.02,Single-ply,SBD,M,
Boys,89.81,7,Anastacio Lopez,Taft,84.73,151.95,70.31,151.95,374.21,Single-ply,SBD,M,
Boys,89.81,8,Gavin Nunez,Gregory-Portland,88.81,142.88,79.38,131.54,353.8,Single-ply,SBD,M,
Boys,89.81,9,Jaykob De La Paz,Corpus Christi Calallen,86.64,117.93,90.72,142.88,351.53,Single-ply,SBD,M,
Boys,89.81,DQ,Dominic Zamora,Odem,85.73,197.31,127.01,,,Single-ply,SBD,M,
Boys,89.81,DQ,Landon Garza,Odem,87.54,204.12,111.13,,,Single-ply,SBD,M,
Boys,99.79,1,Seth Ruff,Ingleside,95.35,281.23,138.35,276.69,696.26,Single-ply,SBD,M,
Boys,99.79,2,Marcus Cerda,Taft,99.61,231.33,149.69,213.19,594.21,Single-ply,SBD,M,
Boys,99.79,3,Jacob Cartellanos,Corpus Christi Calallen,99.34,201.85,124.74,215.46,542.04,Single-ply,SBD,M,
Boys,99.79,4,Phillip Krupa,Rockport-Fulton,99.06,208.65,120.2,204.12,532.97,Single-ply,SBD,M,
Boys,99.79,5,Brody Raines,Gregory-Portland,95.35,208.65,122.47,192.78,523.9,Single-ply,SBD,M,
Boys,99.79,6,Isaac Martinez,Corpus Christi Tuloso-Midway,99.79,204.12,122.47,183.7,510.29,Single-ply,SBD,M,
Boys,99.79,7,Daniel Tamez,Odem,98.7,195.04,102.06,199.58,496.68,Single-ply,SBD,M,
Boys,99.79,8,Brandon Beltran,Odem,91.72,204.12,124.74,154.22,483.08,Single-ply,SBD,M,
Boys,99.79,9,Payton McAllister,Rockport-Fulton,97.61,176.9,108.86,181.44,467.2,Single-ply,SBD,M,
Boys,99.79,10,Mark Morin,Taft,97.7,156.49,117.93,158.76,433.18,Single-ply,SBD,M,
Boys,99.79,11,Julio Loera,Sinton,95.62,154.22,104.33,170.1,428.64,Single-ply,SBD,M,
Boys,99.79,12,Jaden Galvan,Victoria East,92.62,161.03,86.18,179.17,426.38,Single-ply,SBD,M,
Boys,99.79,13,Joshua Jarwin,Corpus Christi Calallen,96.16,142.88,90.72,176.9,410.5,Single-ply,SBD,M,
Boys,99.79,14,Joaquin Tagle,Corpus Christi Calallen,99.25,111.13,88.45,117.93,317.51,Single-ply,SBD,M,
Boys,99.79,DQ,Christian Ortiz,Gregory-Portland,99.79,,,,,Single-ply,SBD,M,
Boys,109.77,1,Michael Esquivel,Taft,102.42,217.72,120.2,183.7,521.63,Single-ply,SBD,M,
Boys,109.77,2,Aureliano Saenz,Corpus Christi Calallen,109.13,142.88,97.52,142.88,383.29,Single-ply,SBD,M,
Boys,109.77,3,Gilbert Herrera,Corpus Christi Calallen,101.7,142.88,72.57,131.54,347,Single-ply,SBD,M,
Boys,109.77,DQ,Jaxon Clarke,Corpus Christi Calallen,104.78,95.25,,,,Single-ply,SBD,M,
Boys,109.77,DQ,Josue Fuentes,Rockport-Fulton,107.05,,,,,Single-ply,SBD,M,
Boys,124.74,1,Mark Lara,Gregory-Portland,116.75,226.8,133.81,208.65,569.26,Single-ply,SBD,M,
Boys,124.74,2,Phillip Conner,Gregory-Portland,110.04,206.38,124.74,208.65,539.77,Single-ply,SBD,M,
Boys,124.74,3,Elija Brown,Sinton,123.01,183.7,127.01,197.31,508.02,Single-ply,SBD,M,
Boys,124.74,4,Luis Aguilar,Rockport-Fulton,114.4,199.58,113.4,181.44,494.42,Single-ply,SBD,M,
Boys,124.74,5,Robert Kroen,Corpus Christi Tuloso-Midway,120.56,192.78,124.74,174.63,492.15,Single-ply,SBD,M,
Boys,124.74,6,Nathan Moreno,Ingleside,119.11,161.03,92.99,145.15,399.16,Single-ply,SBD,M,
Boys,124.74,7,Jevon Carter,Victoria East,114.21,140.61,79.38,145.15,365.14,Single-ply,SBD,M,
Boys,124.74,DQ,Brandon Kilough,Rockport-Fulton,119.29,,,,,Single-ply,SBD,M,
Boys,124.74,DQ,Jamie Gonzales,Taft,118.02,,,,,Single-ply,SBD,M,
Boys,124.74,DQ,Julian Gomez,Odem,117.93,,,,,Single-ply,SBD,M,
Boys,124.74+,1,Nate Martinez #4,Sinton,130.18,265.35,158.76,206.38,630.49,Single-ply,SBD,M,
Boys,124.74+,2,Richard Fierros,Gregory-Portland,145.97,235.87,124.74,226.8,587.4,Single-ply,SBD,M,
Boys,124.74+,3,Arturo Gallegos III,Ingleside,144.51,219.99,120.2,192.78,532.97,Single-ply,SBD,M,
Boys,124.74+,DQ,Leo Soliz,Corpus Christi Tuloso-Midway,128.82,283.5,,,,Single-ply,SBD,M,
