Division,WeightClassKg,Place,Name,Team,BodyweightKg,Best3SquatKg,Best3BenchKg,Best3DeadliftKg,TotalKg,Equipment,Event,Sex,BirthDate
Boys,55.79,DQ,Rj Phillips,Hawkins,53.34,,,,,Single-ply,SBD,M,
Boys,59.87,DQ,Rowdy Searer,Hawkins,57.52,90.72,81.65,,,Single-ply,SBD,M,
Boys,67.13,1,Kile Stripland,Gladewater Sabine,67.04,195.04,124.74,179.17,498.95,Single-ply,SBD,M,
Boys,67.13,2,Luis Williams,Harleton,66.86,170.1,122.47,172.37,464.93,Single-ply,SBD,M,
Boys,67.13,3,Zane Smith #3,Gladewater Sabine,67.09,167.83,138.35,154.22,460.4,Single-ply,SBD,M,
Boys,67.13,4,Nick Paschall,Harleton,66.13,156.49,86.18,172.37,415.04,Single-ply,SBD,M,
Boys,74.84,1,Camden Ward,Gladewater Sabine,74.66,188.24,115.67,201.85,505.76,Single-ply,SBD,M,
Boys,74.84,2,JB Hill,Gladewater Sabine,71.21,172.37,95.25,165.56,433.18,Single-ply,SBD,M,
Boys,74.84,3,Spencer Hammack,Harleton,73.39,170.1,102.06,151.95,424.11,Single-ply,SBD,M,
Boys,74.84,4,Jestin Hollingsworth,Harleton,73.48,163.29,95.25,156.49,415.04,Single-ply,SBD,M,
Boys,74.84,5,Brendan Scott,Harleton,73.75,154.22,95.25,151.95,401.43,Single-ply,SBD,M,
Boys,74.84,6,Mason Williamson,Hawkins,68.31,129.27,92.99,142.88,365.14,Single-ply,SBD,M,
Boys,74.84,7,Tayton Benfit,Harleton,73.57,136.08,83.91,145.15,365.14,Single-ply,SBD,M,
Boys,74.84,8,Brenden Elkins,Hawkins,69.4,117.93,72.57,142.88,333.39,Single-ply,SBD,M,
Boys,74.84,DQ,Garrison Conner,Diana New Diana,72.3,179.17,95.25,,,Single-ply,SBD,M,
Boys,82.1,1,Kaden Richard,Gladewater Sabine,81.69,204.12,127.01,204.12,535.24,Single-ply,SBD,M,
Boys,82.1,2,Blake Blassingame,Harleton,75.39,206.38,115.67,174.63,496.68,Single-ply,SBD,M,
Boys,82.1,3,Cade Canfield,Harleton,75.66,124.74,63.5,133.81,322.05,Single-ply,SBD,M,
Boys,82.1,4,Phillip Holland,Hawkins,78.02,111.13,70.31,136.08,317.51,Single-ply,SBD,M,
Boys,82.1,DQ,Hunter Warrick,Hawkins,80.1,,,,,Single-ply,SBD,M,
Boys,89.81,1,Daylon Branham,Gladewater Sabine,89.72,226.8,142.88,226.8,596.47,Single-ply,SBD,M,
Boys,89.81,2,Chance Owens,Gladewater Sabine,89.27,213.19,147.42,188.24,548.85,Single-ply,SBD,M,
Boys,89.81,3,Austin Stephens,Gladewater Sabine,83.01,170.1,102.06,172.37,444.52,Single-ply,SBD,M,
Boys,89.81,4,Carter Bibb,Harleton,82.64,156.49,83.91,183.7,424.11,Single-ply,SBD,M,
Boys,89.81,5,Edwin Torres,Hawkins,83.64,142.88,74.84,142.88,360.61,Single-ply,SBD,M,
Boys,99.79,1,Taber Childs,Harleton,91.99,217.72,124.74,204.12,546.58,Single-ply,SBD,M,
Boys,99.79,2,Taylor Wilson,Gladewater Sabine,97.98,204.12,136.08,179.17,519.36,Single-ply,SBD,M,
Boys,99.79,3,Caleb Smith,Harleton,95.25,185.97,113.4,174.63,474,Single-ply,SBD,M,
Boys,99.79,4,Coleman Tapia,Hawkins,98.07,165.56,129.27,158.76,453.59,Single-ply,SBD,M,
Boys,109.77,1,Asher Foster,Gladewater Sabine,109.72,204.12,158.76,199.58,562.45,Single-ply,SBD,M,
Boys,109.77,2,Steven Calico,Gladewater Sabine,107.5,183.7,136.08,183.7,503.49,Single-ply,SBD,M,
Boys,109.77,3,Kyle Wright,Harleton,105.41,163.29,90.72,151.95,405.97,Single-ply,SBD,M,
Boys,124.74,1,Jayden Willie,Harleton,112.49,226.8,117.93,217.72,562.45,Single-ply,SBD,M,
Boys,124.74,2,Kadarius Robinson,Hawkins,119.39,158.76,102.06,163.29,424.11,Single-ply,SBD,M,
Boys,124.74,DQ,Lane Woods,Harleton,109.95,190.51,97.52,,,Single-ply,SBD,M,
Boys,139.71,1,John Hester,Hawkins,127.73,217.72,142.88,226.8,587.4,Single-ply,SBD,M,
Boys,,NS,Brendan Miller,Gladewater Sabine,,,,,,Single-ply,SBD,M,
