Division,WeightClassKg,Place,Name,Team,BodyweightKg,Best3SquatKg,Best3BenchKg,Best3DeadliftKg,TotalKg,Equipment,Event,Sex
Boys,51.71,1,Justin Lindsey,Kennedale,51.44,181.44,97.52,161.03,439.98,Single-ply,SBD,M
Boys,51.71,2,Junior Chavez,Waxahachie,50.62,111.13,61.23,127.01,299.37,Single-ply,SBD,M
Boys,51.71,3,Dakotah McGowen,North Forney,51.66,117.93,52.16,120.2,290.3,Single-ply,SBD,M
Boys,51.71,4,Jose Lopez,Kaufman,45,99.79,58.97,104.33,263.08,Single-ply,SBD,M
Boys,51.71,5,Zion Jenkins,Tyler,51.17,83.91,54.43,102.06,240.4,Single-ply,SBD,M
Boys,51.71,6,Toney Illickal,Sunnyvale,47.9,77.11,40.82,104.33,222.26,Single-ply,SBD,M
Boys,55.79,1,Gabriel Williams,Cedar Hill,51.89,127.01,68.04,129.27,324.32,Single-ply,SBD,M
Boys,55.79,2,Angel Rico,Kennedale,54.79,104.33,65.77,131.54,301.64,Single-ply,SBD,M
Boys,55.79,3,Jaydon Clemmons,Waxahachie,53.71,102.06,77.11,95.25,274.42,Single-ply,SBD,M
Boys,55.79,4,Phiben McDonald,Terrell,54.52,83.91,61.23,127.01,272.16,Single-ply,SBD,M
Boys,59.87,1,Arturo Jimenez,Ferris,58.79,158.76,88.45,165.56,412.77,Single-ply,SBD,M
Boys,59.87,2,Nick Henderson,Waxahachie,57.52,149.69,72.57,154.22,376.48,Single-ply,SBD,M
Boys,59.87,3,Holden Bailey,North Forney,59.87,129.27,61.23,142.88,333.39,Single-ply,SBD,M
Boys,59.87,4,Morgan Rhew,Sunnyvale,55.97,115.67,68.04,138.35,322.05,Single-ply,SBD,M
Boys,59.87,5,Mason Lambeth,Kaufman,55.97,113.4,58.97,117.93,290.3,Single-ply,SBD,M
Boys,59.87,6,Austin Hunt,Royse City,57.97,92.99,,111.13,204.12,Single-ply,SD,M
Boys,59.87,7,Larry Hampton,Winona,57.61,136.08,61.23,,197.31,Single-ply,SB,M
Boys,67.13,1,Darius Campbell,Red Oak,67.04,172.37,117.93,183.7,474,Single-ply,SBD,M
Boys,67.13,2,Luke Elkins,Corsicana,63.59,179.17,111.13,179.17,469.47,Single-ply,SBD,M
Boys,67.13,3,John Mitchell #2,Kennedale,65.41,170.1,92.99,181.44,444.52,Single-ply,SBD,M
Boys,67.13,4,Victor Ejaisi,North Forney,65.86,165.56,97.52,181.44,444.52,Single-ply,SBD,M
Boys,67.13,5,Ke'Un Mays,Terrell,65.59,151.95,90.72,181.44,424.11,Single-ply,SBD,M
Boys,67.13,6,Jagger Johnson,Forney,66.59,151.95,83.91,185.97,421.84,Single-ply,SBD,M
Boys,67.13,7,Jose Garcia #6,Terrell,66.77,149.69,92.99,165.56,408.23,Single-ply,SBD,M
Boys,67.13,8,Louis Flores,Kennedale,65.23,154.22,74.84,158.76,387.82,Single-ply,SBD,M
Boys,67.13,9,Brock Martin,Argyle,66.68,151.95,74.84,161.03,387.82,Single-ply,SBD,M
Boys,67.13,10,Dakota Gilley,Garland Rowlett,60.06,145.15,74.84,147.42,367.41,Single-ply,SBD,M
Boys,67.13,11,Jakel Davis,Garland Rowlett,62.23,174.63,,142.88,317.51,Single-ply,SD,M
Boys,67.13,12,Terrance Betts,Corsicana,61.05,115.67,54.43,111.13,281.23,Single-ply,SBD,M
Boys,67.13,13,Nathan Ihle,Terrell,66.68,83.91,61.23,111.13,256.28,Single-ply,SBD,M
Boys,74.84,1,Garrett David,Waxahachie,71.03,199.58,106.59,235.87,542.04,Single-ply,SBD,M
Boys,74.84,2,Garret Pringle,Waxahachie,73.66,201.85,115.67,201.85,519.36,Single-ply,SBD,M
Boys,74.84,3,Miracle Broussard,Cedar Hill,73.94,183.7,127.01,201.85,512.56,Single-ply,SBD,M
Boys,74.84,4,Jacori Chandler,Corsicana,74.39,172.37,99.79,215.46,487.61,Single-ply,SBD,M
Boys,74.84,5,Hennon Cooper,Cedar Hill,70.94,179.17,106.59,197.31,483.08,Single-ply,SBD,M
Boys,74.84,6,Parker Taylor,Argyle,74.3,188.24,95.25,197.31,480.81,Single-ply,SBD,M
Boys,74.84,7,Marquise Foreman,Cedar Hill,71.21,179.17,106.59,188.24,474,Single-ply,SBD,M
Boys,74.84,8,Matt Hargis,Rockwall-Heath,74.03,176.9,106.59,190.51,474,Single-ply,SBD,M
Boys,74.84,9,Deandre Gray,Red Oak,73.03,161.03,115.67,190.51,467.2,Single-ply,SBD,M
Boys,74.84,10,Jon Ennin,Sunnyvale,72.12,176.9,90.72,190.51,458.13,Single-ply,SBD,M
Boys,74.84,11,Nick Golden,Argyle,74.21,174.63,77.11,199.58,451.32,Single-ply,SBD,M
Boys,74.84,12,Kyle Oldham,Royse City,74.39,140.61,106.59,201.85,449.06,Single-ply,SBD,M
Boys,74.84,13,Garrett McGuire,Cedar Hill,69.04,163.29,81.65,192.78,437.72,Single-ply,SBD,M
Boys,74.84,14,Courtland Clark,Arlington Seguin,71.76,179.17,83.91,174.63,437.72,Single-ply,SBD,M
Boys,74.84,15,Jarrick Lusk,Corsicana,71.3,172.37,86.18,170.1,428.64,Single-ply,SBD,M
Boys,74.84,16,Ethan Stevens,Rockwall-Heath,71.67,158.76,99.79,163.29,421.84,Single-ply,SBD,M
Boys,74.84,17,Tristen Martin,Rockwall-Heath,68.67,167.83,92.99,154.22,415.04,Single-ply,SBD,M
Boys,74.84,18,Alex Hernandez #14,Ferris,70.94,156.49,95.25,163.29,415.04,Single-ply,SBD,M
Boys,74.84,19,Diego Grajeda,Arlington Seguin,73.26,151.95,97.52,163.29,412.77,Single-ply,SBD,M
Boys,74.84,20,Micheal Givens,Tyler,69.49,136.08,88.45,181.44,405.97,Single-ply,SBD,M
Boys,74.84,21,Hayden Brock,Kennedale,70.22,158.76,74.84,167.83,401.43,Single-ply,SBD,M
Boys,74.84,22,Aaron Marinas,Arlington Seguin,68.49,154.22,81.65,147.42,383.29,Single-ply,SBD,M
Boys,74.84,23,Jacob Winters,Kennedale,73.84,140.61,81.65,158.76,381.02,Single-ply,SBD,M
Boys,74.84,24,Seth Massheder,Terrell,74.75,120.2,83.91,151.95,356.07,Single-ply,SBD,M
Boys,74.84,25,Christian Randle,Arlington Seguin,72.57,136.08,65.77,142.88,344.73,Single-ply,SBD,M
Boys,74.84,26,Hunter McNutt,Winona,71.67,92.99,65.77,145.15,303.91,Single-ply,SBD,M
Boys,74.84,DQ,Jalen Brooks,Arlington Seguin,71.94,,,,,Single-ply,SBD,M
Boys,82.1,1,Gavin Pringle,Waxahachie,78.74,217.72,122.47,222.26,562.45,Single-ply,SBD,M
Boys,82.1,2,Calvin Ribera,North Forney,76.66,208.65,90.72,213.19,512.56,Single-ply,SBD,M
Boys,82.1,3,Denver Jackson,Corsicana,80.65,183.7,113.4,197.31,494.42,Single-ply,SBD,M
Boys,82.1,4,Austin Molina,Royse City,75.02,172.37,124.74,190.51,487.61,Single-ply,SBD,M
Boys,82.1,5,Greg Jackson-McGuire,Cedar Hill,80.83,165.56,108.86,188.24,462.66,Single-ply,SBD,M
Boys,82.1,6,Patrick Chukwenyere,Arlington Seguin,78.47,176.9,102.06,181.44,460.4,Single-ply,SBD,M
Boys,82.1,7,Darian Hartman,Waxahachie,74.93,163.29,97.52,190.51,451.32,Single-ply,SBD,M
Boys,82.1,8,Jamal Cuba,Tyler,76.48,156.49,102.06,188.24,446.79,Single-ply,SBD,M
Boys,82.1,9,Christopher Boone,Red Oak,78.74,161.03,99.79,163.29,424.11,Single-ply,SBD,M
Boys,82.1,10,Alejandro Montenegro,Terrell,81.37,147.42,70.31,147.42,365.14,Single-ply,SBD,M
Boys,82.1,11,Noel Vasquez,Ferris,75.93,120.2,72.57,133.81,326.59,Single-ply,SBD,M
Boys,82.1,12,Aric Phillips,Arlington Seguin,76.93,111.13,65.77,124.74,301.64,Single-ply,SBD,M
Boys,82.1,13,Brendon Norwood,Royse City,81.1,90.72,70.31,138.35,299.37,Single-ply,SBD,M
Boys,82.1,14,Zach Culpepper,Kennedale,76.48,92.99,63.5,127.01,283.5,Single-ply,SBD,M
Boys,82.1,15,Jason Gonzalez,Ferris,79.83,124.74,,158.76,283.5,Single-ply,SD,M
Boys,82.1,16,Joseph Sparks,Arlington Seguin,81.1,151.95,72.57,,224.53,Single-ply,SB,M
Boys,82.1,17,Kenny Frechette,Garland Rowlett,80.47,165.56,,,165.56,Single-ply,S,M
Boys,82.1,18,Terrance Roberts,Arlington Seguin,75.21,,,136.08,136.08,Single-ply,D,M
Boys,89.81,1,Dakota Carpenter,Argyle,87.36,219.99,136.08,229.06,585.13,Single-ply,SBD,M
Boys,89.81,2,Kaegun Williams,Cedar Hill,86.64,215.46,138.35,210.92,564.72,Single-ply,SBD,M
Boys,89.81,3,Daniel Carter,Winona,89.81,188.24,136.08,217.72,542.04,Single-ply,SBD,M
Boys,89.81,4,Matt Castle,Argyle,88.45,204.12,129.27,206.38,539.77,Single-ply,SBD,M
Boys,89.81,5,Caleb Cisneros,Garland Rowlett,88.09,195.04,129.27,190.51,514.83,Single-ply,SBD,M
Boys,89.81,6,Xavier Hall,Cedar Hill,87,183.7,97.52,219.99,501.22,Single-ply,SBD,M
Boys,89.81,7,Daiston Keeton,Tyler,87.63,183.7,111.13,190.51,485.34,Single-ply,SBD,M
Boys,89.81,8,Caleb Smith,Terrell,84.46,181.44,102.06,192.78,476.27,Single-ply,SBD,M
Boys,89.81,9,Elliseo Ortiz,Red Oak,88.9,183.7,142.88,142.88,469.47,Single-ply,SBD,M
Boys,89.81,10,Cole Anthony,Forney,84.19,158.76,117.93,176.9,453.59,Single-ply,SBD,M
Boys,89.81,11,Branden Moats,Garland Rowlett,82.28,161.03,92.99,183.7,437.72,Single-ply,SBD,M
Boys,89.81,12,Brandon Kiernan,Kennedale,89.27,129.27,115.67,163.29,408.23,Single-ply,SBD,M
Boys,89.81,13,Matthew Gentry,Royse City,88.09,158.76,77.11,156.49,392.36,Single-ply,SBD,M
Boys,89.81,14,Kenneth Randall,Kaufman,86,129.27,81.65,174.63,385.55,Single-ply,SBD,M
Boys,89.81,15,Desmond Mendoza,Kennedale,84.01,149.69,79.38,147.42,376.48,Single-ply,SBD,M
Boys,89.81,16,Kyler Martinez,Ferris,87.09,147.42,74.84,151.95,374.21,Single-ply,SBD,M
Boys,89.81,17,Shane Flanagan,Red Oak,85.09,129.27,88.45,151.95,369.68,Single-ply,SBD,M
Boys,89.81,18,Justin Holifield,Ferris,85.73,133.81,83.91,151.95,369.68,Single-ply,SBD,M
Boys,89.81,19,Dylan Miranda,Kennedale,86.82,140.61,70.31,145.15,356.07,Single-ply,SBD,M
Boys,89.81,20,Joshua Rank,Ferris,85.55,129.27,72.57,142.88,344.73,Single-ply,SBD,M
Boys,89.81,21,Nathan Shirley,Royse City,85.46,102.06,61.23,106.59,269.89,Single-ply,SBD,M
Boys,89.81,22,Martin Flores,North Forney,88.18,,92.99,145.15,238.14,Single-ply,BD,M
Boys,99.79,1,Caleb High,Waxahachie,93.53,249.48,145.15,244.94,639.57,Single-ply,SBD,M
Boys,99.79,2,Nick Stewart,Waxahachie,95.16,235.87,156.49,231.33,623.69,Single-ply,SBD,M
Boys,99.79,3,Colton Hall,Kennedale,99.16,235.87,140.61,238.14,614.62,Single-ply,SBD,M
Boys,99.79,4,Brenden Barker,Garland Rowlett,97.89,201.85,129.27,215.46,546.58,Single-ply,SBD,M
Boys,99.79,5,Caleb Johnson,Corsicana,91.35,197.31,115.67,219.99,532.97,Single-ply,SBD,M
Boys,99.79,6,Ricardo Pena,Kennedale,92.17,217.72,124.74,188.24,530.7,Single-ply,SBD,M
Boys,99.79,7,Garret McCord,Red Oak,98.43,183.7,147.42,183.7,514.83,Single-ply,SBD,M
Boys,99.79,8,Dillon Hampton,Arlington Seguin,91.63,201.85,95.25,185.97,483.08,Single-ply,SBD,M
Boys,99.79,9,William Landers,Kennedale,93.89,183.7,122.47,176.9,483.08,Single-ply,SBD,M
Boys,99.79,10,Jason Molina,Sunnyvale,91.44,176.9,97.52,190.51,464.93,Single-ply,SBD,M
Boys,99.79,11,Brock Houston,Red Oak,97.07,170.1,104.33,183.7,458.13,Single-ply,SBD,M
Boys,99.79,12,Melvin Martin,Corsicana,95.89,170.1,92.99,188.24,451.32,Single-ply,SBD,M
Boys,99.79,13,Aaron Magallanez,Garland Rowlett,96.52,181.44,92.99,170.1,444.52,Single-ply,SBD,M
Boys,99.79,14,Keandre Paxton,Arlington Seguin,89.9,181.44,77.11,156.49,415.04,Single-ply,SBD,M
Boys,99.79,15,Jesse Diaz,Kennedale,89.99,122.47,74.84,158.76,356.07,Single-ply,SBD,M
Boys,99.79,16,Tim Vickery,Royse City,92.53,86.18,74.84,133.81,294.84,Single-ply,SBD,M
Boys,109.77,1,Baron Browning,Kennedale,102.78,244.94,142.88,285.76,673.58,Single-ply,SBD,M
Boys,109.77,2,Adedoyin Falana,Cedar Hill,102.51,226.8,138.35,233.6,598.74,Single-ply,SBD,M
Boys,109.77,3,Anthoney Perez,Waxahachie,101.51,215.46,151.95,229.06,596.47,Single-ply,SBD,M
Boys,109.77,4,Matt Naugle,Kennedale,105.51,242.67,127.01,226.8,596.47,Single-ply,SBD,M
Boys,109.77,5,Justin Wheeler,Arlington Seguin,101.97,226.8,133.81,201.85,562.45,Single-ply,SBD,M
Boys,109.77,6,Amir Sa'id,Cedar Hill,106.41,219.99,113.4,222.26,555.65,Single-ply,SBD,M
Boys,109.77,7,Bronson Lincks,Red Oak,100.33,217.72,129.27,199.58,546.58,Single-ply,SBD,M
Boys,109.77,8,JP Sales,Sunnyvale,107.59,235.87,102.06,208.65,546.58,Single-ply,SBD,M
Boys,109.77,9,Aaron Williams,Kennedale,107.05,204.12,136.08,204.12,544.31,Single-ply,SBD,M
Boys,109.77,10,Donavan Evans,Red Oak,106.59,197.31,133.81,188.24,519.36,Single-ply,SBD,M
Boys,109.77,11,Corey Mullican,Kaufman,107.23,204.12,104.33,199.58,508.02,Single-ply,SBD,M
Boys,109.77,12,Isiah Reyes,Ferris,109.68,192.78,136.08,179.17,508.02,Single-ply,SBD,M
Boys,109.77,13,Adam Friesen,North Forney,105.32,183.7,92.99,213.19,489.88,Single-ply,SBD,M
Boys,109.77,14,Willie Thomas,North Forney,106.19,181.44,108.86,195.04,485.34,Single-ply,SBD,M
Boys,109.77,15,David Partida,Rockwall-Heath,103.69,174.63,122.47,185.97,483.08,Single-ply,SBD,M
Boys,109.77,16,Dillion Davis,Sunnyvale,106.14,161.03,117.93,185.97,464.93,Single-ply,SBD,M
Boys,109.77,17,Brian Parish,Arlington Seguin,109.77,165.56,90.72,181.44,437.72,Single-ply,SBD,M
Boys,109.77,18,Killian Carper,Kennedale,104.24,167.83,92.99,172.37,433.18,Single-ply,SBD,M
Boys,109.77,19,Arnulfo Santibanez,Arlington Seguin,107.95,163.29,81.65,172.37,417.3,Single-ply,SBD,M
Boys,109.77,20,Brandon Villalpando,Kaufman,108.5,161.03,83.91,161.03,405.97,Single-ply,SBD,M
Boys,109.77,21,Jesus Munoz,Terrell,101.79,145.15,83.91,129.27,358.34,Single-ply,SBD,M
Boys,109.77,22,Leo Figueroa,Ferris,104.05,142.88,83.91,129.27,356.07,Single-ply,SBD,M
Boys,124.74,1,Ja'Coby Paul,Terrell,114.94,249.48,176.9,235.87,662.24,Single-ply,SBD,M
Boys,124.74,2,Devin Beamon,North Forney,124.74,233.6,129.27,226.8,589.67,Single-ply,SBD,M
Boys,124.74,3,Parker Cupp,Cedar Hill,124.65,224.53,127.01,222.26,573.79,Single-ply,SBD,M
Boys,124.74,4,TreJon Blake,Tyler,116.75,233.6,117.93,219.99,571.53,Single-ply,SBD,M
Boys,124.74,5,Johnny Zielinski,Kennedale,121.93,226.8,129.27,197.31,553.38,Single-ply,SBD,M
Boys,124.74,6,Blake Culver,Garland Rowlett,123.38,226.8,133.81,192.78,553.38,Single-ply,SBD,M
Boys,124.74,7,DeAunte Thomas,Corsicana,112.04,215.46,133.81,192.78,542.04,Single-ply,SBD,M
Boys,124.74,8,Nathan Manuere,Corsicana,114.76,188.24,133.81,188.24,510.29,Single-ply,SBD,M
Boys,124.74,9,Bryce Hege,Argyle,117.39,201.85,102.06,206.38,510.29,Single-ply,SBD,M
Boys,124.74,10,Ryan Collinsworth,Red Oak,119.75,161.03,131.54,204.12,496.68,Single-ply,SBD,M
Boys,124.74,11,Samuel Meneses,Tyler,109.86,197.31,115.67,181.44,494.42,Single-ply,SBD,M
Boys,124.74,12,Tra Minter,Tyler,114.31,188.24,122.47,183.7,494.42,Single-ply,SBD,M
Boys,124.74,13,Jaden Webb,Royse City,114.12,181.44,104.33,192.78,478.54,Single-ply,SBD,M
Boys,124.74,14,Chris Serwanga,Kennedale,117.48,199.58,99.79,170.1,469.47,Single-ply,SBD,M
Boys,124.74,15,Alex Cash,Winona,124.65,183.7,97.52,174.63,455.86,Single-ply,SBD,M
Boys,124.74,16,Christian Pittman,Arlington Seguin,113.85,204.12,83.91,161.03,449.06,Single-ply,SBD,M
Boys,124.74,17,Jobin Chirayil,Sunnyvale,119.39,151.95,108.86,163.29,424.11,Single-ply,SBD,M
Boys,124.74,18,John Taylor #6,North Forney,113.4,145.15,72.57,154.22,371.95,Single-ply,SBD,M
Boys,124.74+,1,Wade Cookston,Sunnyvale,140.52,299.37,195.04,272.16,766.57,Single-ply,SBD,M
Boys,124.74+,2,Norris Floyd,North Forney,144.24,294.84,154.22,278.96,728.02,Single-ply,SBD,M
Boys,124.74+,3,Eric Roberts,Terrell,139.62,294.84,181.44,238.14,714.41,Single-ply,SBD,M
Boys,124.74+,4,Clifton Coffey,Cedar Hill,167.83,278.96,172.37,254.01,705.34,Single-ply,SBD,M
Boys,124.74+,5,Andrew Flannigan,Kennedale,130.09,285.76,158.76,204.12,648.64,Single-ply,SBD,M
Boys,124.74+,6,Kolby Harris,Tyler,150.59,263.08,154.22,226.8,644.1,Single-ply,SBD,M
Boys,124.74+,7,Alfredo Cervantez,Royse City,144.79,244.94,147.42,222.26,614.62,Single-ply,SBD,M
Boys,124.74+,8,Adam Dyer,Argyle,128.37,240.4,124.74,247.21,612.35,Single-ply,SBD,M
Boys,124.74+,9,Jiovanny Rubio,Sunnyvale,136.8,226.8,129.27,229.06,585.13,Single-ply,SBD,M
Boys,124.74+,10,Adrian Harris,Tyler,130.63,201.85,136.08,210.92,548.85,Single-ply,SBD,M
Boys,124.74+,11,Deontae Martin,Corsicana,135.44,215.46,127.01,206.38,548.85,Single-ply,SBD,M
Boys,124.74+,12,Timothy Akinyode,Arlington Seguin,127.01,233.6,90.72,208.65,532.97,Single-ply,SBD,M
Boys,124.74+,13,Preston Burke,Sunnyvale,137.44,188.24,122.47,213.19,523.9,Single-ply,SBD,M
Boys,124.74+,14,Caleb Carlile,Waxahachie,134.81,199.58,120.2,201.85,521.63,Single-ply,SBD,M
Boys,124.74+,15,Julio Fontano,Corsicana,134.99,219.99,117.93,176.9,514.83,Single-ply,SBD,M
Boys,124.74+,16,Ray Yates,North Forney,130.36,215.46,102.06,183.7,501.22,Single-ply,SBD,M
Boys,124.74+,17,Juan Gomez,Ferris,137.44,249.48,90.72,149.69,489.88,Single-ply,SBD,M
Boys,124.74+,18,Alex Bridges,Tyler,134.54,165.56,102.06,183.7,451.32,Single-ply,SBD,M
Boys,124.74+,19,Cameron Rogers,North Forney,144.7,183.7,81.65,183.7,449.06,Single-ply,SBD,M
Boys,124.74+,20,Maydrian Lowe,Red Oak,127.28,192.78,102.06,147.42,442.25,Single-ply,SBD,M
Boys,124.74+,21,Austin Frye,Royse City,145.6,226.8,136.08,,362.87,Single-ply,SB,M
Boys,124.74+,22,Emmanuel Ojo,Arlington Seguin,128.46,136.08,70.31,147.42,353.8,Single-ply,SBD,M
Boys,124.74+,23,Brandon Henson,Winona,131.09,217.72,,,217.72,Single-ply,S,M
Boys,124.74+,DQ,Ty Nick,Winona,127.91,,,,,Single-ply,SBD,M
Boys,,NS,Willie Lacy,Winona,,,,,,Single-ply,SBD,M
Boys,,NS,Zach Bradford,Winona,,,,,,Single-ply,SBD,M
Boys,,NS,Christian Connell,Ferris,,,,,,Single-ply,SBD,M
Boys,,NS,Jhovvanny Sanjuan,Kaufman,,,,,,Single-ply,SBD,M
Boys,,NS,Drew Coleman,Forney,,,,,,Single-ply,SBD,M
Boys,,NS,Cooper Gilliland,Royse City,,,,,,Single-ply,SBD,M
Boys,,NS,Brett Martinez,Royse City,,,,,,Single-ply,SBD,M
