Division,WeightClassKg,Place,Name,Team,BodyweightKg,Best3SquatKg,Best3BenchKg,Best3DeadliftKg,TotalKg,Equipment,Event,Sex
Boys,51.71,1,Juan Trejo,Friona,50.62,163.29,74.84,154.22,392.36,Single-ply,SBD,M
Boys,51.71,2,Nathan Flores,Friona,49.44,124.74,56.7,133.81,315.25,Single-ply,SBD,M
Boys,51.71,3,Ezaiah Martinez,Dimmitt,51.71,106.59,61.23,117.93,285.76,Single-ply,SBD,M
Boys,51.71,4,Alejandro Diaz,Hart,51.71,106.59,47.63,127.01,281.23,Single-ply,SBD,M
Boys,51.71,5,Payton Rhodes,Hart,51.71,74.84,58.97,108.86,242.67,Single-ply,SBD,M
Boys,59.87,1,Mario Hernandez,Friona,59.87,172.37,86.18,172.37,430.91,Single-ply,SBD,M
Boys,59.87,2,Marin Santiago,Friona,59.51,151.95,79.38,165.56,396.89,Single-ply,SBD,M
Boys,59.87,3,Juan Oltivero,Dimmitt,59.87,117.93,70.31,163.29,351.53,Single-ply,SBD,M
Boys,59.87,4,Riley Brayden,Canyon Randall,59.42,124.74,72.57,142.88,340.19,Single-ply,SBD,M
Boys,59.87,5,Jacob Palomino,Lockney,59.78,124.74,63.5,136.08,324.32,Single-ply,SBD,M
Boys,59.87,6,Aaron Aguilar,Lamesa,59.87,113.4,61.23,136.08,310.71,Single-ply,SBD,M
Boys,67.13,1,Ricky Cuellar,Lockney,66.86,179.17,74.84,183.7,437.72,Single-ply,SBD,M
Boys,67.13,2,Bo Franklin,Plains,67.13,170.1,90.72,167.83,428.64,Single-ply,SBD,M
Boys,67.13,3,Juan Castillo,Tulia,65.95,163.29,102.06,156.49,421.84,Single-ply,SBD,M
Boys,67.13,4,Walker Voyles,Vega,67.13,161.03,74.84,161.03,396.89,Single-ply,SBD,M
Boys,67.13,5,Jeremiah Diaz,Friona,65.59,156.49,77.11,158.76,392.36,Single-ply,SBD,M
Boys,67.13,6,Wall John,Dimmitt,67.13,117.93,83.91,158.76,360.61,Single-ply,SBD,M
Boys,67.13,7,JR Trevino,Lamesa,62.69,120.2,58.97,136.08,315.25,Single-ply,SBD,M
Boys,67.13,NS,Jeb Skiles,Vega,,,,,,Single-ply,SBD,M
Boys,67.13,NS,Jesus Rubio,Snyder,,,,,,Single-ply,SBD,M
Boys,67.13,DQ,Miguel Vasquez,Farwell,65.05,,,,,Single-ply,SBD,M
Boys,74.84,1,Sebastian Perez,Vega,72.94,188.24,95.25,197.31,480.81,Single-ply,SBD,M
Boys,74.84,2,Arnie Martinez,Floydada,71.3,172.37,104.33,199.58,476.27,Single-ply,SBD,M
Boys,74.84,3,Shawn Marquez,Lockney,74.84,165.56,104.33,170.1,439.98,Single-ply,SBD,M
Boys,74.84,4,Abraham Navarro,Dimmitt,73.39,133.81,104.33,124.74,362.87,Single-ply,SBD,M
Boys,74.84,5,Tristian Nava,Lamesa,74.84,102.06,65.77,147.42,315.25,Single-ply,SBD,M
Boys,74.84,NS,Rogellio Palacios,Friona,,,,,,Single-ply,SBD,M
Boys,74.84,DQ,Silas Urrutia,Lockney,73.48,,,,,Single-ply,SBD,M
Boys,82.1,1,Keanu Villarreal,Lockney,81.65,185.97,127.01,181.44,494.42,Single-ply,SBD,M
Boys,82.1,2,Julio Acevedo,Roby,78.83,190.51,95.25,192.78,478.54,Single-ply,SBD,M
Boys,82.1,3,Cameron Enriquez,Dimmitt,79.83,181.44,106.59,188.24,476.27,Single-ply,SBD,M
Boys,82.1,4,Jonathon Hernandez,Friona,82.1,154.22,108.86,176.9,439.98,Single-ply,SBD,M
Boys,82.1,5,Chris Rodriquez,Lamesa,77.11,145.15,102.06,185.97,433.18,Single-ply,SBD,M
Boys,82.1,6,Ricardo Espinosa,Dimmitt,80.29,142.88,88.45,170.1,401.43,Single-ply,SBD,M
Boys,89.81,1,Chris Martinez,Dimmitt,87.23,204.12,108.86,201.85,514.83,Single-ply,SBD,M
Boys,89.81,2,Matthew Hartman,Plains,84.37,210.92,113.4,176.9,501.22,Single-ply,SBD,M
Boys,89.81,3,Cardell Wickware,Floydada,88.54,174.63,133.81,174.63,483.08,Single-ply,SBD,M
Boys,89.81,4,Shawn Howell,Roby,88.9,197.31,92.99,183.7,474,Single-ply,SBD,M
Boys,89.81,5,Andrew Santiago,Canyon Randall,86.64,167.83,115.67,176.9,460.4,Single-ply,SBD,M
Boys,89.81,6,Clayton Culp,Lamesa,86,170.1,97.52,183.7,451.32,Single-ply,SBD,M
Boys,89.81,7,Nick Flores,Lamesa,89.81,156.49,99.79,158.76,415.04,Single-ply,SBD,M
Boys,89.81,8,Andrew Cigarroa,Friona,89.18,158.76,83.91,147.42,390.09,Single-ply,SBD,M
Boys,89.81,9,Caleb Frausto,Canyon Randall,87.54,197.31,149.69,,347,Single-ply,SB,M
Boys,89.81,NS,Diego Azua,Lockney,,,,,,Single-ply,SB,M
Boys,89.81,NS,Raul Rios,Snyder,,,,,,Single-ply,SB,M
Boys,99.79,1,Juan Barron,Tulia,99.25,226.8,129.27,204.12,560.19,Single-ply,SBD,M
Boys,99.79,2,Jesus Jaramillo,Friona,97.52,210.92,117.93,213.19,542.04,Single-ply,SBD,M
Boys,99.79,3,Ariel Jaramillo,Friona,97.7,204.12,122.47,206.38,532.97,Single-ply,SBD,M
Boys,99.79,4,Francisco Cabrales,Dimmitt,96.34,199.58,99.79,204.12,503.49,Single-ply,SBD,M
Boys,99.79,6,Aaron Marmelejo,Dimmitt,99.79,181.44,124.74,170.1,476.27,Single-ply,SBD,M
Boys,99.79,7,Ayden Hayes,Dimmitt,94.44,170.1,106.59,176.9,453.59,Single-ply,SBD,M
Boys,99.79,8,Jonathon Rodriquez,Lamesa,93.62,156.49,102.06,163.29,421.84,Single-ply,SBD,M
Boys,99.79,9,John Acevedo,Roby,96.62,165.56,65.77,140.61,371.95,Single-ply,SBD,M
Boys,99.79,NS,Samuel Ramirez,Lamesa,,,,,,Single-ply,SBD,M
Boys,99.79,NS,Alex Montez #1,Friona,,,,,,Single-ply,SBD,M
Boys,99.79,DQ,Shelby Sanderson,Canyon Randall,97.34,,,,,Single-ply,SBD,M
Boys,109.77,1,Caleb Smith,Roby,107.23,231.33,120.2,210.92,562.45,Single-ply,SBD,M
Boys,109.77,2,Steven Bazan,Lockney,108.82,231.33,124.74,197.31,553.38,Single-ply,SBD,M
Boys,109.77,3,Andrew Sanchez,Lockney,106.68,181.44,113.4,192.78,487.61,Single-ply,SBD,M
Boys,109.77,4,Charles Aynes,Lamesa,109.23,183.7,117.93,183.7,485.34,Single-ply,SBD,M
Boys,109.77,5,Miguel Laura,Lockney,99.97,195.04,99.79,185.97,480.81,Single-ply,SBD,M
Boys,109.77,5,Ian Moreno,Roby,102.87,158.76,88.45,158.76,405.97,Single-ply,SBD,M
Boys,109.77,6,Carson Brown,Lamesa,107.05,106.59,70.31,136.08,312.98,Single-ply,SBD,M
Boys,109.77,NS,Juan Lara,Friona,,,,,,Single-ply,SBD,M
Boys,124.74,1,Ivien Gonzales,Lamesa,123.65,238.14,156.49,219.99,614.62,Single-ply,SBD,M
Boys,124.74,2,Javier Olvera,Floydada,121.02,217.72,147.42,204.12,569.26,Single-ply,SBD,M
Boys,124.74,DQ,Dillon Laire,Miami,113.94,183.7,117.93,151.95,,Single-ply,SBD,M
