Place,Name,Sex,Division,WeightClassKg,BirthYear,Team,BodyweightKg,Squat1Kg,Squat2Kg,Squat3Kg,Best3SquatKg,Bench1Kg,Bench2Kg,Bench3Kg,Best3BenchKg,Deadlift1Kg,Deadlift2Kg,Deadlift3Kg,Best3DeadliftKg,TotalKg,Event,Equipment,BirthDate
1,Julia Jurczyk,F,Juniors Under 16,47,2005,LKS Nadwiślanin Kwidzyn,46.85,80,-85.5,85.5,85.5,45.5,47.5,-50,47.5,75,85,90,90,223,SBD,Raw,
1,Wiktoria Cichocka,F,Juniors Under 16,52,2004,VIP GYM Grajewo,50.6,105,110,-115,110,55,57.5,60,60,110,115,120,120,290,SBD,Raw,
2,Natalia Bogdziewicz,F,Juniors Under 16,52,2004,Stowarzyszenie Centrum Formy Dąbrowa Górnicza,52,95,100,-105,100,62.5,-65,-65,62.5,110,117.5,125.5,125.5,288,SBD,Raw,
1,Weronika Rejek,F,Juniors Under 16,57,2005,Stowarzyszenie Sportatut Krobia,56.5,70,80,90,90,-30,30,32.5,32.5,80,90,95,95,217.5,SBD,Raw,
G,Emilia Gryczan,F,Juniors Under 16,52,2005,VIP GYM Grajewo,51.2,60,70,80,80,37.5,40,42.5,42.5,70,80,-90,80,202.5,SBD,Raw,
1,Kaja Stabulewska,F,Juniors Under 16,63,2004,Stowarzyszenie Centrum Formy Dąbrowa Górnicza,62.1,120,127.5,132.5,132.5,85,-90,91.5,91.5,-145,145,-152.5,145,369,SBD,Raw,
2,Iza Kania,F,Juniors Under 16,63,2004,KSSSiKW Wiking Starachowice,62.3,90,97.5,-102.5,97.5,37.5,40,-42.5,40,112.5,-120,-120,112.5,250,SBD,Raw,
3,Kamila Nyderek,F,Juniors Under 16,63,2004,UKS Pover Kuźnik Chorzów,57.1,60,-65,-65,60,35,42.5,-45,42.5,85,90,97.5,97.5,200,SBD,Raw,
1,Julia Jóźwiakowska,F,Juniors Under 16,72,2005,KS Team Wrocław,67.4,100,107.5,112.5,112.5,-50,52.5,57.5,57.5,-120,120,130,130,300,SBD,Raw,
2,Magdalena Tomczak,F,Juniors Under 16,72,2004,Stowarzyszenie Sportatut Krobia,71.5,100,105,110,110,40,42.5,47.5,47.5,-110,115,120,120,277.5,SBD,Raw,
3,Justyna Pietrykowska,F,Juniors Under 16,72,2005,UKS Eugen Knurów,67.1,70,80,-85,80,55,60.5,62.5,62.5,-85,90,97.5,97.5,240,SBD,Raw,
4,Karina Pieśniak,F,Juniors Under 16,72,2004,UKS Sokół Krzywiń,69,90,-97.5,-97.5,90,37.5,-40,40,40,100,105,-112.5,105,235,SBD,Raw,
1,Julia Dziwosz,F,Juniors Under 16,84,2004,KSSSiKW Wiking Starachowice,76.9,90,97.5,102.5,102.5,55,57.5,60,60,97.5,105,110,110,272.5,SBD,Raw,
2,Rozalia Glembin,F,Juniors Under 16,84,2004,PMKS Rybak Władysławowo,82.6,80,85,90,90,-50,-50,50,50,85,90,95,95,235,SBD,Raw,
G,Martyna Grenda,F,Juniors Under 18,52,2003,KS Harem Koszalin,48.9,70,-75,-80,70,35,-40,-40,35,95,-100,100,100,205,SBD,Raw,
1,Aniela Lis,F,Juniors Under 18,52,2002,BKL Bełchatów,51.4,87.5,95,-100,95,50,-55,-55,50,90,100,110,110,255,SBD,Raw,
2,Wiktoria Henkelman,F,Juniors Under 18,52,2003,UKS Eugen Knurów,51.6,-80,80,85,85,40,45,-50,45,95,105,-107.5,105,235,SBD,Raw,
3,Weronika Kiersikowska,F,Juniors Under 18,52,2002,LKS Grom Przasnysz,51.7,-60,70,75,75,35,42.5,-45,42.5,60,-75,75,75,192.5,SBD,Raw,
1,Adrianna Borowczyk,F,Juniors Under 18,57,2003,Stowarzyszenie Sportatut Krobia,56,110,115,117.5,117.5,52.5,55,-57.5,55,105,110,-115,110,282.5,SBD,Raw,
2,Patrycja Czekańska,F,Juniors Under 18,57,2002,TKKF Azory Kraków,55,90,-95,95,95,-55,-55,55,55,105,110,115,115,265,SBD,Raw,
3,Monika Skowrońska,F,Juniors Under 18,57,2002,Stowarzyszenie Centrum Formy Dąbrowa Górnicza,55.5,80,-87.5,90,90,45,-47.5,-47.5,45,100,107.5,112.5,112.5,247.5,SBD,Raw,
4,Zuzanna Milewska,F,Juniors Under 18,57,2002,VIP GYM Grajewo,54.8,60,65,-70,65,32.5,35,-37.5,35,75,82.5,85,85,185,SBD,Raw,
NS,Oliwia Kij,F,Juniors Under 18,57,2002,Stowarzyszenie Centrum Formy Dąbrowa Górnicza,,,,,,,,,,,,,,,SBD,Raw,
1,Dominika Filipowska,F,Juniors Under 18,63,2002,Stowarzyszenie Centrum Formy Dąbrowa Górnicza,62.6,-125,125,127.5,127.5,60,65,67.5,67.5,140,-145,145,145,340,SBD,Raw,
2,Martyna Piątkowska,F,Juniors Under 18,63,2003,KS Team Wrocław,62.3,-125,125,130,130,50,55,-60,55,-140,145,150,150,335,SBD,Raw,
3,Patrycja Buczyńska,F,Juniors Under 18,63,2002,KS Team Wrocław,61.9,117.5,125,-130,125,65,70,72.5,72.5,127.5,135,-140,135,332.5,SBD,Raw,
4,Julia Bilicka,F,Juniors Under 18,63,2002,Stowarzyszenie Centrum Formy Dąbrowa Górnicza,62.5,100,105,-110,105,60,-62.5,-62.5,60,130,-137.5,137.5,137.5,302.5,SBD,Raw,
5,Klaudia Gulka,F,Juniors Under 18,63,2002,TKKF Śródmieście Legnica,60.5,85,95,-100,95,47.5,52.5,-55,52.5,115,125,-130,125,272.5,SBD,Raw,
6,Weronika Iwan,F,Juniors Under 18,63,2003,Stowarzyszenie Centrum Formy Dąbrowa Górnicza,61.9,70,75,80,80,40,-42.5,-42.5,40,90,95,-100,95,215,SBD,Raw,
1,Wiktoria Sieczka,F,Juniors Under 18,72,2003,KSSSiKW Wiking Starachowice,69.8,120,130,140,140,45,50,-55,50,120,130,135,135,325,SBD,Raw,
2,Maria Poniatowska,F,Juniors Under 18,72,2003,PMKS Rybak Władysławowo,70,107.5,115,120,120,60,65,-67.5,65,107.5,112.5,117.5,117.5,302.5,SBD,Raw,
1,Julia Strzelec,F,Juniors Under 18,84,2002,LKS Nadwiślanin Kwidzyn,81.9,140.5,-150,155,155,55,60,-62.5,60,145,152.5,-160.5,152.5,367.5,SBD,Raw,
2,Izabella Januszewska,F,Juniors Under 18,84,2002,LKS Nadwiślanin Kwidzyn,76.7,-110,110,115,115,65,-70,70,70,120,130,135,135,320,SBD,Raw,
1,Andżelika Płótnicka,F,Juniors Under 18,84+,2002,UKS Mechanik Sierpc,103.3,160,167.5,175,175,60,65,-70,65,160,170,181,181,421,SBD,Raw,
2,Klaudia Murza,F,Juniors Under 18,84+,2002,KS Kobra Kościan,96.4,-160,170,-180,170,65,70,72.5,72.5,145,150,155,155,397.5,SBD,Raw,
3,Kinga Świderska,F,Juniors Under 18,84+,2002,LKS Nadwiślanin Kwidzyn,103.3,135,140,150,150,75.5,-80,-80,75.5,145,160,-172.5,160,385.5,SBD,Raw,
1,Jakub Bońkowski,M,Juniors Under 16,53,2004,LKS Grom Przasnysz,52.4,120,125,130,130,60,65,-67.5,65,150,-160,162.5,162.5,357.5,SBD,Raw,
2,Hubert Bońkowski,M,Juniors Under 16,53,2005,LKS Grom Przasnysz,51.7,60,70,-80,70,52.5,55,60,60,80,90,102.5,102.5,232.5,SBD,Raw,
DQ,Eryk Górka,M,Juniors Under 16,53,2006,TKKF Azory Kraków,,,,,,,,,,,,,,,SBD,Raw,
1,Szymon Laskowski,M,Juniors Under 16,59,2005,Stowarzyszenie Masakra Ełk,55.1,40,60,-70,60,30,40,42.5,42.5,40,65,-82.5,65,167.5,SBD,Raw,
1,Krzysztof Perlik,M,Juniors Under 16,66,2004,KS Team Wrocław,65.8,125,132.5,-137.5,132.5,95,-100,-100,95,140,147.5,-152.5,147.5,375,SBD,Raw,
2,Kewin Patelczyk,M,Juniors Under 16,66,2004,KS Team Wrocław,65.1,125,132.5,-137.5,132.5,80,85,87.5,87.5,125,132.5,137.5,137.5,357.5,SBD,Raw,
3,Wiktor Tarnowski,M,Juniors Under 16,66,2004,SSW Skierniewice,64.7,120,130,135,135,60,62.5,-65,62.5,135,145,155,155,352.5,SBD,Raw,
1,Aleksander Elwart,M,Juniors Under 16,74,2004,Stowarzyszenie Centrum Formy Dąbrowa Górnicza,73.6,160,170,175,175,107.5,115,-117.5,115,200,208,-215,208,498,SBD,Raw,
2,Mateusz Zawisza,M,Juniors Under 16,74,2005,KS Wisła Puławy,70.2,150,165,175,175,55,60,65,65,135,145,155,155,395,SBD,Raw,
1,Gabriel Ryś,M,Juniors Under 16,83,2004,KSSSiKW Wiking Starachowice,81.6,155,162.5,172.5,172.5,107.5,-110,112.5,112.5,180,192.5,200,200,485,SBD,Raw,
1,Filip Pawlak,M,Juniors Under 16,93,2004,KS Team Wrocław,92.6,165,175,182.5,182.5,110,-112.5,117.5,117.5,185,200,215,215,515,SBD,Raw,
2,Maks Golec,M,Juniors Under 16,93,2004,KSSSiKW Wiking Starachowice,91.1,167.5,175,185,185,90,100,-107.5,100,200,212.5,-230,212.5,497.5,SBD,Raw,
3,Mateusz Poniatowski,M,Juniors Under 16,93,2005,PMKS Rybak Władysławowo,88,165,175,182.5,182.5,110,-115,-115,110,170,180,-185,180,472.5,SBD,Raw,
4,Filip Dracewicz,M,Juniors Under 16,93,2004,Stowarzyszenie Masakra Ełk,92,155,-160,-160,155,-90,90,95,95,-167.5,167.5,-170,167.5,417.5,SBD,Raw,
1,Michał Szymczak,M,Juniors Under 16,105,2004,GKS Kraska Jasieniec,96.9,165,185,200,200,110,120,-125,120,180,200,210,210,530,SBD,Raw,
2,Maciej Sławski,M,Juniors Under 16,105,2005,LKS Nadwiślanin Kwidzyn,94.2,130,140,150,150,70,80,85,85,160,180,182.5,182.5,417.5,SBD,Raw,
3,Kacper Karwacki,M,Juniors Under 16,105,2004,KSSSiKW Wiking Starachowice,95.2,-130,130,145,145,82.5,87.5,92.5,92.5,150,160,180,180,417.5,SBD,Raw,
1,Szymon Kaniewski,M,Juniors Under 16,120,2004,KS Jarot Team,110.1,-150,-160,160,160,105,110,115,115,160,175,190,190,465,SBD,Raw,
2,Jan Tuszyński,M,Juniors Under 16,120,2006,GKS Kraska Jasieniec,108.6,155,165,-175,165,80,-90,-90,80,140,152.5,157.5,157.5,402.5,SBD,Raw,
3,Dawid Pietrykowski,M,Juniors Under 16,120,2004,UKS Eugen Knurów,115.3,-120,120,130,130,122.5,-127.5,127.5,127.5,135,145,-155,145,402.5,SBD,Raw,
DQ,Dominik Słoma,M,Juniors Under 16,120,2004,SSW Skierniewice,105.2,160,175,185,185,-70,-70,-70,,180,190,200,200,,SBD,Raw,
DQ,Oskar Kołnacki,M,Juniors Under 16,120+,2004,MOKSiR Jastarnia,135.4,-145,-145,-145,,90,100,-102.5,100,145,160,175,175,,SBD,Raw,
1,Karol Kruszyński,M,Juniors Under 18,59,2002,LKS Nadwiślanin Kwidzyn,58.4,150,155,160,160,80,85,87.5,87.5,180,200,-212.5,200,447.5,SBD,Raw,
2,Szymon Kwiecień,M,Juniors Under 18,59,2003,KSSSiKW Wiking Starachowice,57.9,100,-110,110,110,80,-85,-85,80,115,-125,130,130,320,SBD,Raw,
3,Mateusz Fiut,M,Juniors Under 18,59,2002,KS Wisła Puławy,54.6,105,115,120,120,55,-65,-65,55,120,127.5,-147.5,127.5,302.5,SBD,Raw,
1,Przemek Derlatka,M,Juniors Under 18,66,2002,KSSSiKW Wiking Starachowice,65.9,145,-155,,145,80,90,95,95,155,170,192.5,192.5,432.5,SBD,Raw,
2,Karol Wawrzaszek,M,Juniors Under 18,66,2003,LUKS Zieloni Łańcut,64.5,-90,90,100,100,90,100,-105,100,100,125,140,140,340,SBD,Raw,
NS,Konrad Nowakowski,M,Juniors Under 18,66,2003,KSSSiKW Wiking Starachowice,,,,,,,,,,,,,,,SBD,Raw,
1,Bartosz Bebło,M,Juniors Under 18,74,2002,KS Studio Mocy Kolbuszowa,73.12,200,206,-225,206,107.5,112.5,-120,112.5,210,-225,-225,210,528.5,SBD,Raw,
2,Łukasz Derlatka,M,Juniors Under 18,74,2002,KSSSiKW Wiking Starachowice,72.89,165,175,-180,175,75,82.5,87.5,87.5,180,-190,200,200,462.5,SBD,Raw,
3,Bartosz Danielewicz,M,Juniors Under 18,74,2002,TKKF Azory Kraków,71.4,142.5,147.5,-152.5,147.5,107.5,112.5,-115,112.5,157.5,-162.5,162.5,162.5,422.5,SBD,Raw,
4,Filip Czyżowski,M,Juniors Under 18,74,2003,TKKF Azory Kraków,71.6,140,145,-150,145,95,-97.5,,95,150,160,170,170,410,SBD,Raw,
5,Karol Kwiatkowski,M,Juniors Under 18,74,2003,TKKF Herkules Warszawa,69.03,120,125,-127.5,125,115,117.5,-120,117.5,130,145,155,155,397.5,SBD,Raw,
1,Daniel Wasilewski,M,Juniors Under 18,83,2002,BKL Bełchatów,82.5,190,200,-207.5,200,155,-165.5,-165.5,155,205,215,-220,215,570,SBD,Raw,
2,Miron Dembski,M,Juniors Under 18,83,2002,KS Team Wrocław,82.6,-180,180,190,190,-110,110,-117.5,110,230,-244,244,244,544,SBD,Raw,
3,Filip Blokowski,M,Juniors Under 18,83,2002,LKS Nadwiślanin Kwidzyn,76.9,175,180,-185,180,95,100,105,105,160,170,180,180,465,SBD,Raw,
DQ,Mateusz Dobies,M,Juniors Under 18,83,2002,KSSSiKW Wiking Starachowice,76.8,-155,-155,-155,,85,90,97.5,97.5,150,160,165,165,,SBD,Raw,
1,Bartłomiej Bogdewicz,M,Juniors Under 18,93,2002,AZS Politechnika Warszawska,91.05,235,242.5,247.5,247.5,140,-142.5,-142.5,140,225,235,245,245,632.5,SBD,Raw,
2,Maciej Ziajor,M,Juniors Under 18,93,2002,KS Studio Mocy Kolbuszowa,91.7,-215,220,230,230,135,142.5,-147.5,142.5,225,235,-262.5,235,607.5,SBD,Raw,
3,Adam Hutniczak,M,Juniors Under 18,93,2002,Strong Platinium Kraków,91.6,200,-220,-220,200,120,127.5,132.5,132.5,210,225,-235,225,557.5,SBD,Raw,
4,Dawid Margas,M,Juniors Under 18,93,2003,Stowarzyszenie Centrum Formy Dąbrowa Górnicza,90.2,192.5,200,205,205,107.5,-112.5,-112.5,107.5,200,210,215,215,527.5,SBD,Raw,
5,Dominik Mularski,M,Juniors Under 18,93,2003,KSSSiKW Wiking Starachowice,85.7,175,185,,185,105,-112.5,115,115,205,215,225,225,525,SBD,Raw,
6,Sebastian Dziadosz,M,Juniors Under 18,93,2002,Stowarzyszenie Centrum Formy Dąbrowa Górnicza,90.04,142.5,152.5,165,165,90,100,-105,100,150,-160,-165,150,415,SBD,Raw,
NS,Jakub Zalewski,M,Juniors Under 18,93,2002,SKFSiR Piękni i Zdrowi Dzierżoniów,,,,,,,,,,,,,,,SBD,Raw,
NS,Danyil Hapon,M,Juniors Under 18,93,2003,BKL Bełchatów,,,,,,,,,,,,,,,SBD,Raw,
1,Krystian Muczyński,M,Juniors Under 18,105,2003,MKS Wicher Kobyłka,102.8,245,255,263,263,135,142.5,150,150,261,270,288,288,701,SBD,Raw,
2,Piotr Marzysz,M,Juniors Under 18,105,2002,KS Team Wrocław,103.8,-240,250,264,264,135,137.5,-145,137.5,240,255,-282.5,255,656.5,SBD,Raw,
3,Aleksander Chowaniak,M,Juniors Under 18,105,2003,TKKF Azory Kraków,99.3,190,200,210,210,140,-145,145,145,190,200,210,210,565,SBD,Raw,
4,Karol Drozdowski,M,Juniors Under 18,105,2003,KS Team Wrocław,93.9,185,195,205,205,87.5,95,100,100,212.5,225,232.5,232.5,537.5,SBD,Raw,
5,Andrzej Dyczkowski,M,Juniors Under 18,105,2003,TKKF Azory Kraków,102.9,140,-150,150,150,105,107.5,110,110,170,175,180,180,440,SBD,Raw,
6,Mateusz Gaura,M,Juniors Under 18,105,2002,UKS Eugen Knurów,99.7,-140,140,152.5,152.5,82.5,87.5,-90,87.5,160,170,177.5,177.5,417.5,SBD,Raw,
1,Grzegorz Heinze,M,Juniors Under 18,120,2002,KS Team Wrocław,112.4,-240,-262.5,262.5,262.5,140,147.5,155,155,-255,267.5,271,271,688.5,SBD,Raw,
2,Kacper Olszowy,M,Juniors Under 18,120,2003,KS Studio Mocy Kolbuszowa,111.7,210,225,240,240,112.5,120,125,125,220,235,-250,235,600,SBD,Raw,
1,Bartłomiej Tuszyński,M,Juniors Under 18,120+,2003,GKS Kraska Jasieniec,151.1,261.5,280,-290.5,280,155,165.5,167.5,167.5,230,252.5,275,275,722.5,SBD,Raw,
1,Aleksandra Blajer,F,Juniors Under 20,52,2000,LUKS Zieloni Łańcut,50.9,110,-120,125,125,65,72.5,-76.5,72.5,120,127.5,132.5,132.5,330,SBD,Raw,
DQ,Izabela Góralska,F,Juniors Under 20,52,2000,KS Harem Koszalin,50.2,127.5,133,-136,133,-70,-70,-70,,-155,,,,,SBD,Raw,
1,Gabriela Blajer,F,Juniors Under 20,57,2000,LUKS Zieloni Łańcut,54.5,127.5,132.5,137,137,62.5,67.5,70,70,127.5,-135,135,135,342,SBD,Raw,
2,Natalia Dembna,F,Juniors Under 20,57,2000,KS Team Wrocław,56.5,100,-105,105,105,60,-65,-65,60,122.5,130,135,135,300,SBD,Raw,
3,Emilia Pławuszewska,F,Juniors Under 20,57,2001,KS Strength Coach Performance Wrocław,55.9,70,75,80,80,45,47.5,-50,47.5,105,110,115,115,242.5,SBD,Raw,
4,Lena Kozieł,F,Juniors Under 20,57,2000,KS Team Wrocław,52.4,60,70,75,75,37.5,42.5,-45,42.5,80,90,95,95,212.5,SBD,Raw,
NS,Natalia Wojtczak,F,Juniors Under 20,57,2000,KS Team Wrocław,,,,,,,,,,,,,,,SBD,Raw,
NS,Natalia Głośnicka,F,Juniors Under 20,57,2000,KSS Power&Muscle Wołów,,,,,,,,,,,,,,,SBD,Raw,
1,Natalia Wójtowicz,F,Juniors Under 20,63,2001,KS Team Wrocław,62.9,110,115,-120,115,-75,75,-78,75,145,150,-152.5,150,340,SBD,Raw,
2,Wiktoria Grzywa,F,Juniors Under 20,63,2001,KS Team Wrocław,61.5,102.5,107.5,-112.5,107.5,60,65,-70,65,135,145,-160,145,317.5,SBD,Raw,
3,Marika Kij,F,Juniors Under 20,63,2000,Stow. Centrum Formy Dąbrowa Górnicza,60,100,107.5,115,115,40,47.5,-52.5,47.5,120,130,-155,130,292.5,SBD,Raw,
4,Daria Rus,F,Juniors Under 20,63,2000,KS Team Wrocław,61.6,110,115,-120,115,52.5,57.5,-60,57.5,105,112.5,-122.5,112.5,285,SBD,Raw,
5,Klaudia Banaszak,F,Juniors Under 20,63,2001,UKS Sokół Krzywiń,61.9,80,-90,-90,80,40,47.5,-50,47.5,90,105,115,115,242.5,SBD,Raw,
1,Ida Lis,F,Juniors Under 20,72,2000,BKL Bełchatów,71.5,175,182.5,-185,182.5,110,115,117.5,117.5,190,-200,-200,190,490,SBD,Raw,
2,Justyna Szarek,F,Juniors Under 20,72,2001,Stow. Centrum Formy Dąbrowa Górnicza,67.4,132.5,-140,-140,132.5,72.5,-75,75,75,135,142.5,150,150,357.5,SBD,Raw,
3,Agata Latocha,F,Juniors Under 20,72,2000,Stow. Centrum Formy Dąbrowa Górnicza,70.8,-105,105,-110,105,67.5,-70,-70,67.5,147.5,155,162.5,162.5,335,SBD,Raw,
NS,Matylda Korczyńska,F,Juniors Under 20,72,2000,AZS Politechnika Warszawska,,,,,,,,,,,,,,,SBD,Raw,
1,Natalia Fota,F,Juniors Under 20,84,2001,KS Wisła Puławy,82.4,110,120,130,130,60,65,-67.5,65,110,120,125,125,320,SBD,Raw,
2,Magdalena Szymkowiak,F,Juniors Under 20,84,2001,UKS Sokół Krzywiń,73.4,90,102.5,-107.5,102.5,35,-40,40,40,100,115,130,130,272.5,SBD,Raw,
1,Zuzanna Kula,F,Juniors Under 23,47,1999,Stow. Centrum Formy Dąbrowa Górnicza,46.7,117.5,121,123.5,123.5,72.5,76,-77,76,125,132.5,-137.5,132.5,332,SBD,Raw,
1,Dominika Piskorz,F,Juniors Under 23,57,1997,KS Team Wrocław,55.8,107.5,-112.5,112.5,112.5,55,57.5,60,60,140,147.5,155,155,327.5,SBD,Raw,
2,Magdalena Frącek,F,Juniors Under 23,57,1999,KS Paco Lublin,53.1,110,115,-120,115,57.5,-62.5,-62.5,57.5,130,-137.5,137.5,137.5,310,SBD,Raw,
3,Broź Julia,F,Juniors Under 23,57,1998,Stow. Strong Platinium Kraków,56.3,100,105,-107.5,105,60,-62.5,-62.5,60,125,132.5,140,140,305,SBD,Raw,
4,Aneta Brewińska,F,Juniors Under 23,57,1999,KS Harem Koszalin,54.2,-95,95,-100,95,-50,50,-57.5,50,130,140,-152.5,140,285,SBD,Raw,
5,Marta Wilkowska,F,Juniors Under 23,57,1998,KS Team Wrocław,55.1,97.5,100,102.5,102.5,42.5,-45,-45,42.5,122.5,132.5,-137.5,132.5,277.5,SBD,Raw,
1,Sabina Durok,F,Juniors Under 23,63,1999,Stow. Centrum Formy Dąbrowa Górnicza,61.7,146,148,150,150,72.5,75,-78,75,142.5,-150,-150,142.5,367.5,SBD,Raw,
2,Magdalena Kwiatek,F,Juniors Under 23,63,1997,KS Studio Mocy Kolbuszowa,59.7,115,122.5,130,130,62.5,70,-75,70,115,122.5,130,130,330,SBD,Raw,
3,Magda Siemieńska,F,Juniors Under 23,63,1999,SKS Mega-Gim Zawidz,62.4,105,-115,-115,105,75,-80,80,80,130,140,-147.5,140,325,SBD,Raw,
4,Katarzyna Walczak,F,Juniors Under 23,63,1997,AZS Uniwersytet A.Mickiewicza Poznań,62.4,107.5,112.5,-115,112.5,52.5,55,-57.5,55,135,142.5,-147.5,142.5,310,SBD,Raw,
5,Julia Adamiec,F,Juniors Under 23,63,1999,VIP GYM Grajewo,59.3,80,87.5,95,95,47.5,52.5,-57.5,52.5,105,110,115,115,262.5,SBD,Raw,
6,Joanna Kapelańczyk,F,Juniors Under 23,63,1997,KS Team Wrocław,62.4,87.5,95,-100,95,47.5,52.5,-55,52.5,100,110,-120,110,257.5,SBD,Raw,
DQ,Natalia Świstara,F,Juniors Under 23,63,1999,KS Team Wrocław,60.3,110,-117.5,-120,110,-65,-67.5,-67.5,,130,137.5,-145,137.5,,SBD,Raw,
1,Paulina Rybak,F,Juniors Under 23,72,1999,KS Kobra Kościan,69.3,115,125,132.5,132.5,62.5,65,-67.5,65,125,135,-142.5,135,332.5,SBD,Raw,
2,Justyna Labun,F,Juniors Under 23,72,1999,Stow. Centrum Formy Dąbrowa Górnicza,68.2,-110,-115,115,115,-67.5,70,-72.5,70,120,125,130,130,315,SBD,Raw,
3,Anita Słomska,F,Juniors Under 23,72,1997,PMKS Rybak Władysławowo,70.6,100,110,-115,110,55,60,-62.5,60,125,135,142.5,142.5,312.5,SBD,Raw,
4,Paulina Pawyza,F,Juniors Under 23,72,1999,KS Team Wrocław,68.8,95,-100,100,100,55,60,65,65,120,135,-145,135,300,SBD,Raw,
NS,Katarzyna Derlatka,F,Juniors Under 23,72,1998,Stow. Centrum Formy Dąbrowa Górnicza,68,-115,-120,-120,,,,,,,,,,,SBD,Raw,
1,Joanna Sałek,F,Juniors Under 23,84,1997,KS Studio Mocy Kolbuszowa,82.4,140,155,-165,155,75,82.5,-85,82.5,170,185.5,190,190,427.5,SBD,Raw,
1,Agata Kaliciak,F,Juniors Under 23,84+,1997,KS Team Wrocław,89,142.5,150,-155,150,80,85,87.5,87.5,150,165,181.5,181.5,419,SBD,Raw,
2,Karolina Kołata,F,Juniors Under 23,84+,1999,Stow. Centrum Formy Dąbrowa Górnicza,108.1,-140,140,145,145,82.5,87.5,90,90,135,-145,145,145,380,SBD,Raw,
3,Agata Kwiatkowska,F,Juniors Under 23,84+,1997,KS Studio Mocy Kolbuszowa,84.9,110,-120,125,125,55,60,-62.5,60,120,130,-142.5,130,315,SBD,Raw,
1,Dominik Sewioł,M,Juniors Under 20,59,2001,Stow. Strong Platinium Kraków,57.5,127.5,135,137.5,137.5,75,-80,,75,175,185,-200.5,185,397.5,SBD,Raw,
1,Przemysław Berezowski,M,Juniors Under 20,66,2001,KS Team Wrocław,64.2,155,165,175,175,82.5,90,97.5,97.5,180,190,200,200,472.5,SBD,Raw,
2,Radosław Dębicki,M,Juniors Under 20,66,2001,Stow. Centrum Formy Dąbrowa Górnicza,65.1,155,165,-170,165,100,105,-107.5,105,165,175,182.5,182.5,452.5,SBD,Raw,
1,Daniel Siedlecki,M,Juniors Under 20,74,2001,KS Strength Coach Performance Wrocław,73.5,-167.5,167.5,172.5,172.5,112.5,-117.5,117.5,117.5,210,-222.5,222.5,222.5,512.5,SBD,Raw,
2,Adrian Rosa,M,Juniors Under 20,74,2000,KS Team Wrocław,72.5,175,180,-182.5,180,102.5,107.5,110,110,-220,220,-225,220,510,SBD,Raw,
3,Dominik Houhoud,M,Juniors Under 20,74,2000,KS-MOSSiTF Relax Kamienna Góra,73.4,175,177.5,180,180,110,117.5,-122.5,117.5,-195,197.5,-202.5,197.5,495,SBD,Raw,
4,Wojciech Sochacki,M,Juniors Under 20,74,2000,Stow. Strong Platinium Kraków,73.2,-175,180,-190,180,105,110,112.5,112.5,195,-200,-205,195,487.5,SBD,Raw,
5,Sławomir Mendyka,M,Juniors Under 20,74,2001,Stow. Sportatut Krobia,71.9,-175,-175,175,175,-90,90,-97.5,90,190,200,-210,200,465,SBD,Raw,
1,Dominik Boczek,M,Juniors Under 20,83,2000,KS Studio Mocy Kolbuszowa,78.8,180,190,-200,190,-140,140,-150,140,220,235,250,250,580,SBD,Raw,
2,Jakub Grycman,M,Juniors Under 20,83,2001,KS Team Wrocław,81.8,-200,205,210,210,120,127.5,-132.5,127.5,210,230,242.5,242.5,580,SBD,Raw,
3,Bartłomiej Molga,M,Juniors Under 20,83,2001,Stow. Centrum Formy Dąbrowa Górnicza,80.3,180,195,-205,195,-115,117.5,120,120,215,225,-230,225,540,SBD,Raw,
4,Dominik Piwowar,M,Juniors Under 20,83,2000,SAC Ursus Krotoszyn,81.8,180,187.5,-195,187.5,122.5,127.5,130,130,190,200,207.5,207.5,525,SBD,Raw,
5,Hubert Jasiński,M,Juniors Under 20,83,2001,KS Tęcza Społem Kielce,80.9,162.5,172.5,180,180,107.5,115,-120,115,185,200,212.5,212.5,507.5,SBD,Raw,
6,Jakub Grzelak,M,Juniors Under 20,83,2001,GKS Kraska Jasieniec,80.7,-160,160,175,175,-115,115,-125,115,200,215,-225,215,505,SBD,Raw,
7,Kacper Pietraś,M,Juniors Under 20,83,2001,TKKF Azory Kraków,82.8,172.5,177.5,-182.5,177.5,95,100,105,105,190,205,-210,205,487.5,SBD,Raw,
8,Krystian Osiński,M,Juniors Under 20,83,2000,TKKF Herkules Warszawa,79.6,155,162.5,-170,162.5,-105,105,112.5,112.5,180,-190,-190,180,455,SBD,Raw,
9,Adam Walkowiak,M,Juniors Under 20,83,2001,KS Team Wrocław,74.5,120,132.5,140,140,90,97.5,102.5,102.5,125,135,140,140,382.5,SBD,Raw,
DQ,Kacper Baran,M,Juniors Under 20,83,2001,SSW Skierniewice,82.3,185,-197.5,-197.5,185,115,120,-125,120,-220,-220,-220,,,SBD,Raw,
NS,Bartosz Haczykowski,M,Juniors Under 20,83,2001,SSW Skierniewice,,,,,,,,,,,,,,,SBD,Raw,
1,Mateusz Żyła,M,Juniors Under 20,93,2001,KS Harem Koszalin,91.2,230,-240,,230,135,140,,140,270,-281,-281,270,640,SBD,Raw,
2,Michał Kowalczyk,M,Juniors Under 20,93,2001,TKKF Azory Kraków,85.8,210,222.5,230,230,145,150,155,155,205,215,222.5,222.5,607.5,SBD,Raw,
3,Paweł Wieczorek,M,Juniors Under 20,93,2001,KSSSiKW Wiking Starachowice,91.3,195,215,222.5,222.5,155,-165,165,165,197.5,-210,220,220,607.5,SBD,Raw,
4,Dawid Marciniak,M,Juniors Under 20,93,2000,UKS Sokół Krzywiń,89.6,195,210,217.5,217.5,110,115,,115,200,215,220,220,552.5,SBD,Raw,
5,Robert Patelczyk,M,Juniors Under 20,93,2001,KS Team Wrocław,91.8,210,-217.5,-220,210,115,-122.5,-122.5,115,200,-210,-210,200,525,SBD,Raw,
1,Artur Łapata,M,Juniors Under 20,105,2000,KS Team Wrocław,103.2,250,-265,265,265,160,175.5,177.5,177.5,240,260,265,265,707.5,SBD,Raw,
2,Eryk Paszkiewicz,M,Juniors Under 20,105,2000,KS Jarot Team,101.4,260,-275,280,280,125,-135,-135,125,260,280,-302.5,280,685,SBD,Raw,
3,Szymon Uszyński,M,Juniors Under 20,105,2000,Stow. Centrum Formy Dąbrowa Górnicza,103.3,230,240,250,250,122.5,130,-135,130,245,-260,260,260,640,SBD,Raw,
4,Kacper Pawlak,M,Juniors Under 20,105,2001,KS Team Wrocław,101.9,205,215,-220,215,115,120,125,125,255,270,282.5,282.5,622.5,SBD,Raw,
5,Jan Groszkowski,M,Juniors Under 20,105,2001,KS Jarot Team,97.3,200,210,220,220,135,145,150,150,220,240,250,250,620,SBD,Raw,
6,Robert Łowczyk,M,Juniors Under 20,105,2000,KSSSiKW Wiking Starachowice,100.6,-200,200,215,215,115,-120,120,120,-220,220,240,240,575,SBD,Raw,
7,Filip Kijewski,M,Juniors Under 20,105,2001,KSSSiKW Wiking Starachowice,101.7,200,212.5,-225,212.5,-105,110,-120,110,210,-225,225,225,547.5,SBD,Raw,
1,Jakub Krakowian,M,Juniors Under 20,120,2001,KS Team Wrocław,111.8,240,260,272.5,272.5,150,165,-167.5,165,240,257.5,-262.5,257.5,695,SBD,Raw,
2,Adam Woźny,M,Juniors Under 20,120,2001,KSSSiKW Wiking Starachowice,107.3,250,265,272.5,272.5,155,162.5,-167.5,162.5,245,255,-262.5,255,690,SBD,Raw,
3,Karol Wójcik,M,Juniors Under 20,120,2001,KSSSiKW Wiking Starachowice,115.1,230,245,252.5,252.5,100,110,,110,250,265,272.5,272.5,635,SBD,Raw,
1,Maciej Samborski,M,Juniors Under 20,120+,2001,KS Team Wrocław,134.9,255,265,277.5,277.5,165,172.5,182.5,182.5,260,285,300,300,760,SBD,Raw,
2,Michał Piszczor,M,Juniors Under 20,120+,2001,TKKF Azory Kraków,145.7,225,235,242.5,242.5,170,175,180,180,235,250,-272.5,250,672.5,SBD,Raw,
3,Jakub Szewczyk,M,Juniors Under 20,120+,2000,KS Studio Mocy Kolbuszowa,129,240,255,-262.5,255,110,120,-122.5,120,250,270,-275,270,645,SBD,Raw,
1,Błażej Tkacz,M,Juniors Under 23,59,1999,KS Tęcza Społem Kielce,58,130,137.5,-140,137.5,80,-85,85,85,150,160,-175,160,382.5,SBD,Raw,
1,Hubert Zaręba,M,Juniors Under 23,66,1999,KS Studio Mocy Kolbuszowa,64.6,190,201,-212.5,201,120,125,127.5,127.5,210,220,230,230,558.5,SBD,Raw,
2,Sławomir Szymura,M,Juniors Under 23,66,1998,KS Tęcza Społem Kielce,65.9,150,-160,-160,150,100,110,-112.5,110,170,185,-200,185,445,SBD,Raw,
3,Piotr Ziółkowski,M,Juniors Under 23,66,1999,KS Team Wrocław,61,140,-145,-145,140,90,97.5,100,100,-165,165,180,180,420,SBD,Raw,
1,Rafał Łazicki,M,Juniors Under 23,74,1999,AZS WAT Warszawa,73,200,210,212.5,212.5,125,-130,132.5,132.5,-220,232.5,245,245,590,SBD,Raw,
2,Kamil Drzymała,M,Juniors Under 23,74,1998,Stow. Centrum Formy Dąbrowa Górnicza,73,200,210,-215,210,145,-150,-150,145,220,-225,-225,220,575,SBD,Raw,
3,Kacper Błotko,M,Juniors Under 23,74,1999,Stow. Strong Platinium Kraków,73.9,200,210,215,215,135,-140,-142.5,135,210,-215,-215,210,560,SBD,Raw,
4,Kamil Światły,M,Juniors Under 23,74,1999,AZS Uniwersytet A.Mickiewicza Poznań,74,187.5,195,-202.5,195,127.5,132.5,-135,132.5,-210,217.5,225,225,552.5,SBD,Raw,
5,Hubert Kończak,M,Juniors Under 23,74,1998,KSSSiKW Wiking Starachowice,73.7,-185,185,195,195,112.5,-117.5,117.5,117.5,225,-237.5,,225,537.5,SBD,Raw,
6,Bartek Krzesiński,M,Juniors Under 23,74,1997,Stow. Centrum Formy Dąbrowa Górnicza,72.9,170,180,-187.5,180,125,132.5,135,135,190,200,205,205,520,SBD,Raw,
7,Dominik Nowogórski,M,Juniors Under 23,74,1997,KS Studio Mocy Kolbuszowa,73.1,180,190,-195,190,115,-120,120,120,195,207.5,-215,207.5,517.5,SBD,Raw,
8,Piotr Bilicki,M,Juniors Under 23,74,1997,UKS Mechanik Sierpc,73.8,130,140,150,150,110,112.5,122.5,122.5,160,175,185,185,457.5,SBD,Raw,
NS,Patryk Witak,M,Juniors Under 23,74,1997,KS Studio Mocy Kolbuszowa,,,,,,,,,,,,,,,SBD,Raw,
1,Piotr Kowalczyk,M,Juniors Under 23,83,1997,TKKF Azory Kraków,82.1,220,-227.5,230,230,155,-160,160,160,-230,230,245,245,635,SBD,Raw,
2,Marcin Statkiewicz,M,Juniors Under 23,83,1997,Stow. Centrum Formy Dąbrowa Górnicza,82.1,-205,210,217.5,217.5,127.5,132.5,135,135,262.5,270,274,274,626.5,SBD,Raw,
3,Jakub Micał,M,Juniors Under 23,83,1999,KS Team Wrocław,81.6,217.5,222.5,-225,222.5,140,-145,-147.5,140,-255,-255,260,260,622.5,SBD,Raw,
4,Jacek Wójcik,M,Juniors Under 23,83,1998,KSS Power&Muscle Wołów,81.7,-210,217.5,227.5,227.5,120,125,-127.5,125,250,260,270,270,622.5,SBD,Raw,
5,Krystian Niedźwiedź,M,Juniors Under 23,83,1997,KSSSiKW Wiking Starachowice,79.7,205,215,222.5,222.5,145,-150,-230,145,220,232.5,-245,232.5,600,SBD,Raw,
6,Paweł Przybojewski,M,Juniors Under 23,83,1999,UKS Mechanik Sierpc,82.1,195,202.5,207.5,207.5,130,-135,-135,130,235,245,250,250,587.5,SBD,Raw,
7,Michał Bielski,M,Juniors Under 23,83,1999,KS Team Wrocław,81.6,195,-205,205,205,115,122.5,-127.5,122.5,215,230,242.5,242.5,570,SBD,Raw,
8,Kacper Szymaniak,M,Juniors Under 23,83,1999,KSS Power&Muscle Wołów,82.3,195,205,-212.5,205,-125,130,-132.5,130,230,-235,-235,230,565,SBD,Raw,
9,Szymon Dylak,M,Juniors Under 23,83,1997,Stow. Sportatut Krobia,81.9,190,195,-207.5,195,-110,120,-130,120,200,210,-230,210,525,SBD,Raw,
NS,Daniel Nowak,M,Juniors Under 23,83,1998,KS Team Wrocław,,,,,,,,,,,,,,,SBD,Raw,
1,Michał Pacwa,M,Juniors Under 23,93,1997,TKKF Azory Kraków,91,245,255,-265.5,255,165,175,185,185,260,270,280,280,720,SBD,Raw,
2,Patryk Zaniewski,M,Juniors Under 23,93,1998,MKS Wicher Kobyłka,92.7,225,235,-245,235,160,170,-175,170,255,262.5,277.5,277.5,682.5,SBD,Raw,
3,Sławomir Nowak,M,Juniors Under 23,93,1998,KS Team Wrocław,92.2,-227.5,240,-247.5,240,160,170,-175,170,225,242.5,250,250,660,SBD,Raw,
4,Bartłomiej Kowalczyk,M,Juniors Under 23,93,1998,TKKF Azory Kraków,92.9,215,-225,230,230,145,152.5,-157.5,152.5,245,257.5,-282.5,257.5,640,SBD,Raw,
5,Marcin Oleś,M,Juniors Under 23,93,1997,UKS Eugen Knurów,89.3,-210,-215,215,215,150,155,160,160,215,225,235,235,610,SBD,Raw,
6,Mateusz Szymański,M,Juniors Under 23,93,1998,AZS WAT Warszawa,91,210,220,225,225,115,125,-130,125,215,220,225,225,575,SBD,Raw,
7,Kacper Linkowski,M,Juniors Under 23,93,1999,Stow. Sportatut Krobia,91.8,190,-195,200,200,140,-145,-145,140,200,-210,-212.5,200,540,SBD,Raw,
8,Szymon Pruszyński,M,Juniors Under 23,93,1998,Stow. Centrum Formy Dąbrowa Górnicza,90.7,-180,180,187.5,187.5,110,-117.5,122.5,122.5,215,-230,-230,215,525,SBD,Raw,
NS,Jakub Sokołowski,M,Juniors Under 23,93,1999,KS Studio Mocy Kolbuszowa,,,,,,,,,,,,,,,SBD,Raw,
1,Szymon Grzelak,M,Juniors Under 23,105,1999,KSSSiKW Wiking Starachowice,103.9,245,257.5,265,265,145,150,155,155,275,287.5,305,305,725,SBD,Raw,
2,Marcin Lange,M,Juniors Under 23,105,1997,PMKS Rybak Władysławowo,101.4,240,250,260,260,180,185,187.5,187.5,260,270,275,275,722.5,SBD,Raw,
3,Patryk Szeliga,M,Juniors Under 23,105,1997,SKFSiR Piękni i Zdrowi Dzierżoniów,104.9,275.5,283.5,-290.5,283.5,150,-155,,150,265,-275,-275,265,698.5,SBD,Raw,
4,Mateusz Bagiński,M,Juniors Under 23,105,1997,Stow. Centrum Formy Dąbrowa Górnicza,102.8,220,232.5,240,240,132.5,137.5,142.5,142.5,-310.5,-310.5,310.5,310.5,693,SBD,Raw,
5,Kacper Krzyszczuk,M,Juniors Under 23,105,1998,TKKF Śródmieście Legnica,102.3,225,240,250,250,130,135,140,140,220,235,242.5,242.5,632.5,SBD,Raw,
6,Patryk Olejnik,M,Juniors Under 23,105,1998,TKKF Śródmieście Legnica,103.9,192.5,205,215,215,140,147.5,-152.5,147.5,185,200,207.5,207.5,570,SBD,Raw,
7,Patryk Marciszek-Kosieradzki,M,Juniors Under 23,105,1998,KS Team Wrocław,102,185,195,-200,195,125,132.5,-135,132.5,225,235,-240,235,562.5,SBD,Raw,
NS,Grzegorz Maliszewski,M,Juniors Under 23,105,1997,KS Studio Mocy Kolbuszowa,,,,,,,,,,,,,,,SBD,Raw,
1,Sebastian Stanek,M,Juniors Under 23,120,1999,KS Team Wrocław,113.3,230,240,250,250,150,160,-165,160,260,270,280,280,690,SBD,Raw,
2,Krzysztof Stangret,M,Juniors Under 23,120,1998,AZS WAT Warszawa,113.6,220,230,240,240,150,160,-165,160,245,260,,260,660,SBD,Raw,
3,Bartosz Posert,M,Juniors Under 23,120,1998,AZS Uniwersytet A.Mickiewicza Poznań,117.6,207.5,220,227.5,227.5,115,122.5,127.5,127.5,215,230,235,235,590,SBD,Raw,
4,Sebastian Mitoraj,M,Juniors Under 23,120,1997,TKKF Azory Kraków,106.4,-180,180,190,190,-115,117.5,-122.5,117.5,205,215,-225,215,522.5,SBD,Raw,
1,Kacper Bielusiak,M,Juniors Under 23,120+,1998,Stow. Centrum Formy Dąbrowa Górnicza,123.2,265,275,,275,167.5,181,185,185,290,306,316,316,776,SBD,Raw,
2,Mateusz Stasik,M,Juniors Under 23,120+,1998,KS Team Wrocław,120.01,210,230,235,235,140,150,155,155,245,260,-275,260,650,SBD,Raw,
1,Eliza Gerlach,F,Open,47,1998,KS Harem Koszalin,47,-115,115,-124,115,65,-70,-70,65,125,130,-135,130,310,SBD,Raw,
1,Izabela Góralska,F,Open,52,2000,KS Harem Koszalin,50.8,-125,125,130,130,65,70,-72.5,70,155,160.5,165,165,365,SBD,Raw,
2,Paulina Szymanel,F,Open,52,1995,Stow. Centrum Formy Dąbrowa Górnicza,48.6,117.5,122.5,127.5,127.5,70,75,-78,75,147.5,155,-161,155,357.5,SBD,Raw,
3,Natalia Cwykiel,F,Open,52,1995,KS Studio Mocy Kolbuszowa,51.6,90,95,-100,95,45,50,-52.5,50,125,-135,135,135,280,SBD,Raw,
4,Barbara Goliczewska,F,Open,52,1983,VIP GYM Grajewo,50.6,95,100,-102.5,100,55,60,-62.5,60,110,117.5,-122.5,117.5,277.5,SBD,Raw,
NS,Trang Sam Thu,F,Open,52,1995,Stow. Centrum Formy Dąbrowa Górnicza,,,,,,,,,,,,,,,SBD,Raw,
1,Joanna Czekurłan,F,Open,57,1993,KS Team Wrocław,54.9,125,130,136.5,136.5,90,95.5,-96,95.5,140,147.5,152.5,152.5,384.5,SBD,Raw,
2,Iga Dąbek,F,Open,57,1995,Stow. Centrum Formy Dąbrowa Górnicza,56.4,125,130,-135,130,72.5,75,-77.5,75,130,140,-150,140,345,SBD,Raw,
3,Olimpia Felińska,F,Open,57,1992,KS Team Wrocław,56.6,120,-125,-125,120,85,-90,-90,85,130,137.5,-142.5,137.5,342.5,SBD,Raw,
4,Klaudia Maciąg,F,Open,57,1995,KSSSiKW Wiking Starachowice,55.3,105,110,115,115,45,50,-52.5,50,100,110,117.5,117.5,282.5,SBD,Raw,
DQ,Klaudia Wytyk,F,Open,57,1995,KS Team Wrocław,54.5,-112.5,-112.5,-120,,-50,,,,,,,,,SBD,Raw,
1,Marika Zandecka,F,Open,63,1995,AZS Uniwe4rsytet A.Mickiewicza Poznań,62.4,152.5,160,166,166,85,90,-92.5,90,167.5,177.5,181,181,437,SBD,Raw,
2,Emilia Rzepnicka,F,Open,63,1979,Stow. Masakra Ełk,61.3,132.5,-137.5,137.5,137.5,55,60,-62.5,60,145,152.5,157.5,157.5,355,SBD,Raw,
3,Weronika Szczechowska,F,Open,63,1994,KS Team Wrocław,61.7,115,120,-125,120,70,75,-80,75,135,-145,150,150,345,SBD,Raw,
4,Katarzyna Mikulska,F,Open,63,1982,KS Team Wrocław,62,-102.5,107.5,112.5,112.5,57.5,60,-62.5,60,137.5,145,-150,145,317.5,SBD,Raw,
5,Joanna Namiotko,F,Open,63,1994,KS Team Wrocław,61.9,-85,87.5,95,95,42.5,47.5,-52.5,47.5,110,120,127.5,127.5,270,SBD,Raw,
NS,Justyna Turek,F,Open,63,1994,TKKF Azory Kraków,,,,,,,,,,,,,,,SBD,Raw,
1,Anna Szymańska,F,Open,72,1987,KS Anmar Warszawa,70.2,160,167.5,175,175,100,105,-107.5,105,165,170,180,180,460,SBD,Raw,
2,Agata Sitko,F,Open,72,2002,UKS Pover Kuźnik Chorzów,70.5,155,165,-167.5,165,100,-107.5,-107.5,100,160,-170,170,170,435,SBD,Raw,
3,Dominika Michalska,F,Open,72,1994,LKS Nadwiślanin Kwidzyn,71.4,150,-157.5,157.5,157.5,65,-70,-70,65,150,160,170,170,392.5,SBD,Raw,
4,Natalia Kaczmarska,F,Open,72,1986,KS Jarot Team,68.9,125,135,140,140,75,-80,80,80,130,140,-162.5,140,360,SBD,Raw,
5,Katarzyna Kruszewska-Dudłak,F,Open,72,1984,Stow. Centrum Formy Dąbrowa Górnicza,69,115,125,132.5,132.5,60,65,-70,65,135,145,150,150,347.5,SBD,Raw,
6,Aleksandra Gudecka,F,Open,72,1984,KS Team Wrocław,71.3,115,120,125,125,65,70,-75,70,135,145,150,150,345,SBD,Raw,
7,Monika Łaś,F,Open,72,1990,TKKF Azory Kraków,69.8,110,117.5,-125,117.5,55,-60,60,60,140,150,-160,150,327.5,SBD,Raw,
1,Daria Ławniczak,F,Open,84,1995,KS Team Wrocław,79.9,135,142.5,-145,142.5,-106,106,,106,160,167.5,,167.5,416,SBD,Raw,
2,Sylwia Zaczkiewicz,F,Open,84,1982,TKKF Azory Kraków,80.9,130,142.5,147.5,147.5,80,87.5,90,90,130,140,-145,140,377.5,SBD,Raw,
3,Danuta Golubiewska,F,Open,84,1974,VIP GYM Grajewo,74.9,120,125,130,130,80,-82.5,82.5,82.5,140,150,-160,150,362.5,SBD,Raw,
4,Daria Czech,F,Open,84,1993,KS Team Wrocław,78.9,120,-130,-130,120,52.5,55,-57.5,55,130,140,150,150,325,SBD,Raw,
1,Anna Wieczorek,F,Open,84+,1984,SSW Skierniewice,95.9,-175,175,183,183,77.5,82.5,87.5,87.5,150,160,170,170,440.5,SBD,Raw,
2,Agnieszka Korycka,F,Open,84+,1988,KSSSiKW Wiking Starachowice,96.5,140,155,165,165,55,65,-70,65,160,-170,-181,160,390,SBD,Raw,
3,Marlena Wronka,F,Open,84+,1996,Stow. Centrum Formy Dąbrowa Górnicza,121.8,130,137.5,145,145,75,77.5,-80,77.5,142.5,150,-157.5,150,372.5,SBD,Raw,
4,Kinga Kurowska,F,Open,84+,1983,KS Team Wrocław,88.4,125,132.5,137.5,137.5,65,-70,-72.5,65,135,-155,-155,135,337.5,SBD,Raw,
1,Agnieszka Dąbrowska-Posała,F,Masters 40-49,52,1979,KS Kobra Kościan,51.7,60,65,-70,65,37.5,40,-42.5,40,105,115,-125.5,115,220,SBD,Raw,
1,Monika Noga,F,Masters 40-49,57,1979,LKS Nadwiślanin Kwidzyn,55.1,50,55,-60,55,30,35,37.5,37.5,55,65,75,75,167.5,SBD,Raw,
1,Emilia Rzepnicka,F,Masters 40-49,63,1979,Stow. Masakra Ełk,61.3,132.5,137.5,139,139,55,60,-63,60,145,152.5,157.5,157.5,356.5,SBD,Raw,
1,Katarzyna Stachyra,F,Masters 40-49,72,1978,KS Team Wrocław,70.7,-100,100,-107.5,100,60,65,-67.5,65,110,122.5,130,130,295,SBD,Raw,
2,Hanna Majorczyk,F,Masters 40-49,72,1977,KS Kobra Kościan,68.8,65,70,-75,70,42.5,45,-47.5,45,90,105,112.5,112.5,227.5,SBD,Raw,
1,Danuta Golubiewska,F,Masters 40-49,84,1974,VIP GYM Grajewo,74.9,120,125,130,130,80,82.5,-83.5,82.5,140,150,-160.5,150,362.5,SBD,Raw,
1,Grażyna Gębala,F,Masters 50-59,63,1966,SSW Skierniewice,61.6,-85,85,97.5,97.5,45,-47.5,47.5,47.5,110,117.5,122.5,122.5,267.5,SBD,Raw,
1,Dariusz Wszoła,M,Open,59,1978,TKKF Śródmieście Legnica,58.7,190,200,,200,140,145,150,150,190,200,-205,200,550,SBD,Raw,
2,Dominik Golak,M,Open,59,1982,Stow. Masakra Ełk,57.4,-160,-160,160,160,100,110,,110,170,190,200,200,470,SBD,Raw,
NS,Dariusz Stania,M,Open,59,1993,KS Studio Mocy Kolbuszowa,,,,,,,,,,,,,,,SBD,Raw,
NS,Sławomir Śledź,M,Open,59,1976,TKKF Śródmieście Legnica,,,,,,,,,,,,,,,SBD,Raw,
1,Mariusz Grotkowski,M,Open,66,1989,KSSSiKW Wiking Starachowice,65.6,190,200,-205,200,145,147.5,-150,147.5,225,232.5,-242.5,232.5,580,SBD,Raw,
2,Michał Łysoń,M,Open,66,1991,KS Strength Coach Performance Wrocław,65.3,177.5,-182.5,-182.5,177.5,127.5,-132.5,132.5,132.5,210,215,-217.5,215,525,SBD,Raw,
3,Kamil Linstedt,M,Open,66,1995,Stow. Centrum Formy Dąbrowa Górnicza,65.4,190,197.5,-202.5,197.5,105,110,-112.5,110,202.5,207.5,-217.5,207.5,515,SBD,Raw,
4,Dawid Blacha,M,Open,66,1994,KS Tęcza Społem Kielce,65.1,170,177.5,-182.5,177.5,120,127.5,132.5,132.5,190,200,-210,200,510,SBD,Raw,
1,Dawid Kawka,M,Open,74,1993,Stow. Centrum Formy Dąbrowa Górnicza,72.8,235,250,-260,250,155,-165,165,165,255,265,-280.5,265,680,SBD,Raw,
2,Piotr Jakimiuk,M,Open,74,1987,KS Team Wrocław,72.9,235,-245,-245,235,-160,160,-165,160,260,-277.5,-287.5,260,655,SBD,Raw,
3,Daniel Chaciński,M,Open,74,1996,KS Team Wrocław,73,190,200,-205,200,160,-167.5,-167.5,160,-215,222.5,232.5,232.5,592.5,SBD,Raw,
4,Kamil Świątek,M,Open,74,1990,TKKF Azory Kraków,73.3,180,190,200,200,115,120,-125,120,212.5,227.5,-247.5,227.5,547.5,SBD,Raw,
5,Szymon Jonczak,M,Open,74,1986,KS Team Wrocław,73.6,180,190,200,200,135,-142.5,142.5,142.5,180,205,225,225,567.5,SBD,Raw,
DQ,Daniel Szymański,M,Open,74,1996,Stow. Centrum Formy Dąbrowa Górnicza,73.6,190,-195,-195,190,-132.5,-132.5,-132.5,,,,,,,SBD,Raw,
NS,Paweł Mazij,M,Open,74,1994,TKKF Herkules Warszawa,,,,,,,,,,,,,,,SBD,Raw,
1,Daniel Ilczyszyn,M,Open,83,1994,AZS WAT Warszawa,82.2,230,250,,250,-170,170,,170,-240,260,-275,260,680,SBD,Raw,
2,Grzegorz Kraujutowicz,M,Open,83,1993,Stow. Centrum Formy Dąbrowa Górnicza,80.8,230,240,-245,240,-140,140,145,145,245,260,,260,645,SBD,Raw,
3,Bartłomiej Wirek,M,Open,83,1983,Stow. Centrum Formy Dąbrowa Górnicza,82.9,200,-210,210,210,165,172.5,-180,172.5,-200,230,-240,230,612.5,SBD,Raw,
4,Damian Parol,M,Open,83,1988,KS Jarot Team,82.2,-180,180,-190,180,140,150,-155,150,230,250,260,260,590,SBD,Raw,
5,Rafał Kamiński,M,Open,83,1991,KS Team Wrocław,82.6,210,217.5,-222.5,217.5,130,135,,135,225,235,-260,235,587.5,SBD,Raw,
6,Łukasz Wiaderny,M,Open,83,1989,KS Team Wrocław,82.5,210,220,227.5,227.5,140,145,-147.5,145,190,200,210,210,582.5,SBD,Raw,
7,Bartosz Zaleciński,M,Open,83,1992,Stow. Centrum Formy Dąbrowa Górnicza,82.2,185,195,200,200,115,-120,-120,115,200,210,215,215,530,SBD,Raw,
NS,Sławomir Litkowiec,M,Open,83,1986,KS Wisła Puławy,,,,,,,,,,,,,,,SBD,Raw,
1,Marcin Joński,M,Open,93,1986,KS Team Wrocław,91.6,270,285,302.5,302.5,160,170,180,180,260,270,-300,270,752.5,SBD,Raw,
2,Łukasz Matwin,M,Open,93,1983,TKKF Herkules Warszawa,91.1,240,250,-255,250,-145,145,-150,145,280,300,302.5,302.5,697.5,SBD,Raw,
3,Paweł Przybyłowicz,M,Open,93,1990,KS Team Wrocław,92.8,225,235,240,240,190,197.5,-202.5,197.5,245,260,-270,260,697.5,SBD,Raw,
4,Szymon Grzegoszczyk,M,Open,93,1992,KS Team Wrocław,89.9,220,227.5,-230,227.5,167.5,172.5,175,175,250,262.5,-270,262.5,665,SBD,Raw,
5,Mariusz Marciniak,M,Open,93,1980,KS Team Wrocław,91,-200,200,220,220,180,190,192.5,192.5,220,230,242.5,242.5,655,SBD,Raw,
6,Dawid Bilski,M,Open,93,1994,KS Strength Coach Performance Wrocław,92.5,215,230,237.5,237.5,145,152.5,157.5,157.5,240,260,-282.5,260,655,SBD,Raw,
7,Mariusz Świderski,M,Open,93,1996,KS Strength Coach Performance Wrocław,91.9,205,222.5,-235,222.5,130,140,145,145,240,255,267.5,267.5,635,SBD,Raw,
8,Mateusz Ząbek,M,Open,93,1995,KS Tęcza Społem Kielce,91.6,190,205,215,215,155,162.5,167.5,167.5,200,215,230,230,612.5,SBD,Raw,
9,Andrzej Szczurek,M,Open,93,1993,TKKF Azory Kraków,90.8,210,222.5,-232.5,222.5,140,147.5,152.5,152.5,225,,,225,600,SBD,Raw,
10,Mateusz Wroński,M,Open,93,1987,AZS Politechnika Warszawska,91.6,200,212.5,220,220,135,-145,150,150,200,215,230,230,600,SBD,Raw,
11,Tomasz Olejniczak,M,Open,93,1990,SAC Ursus Krotoszyn,91.4,180,190,-200,190,125,130,-132.5,130,210,220,230,230,550,SBD,Raw,
NS,Kamil Cyba,M,Open,93,1996,KS Team Wrocław,,,,,,,,,,,,,,,SBD,Raw,
1,Marcin Goleń,M,Open,105,1982,TKKF Herkules Warszawa,105,-260,-260,260,260,170,180,-190,180,300,320,,320,760,SBD,Raw,
2,Daniel Górski,M,Open,105,1978,MKS Tur Ryki,97.6,235,240,-245,240,170,-175,-175,170,250,260,275,275,685,SBD,Raw,
3,Hubert Wrona,M,Open,105,1979,KSSSiKW Wiking Starachowice,104.3,-230,230,240,240,140,-150,,140,260,280,-310,280,660,SBD,Raw,
4,Mateusz Mróz,M,Open,105,1995,KS Team Wrocław,103.3,220,-225,-225,220,130,135,-140,135,250,-257.5,260,260,615,SBD,Raw,
5,Dominik Derlatka,M,Open,105,1994,KSSSiKW Wiking Starachowice,96.9,210,-225,225,225,120,132.5,137.5,137.5,220,235,-247.5,235,597.5,SBD,Raw,
6,Gracjan Sobiesiak,M,Open,105,1996,TKKF Śródmieście Legnica,103.6,210,217.5,222.5,222.5,130,-135,-135,130,220,230,-235,230,582.5,SBD,Raw,
NS,Damian Pawelak,M,Open,105,1987,Stow. Centrum Formy Dąbrowa Górnicza,,,,,,,,,,,,,,,SBD,Raw,
NS,Adrian Świerczyński,M,Open,105,1996,SKFSiR Piękni i Zdrowi Dzierżoniów,,,,,,,,,,,,,,,SBD,Raw,
1,Mateusz Grzesik,M,Open,120,1989,TKKF Śródmieście Legnica,118.6,295,305,317.5,317.5,205,212.5,217.5,217.5,325,340,-345,340,875,SBD,Raw,
2,Jacek Juszczyk,M,Open,120,1994,KS Team Wrocław,120,270,290,-295,290,195,-202.5,-202.5,195,270,285,-300,285,770,SBD,Raw,
3,Bartosz Zajączkowski,M,Open,120,1989,KS Team Wrocław,113.1,-280,290,-300,290,155,165,170,170,275,285,-290,285,745,SBD,Raw,
4,Damian Ordon,M,Open,120,1980,TKKF Herkules Warszawa,114.1,260,270,,270,-175,185,195,195,270,280,-285,280,745,SBD,Raw,
5,Artur Solka,M,Open,120,1993,KS Team Wrocław,113.9,240,255,267.5,267.5,170,-175,175,175,245,255,-260,255,697.5,SBD,Raw,
6,Sebastian Kwiatkowski,M,Open,120,1996,Stow. Centrum Formy Dąbrowa Górnicza,116.3,235,242.5,250,250,160,-165,165,165,250,265,280,280,695,SBD,Raw,
7,Michał Horyń,M,Open,120,1995,KS Team Wrocław,113.1,225,-240,-240,225,192.5,200,205,205,235,250,260,260,690,SBD,Raw,
8,Szymon Wawrzyniak,M,Open,120,1996,KS Team Wrocław,118.8,205,215,225,225,150,160,165,165,270,285,300,300,690,SBD,Raw,
9,Konrad Prześrut,M,Open,120,1995,KSSSiKW Wiking Starachowice,111.5,235,245,-250,245,135,142.5,-145,142.5,235,247.5,-252.5,247.5,635,SBD,Raw,
10,Kamil Dworak,M,Open,120,1985,Stow. Centrum Formy Dąbrowa Górnicza,117.8,-190,-190,190,190,125,130,140,140,230,245,270,270,600,SBD,Raw,
NS,Piotr Sadowski #1,M,Open,120,1993,AZS WAT Warszawa,,,,,,,,,,,,,,,SBD,Raw,
1,Grzegorz Szklarz,M,Open,120+,1989,KS Team Wrocław,139.1,300,-310,-310,300,220,230.5,,230.5,310,325,,325,855.5,SBD,Raw,
2,Konrad Bronicki,M,Open,120+,1982,TKKF Herkules Warszawa,126.2,310,330,343,343,180,190,-195,190,275,285,290,290,823,SBD,Raw,
3,Marek Micewicz,M,Open,120+,1994,KS Team Wrocław,136.3,290,300,310,310,195,-202.5,-202.5,195,275,295,,295,800,SBD,Raw,
4,Adam Szymanowski,M,Open,120+,1983,KS Kobra Kościan,131.6,285,295,305,305,175,180,-182.5,180,270,290,-300,290,775,SBD,Raw,
5,Bartosz Kaczmarek,M,Open,120+,1988,KS Strength Coach Performance Wrocław,126,240,260,-275,260,-155,170,180,180,260,280,300,300,740,SBD,Raw,
6,Łukasz Majsnerowski,M,Open,120+,1988,KS Kobra Kościan,135,220,230,-240,230,160,167.5,170,170,220,-235,235,235,635,SBD,Raw,
NS,Sławomir Śledź,M,Masters 40-49,59,1976,TKKF Śródmieście Legnica,,,,,,,,,,,,,,,SBD,Raw,
1,Piotr Laskowski,M,Masters 40-49,66,1975,Stow. Masakra Ełk,64.8,80,100,115,115,70,-80,-80,70,130,150,170,170,355,SBD,Raw,
1,Marek Remiszewski,M,Masters 40-49,74,1978,Stow. Centrum Formy Dąbrowa Górnicza,72.6,185,192.5,-195.5,192.5,140,146.5,150.5,150.5,210,217.5,-225,217.5,560.5,SBD,Raw,
2,Bartłomiej Gaweł,M,Masters 40-49,74,1980,UKS Pover Kuźnik Chorzów,72.8,-170,170,-175,170,132.5,-135,-135,132.5,220,-230,,220,522.5,SBD,Raw,
3,Piotr Przybecki,M,Masters 40-49,74,1979,KS Team Wrocław,72.5,175,182.5,-187.5,182.5,125,132.5,-137.5,132.5,180,-190,-190,180,495,SBD,Raw,
4,Wojciech Henryk Maciorowski,M,Masters 40-49,74,1972,Stow. Masakra Ełk,73,-170,170,-180,170,-100,100,-107.5,100,210,-227.5,-227.5,210,480,SBD,Raw,
1,Rafał Stolarski,M,Masters 40-49,83,1974,TKKF Herkules Warszawa,81.2,190,200,205,205,115,122.5,-130,122.5,200,220,-230,220,547.5,SBD,Raw,
2,Tomasz Dębicki,M,Masters 40-49,83,1974,Stow. Centrum Formy Dąbrowa Górnicza,80.9,140,150,-157.5,150,120,125,130,130,140,150,155,155,435,SBD,Raw,
3,Gemza Bogusław,M,Masters 40-49,83,1974,Strong Platinium Kraków,81.9,130,137.5,147.5,147.5,100,-105,-105,100,155,162.5,175,175,422.5,SBD,Raw,
4,Krystian Pełka,M,Masters 40-49,83,1978,TKKF Azory Kraków,76,125,-130,140,140,110,115,-117.5,115,140,150,165,165,420,SBD,Raw,
1,Mariusz Marciniak,M,Masters 40-49,93,1980,KS Team Wrocław,91,-200,200,220,220,180,190,193,193,220,230,242.5,242.5,655.5,SBD,Raw,
2,Łukasz Głowacz,M,Masters 40-49,93,1976,UKS Pover Kuźnik Chorzów,92,165,-177.5,-177.5,165,130,-135,-135,130,195,207.5,-210,207.5,502.5,SBD,Raw,
1,Daniel Górski,M,Masters 40-49,105,1978,MKS Tur Ryki,97.6,235,240,-245,240,170,-175,-175,170,250,260,275,275,685,SBD,Raw,
2,Hubert Wrona,M,Masters 40-49,105,1979,KSSSiKW Wiking Starachowice,104.3,-230,230,240,240,140,-150,,140,260,280,-310,280,660,SBD,Raw,
3,Rafał Lipka,M,Masters 40-49,105,1975,KSSSiKW Wiking Starachowice,104.7,175,190,205,205,100,110,,110,195,220,,220,535,SBD,Raw,
4,Sławomir Kasperek,M,Masters 40-49,105,1977,KS Team Wrocław,103.7,160,170,175,175,95,102.5,107.5,107.5,180,190,200,200,482.5,SBD,Raw,
NS,Mikołaj Kowalik,M,Masters 40-49,105,1971,Stow. Centrum Formy Dąbrowa Górnicza,,,,,,,,,,,,,,,SBD,Raw,
1,Damian Ordon,M,Masters 40-49,120,1980,TKKF Herkules Warszawa,114.1,260,270,,270,-175,185,195,195,270,280,-285,280,745,SBD,Raw,
2,Sebastian Sobiech,M,Masters 40-49,120,1980,LZS Jedność Łobżenica,116.9,-250,250,260,260,-170,170,180,180,260,280,-307.5,280,720,SBD,Raw,
1,Łukasz Chruścicki,M,Masters 40-49,120+,1978,KS Kobra Kościan,157,275,290,305,305,130,140,-145,140,275,290,-300,290,735,SBD,Raw,
2,Tomasz Bocionek,M,Masters 40-49,120+,1976,Stow. Centrum Formy Dąbrowa Górnicza,123.3,210,220,-225,220,170,-180,180,180,-240,245,260,260,660,SBD,Raw,
3,Mariusz Kołnacki,M,Masters 40-49,120+,1975,MOKSiR Jastarnia,123.3,-145,145,160,160,130,135,-140,135,180,190,200,200,495,SBD,Raw,
NS,Marek Makarewicz,M,Masters 40-49,120+,1979,Stow. Centrum Formy Dąbrowa Górnicza,,,,,,,,,,,,,,,SBD,Raw,
1,Marian Piwowarczyk,M,Masters 50-59,66,1961,PMKS Rybak Władysławowo,63,90,100,110,110,85,90,95,95,140,160,-170,160,365,SBD,Raw,
1,Marek Jaroniec,M,Masters 50-59,74,1967,KS Strength Coach Performance Wrocław,73,180,190.5,200,200,-100,105,115,115,190,200.5,205,205,520,SBD,Raw,
1,Andrzej Kozłowski,M,Masters 50-59,83,1969,KS Team Wrocław,82.2,-145,145,160.5,160.5,120,127.5,132.5,132.5,180,200,210,210,503,SBD,Raw,
1,Mirosław Kania,M,Masters 50-59,93,1966,TKKF Azory Kraków,93,210,220,-225,220,142.5,150,155.5,155.5,225,240,,240,615.5,SBD,Raw,
1,Andrzej Łasak,M,Masters 50-59,120,1966,LKS Nadwiślanin Kwidzyn,116.6,200,220,-232.5,220,170,180.5,,180.5,210,230,-237.5,230,630.5,SBD,Raw,
1,Henryk Hintzke,M,Masters 60-69,74,1957,PMKS Rybak Władysławowo,71.5,145,-155,160,160,95,100,-105,100,155,170,180,180,440,SBD,Raw,
NS,Franciszek Michałowski,M,Masters 60-69,74,1952,UKS Pover Kuźnik Chorzów,,,,,,,,,,,,,,,SBD,Raw,
1,Marian Cofalik,M,Masters 60-69,83,1956,Stow. Centrum Formy Dąbrowa Górnicza,77.7,160,170,180,180,85,-90,-90,85,180,190,-200,190,455,SBD,Raw,
2,Józef Gromek,M,Masters 60-69,93,1958,UKS Pover Kuźnik Chorzów,91.2,215,230,241,241,137.5,145,-150,145,240,260,273,273,659,SBD,Raw,
NS,Jan Krawiec,M,Masters 60-69,105,1954,KS Wisła Puławy,,,,,,,,,,,,,,,SBD,Raw,
