Division,WeightClassKg,Place,Name,Team,BodyweightKg,Best3SquatKg,Best3BenchKg,Best3DeadliftKg,TotalKg,Equipment,Event,Sex
Girls,44.23,1,Kassy Zamorano,Los Fresnos,43.82,127.01,74.84,129.27,331.12,Single-ply,SBD,F
Girls,44.23,2,Kaylynn Beltran,Donna,43.54,122.47,52.16,117.93,292.57,Single-ply,SBD,F
Girls,44.23,3,Jessica Peoples,Cedar Hill,42.82,111.13,49.9,124.74,285.76,Single-ply,SBD,F
Girls,44.23,4,Klarissa Gonzalez,San Benito,43.64,111.13,56.7,117.93,285.76,Single-ply,SBD,F
Girls,44.23,5,Chantal Garza,PSJA,41.1,113.4,47.63,120.2,281.23,Single-ply,SBD,F
Girls,44.23,6,Briana Birdine,Cedar Hill,43.27,113.4,38.56,129.27,281.23,Single-ply,SBD,F
Girls,44.23,7,Karissa Arroyo,San Marcos,41.28,99.79,49.9,124.74,274.42,Single-ply,SBD,F
Girls,44.23,8,Briseida Montoya,San Benito,44.18,108.86,56.7,108.86,274.42,Single-ply,SBD,F
Girls,44.23,9,Dani Burget,Weslaco East,42.82,95.25,49.9,120.2,265.35,Single-ply,SBD,F
Girls,44.23,10,Paulette Herrera,Midlothian,43.36,104.33,43.09,106.59,254.01,Single-ply,SBD,F
Girls,44.23,11,Regina Enriquez,PSJA North,43.73,88.45,36.29,108.86,233.6,Single-ply,SBD,F
Girls,44.23,12,Briana Hernandez,Clute Brazoswood,42.91,79.38,40.82,111.13,231.33,Single-ply,SBD,F
Girls,44.23,13,Sarah Gonzalez,San Benito,43.73,79.38,47.63,104.33,231.33,Single-ply,SBD,F
Girls,44.23,14,Gabriela Rodriguez,Del Valle,44.23,79.38,38.56,104.33,222.26,Single-ply,SBD,F
Girls,44.23,15,Allie Harvey,Beaumont West Brook,43.64,70.31,34.02,102.06,206.38,Single-ply,SBD,F
Girls,44.23,DQ,Beth De Hoyos,PSJA North,40.19,,,,,Single-ply,SBD,F
Girls,47.85,1,Sam Machuca,San Benito,45.9,147.42,70.31,151.95,369.68,Single-ply,SBD,F
Girls,47.85,2,Ashley Garay,Los Fresnos,47.54,163.29,61.23,145.15,369.68,Single-ply,SBD,F
Girls,47.85,3,Selena Guerrero,PSJA,47.45,122.47,61.23,142.88,326.59,Single-ply,SBD,F
Girls,47.85,4,Mary Lazo,Donna,46.9,129.27,47.63,140.61,317.51,Single-ply,SBD,F
Girls,47.85,5,Bianca Rodriguez,Weslaco East,46.81,120.2,47.63,140.61,308.44,Single-ply,SBD,F
Girls,47.85,6,Mirella Jaimes,Belton,47.63,108.86,54.43,122.47,285.76,Single-ply,SBD,F
Girls,47.85,7,Giselle Garcia,Clute Brazoswood,46.81,106.59,49.9,108.86,265.35,Single-ply,SBD,F
Girls,47.85,8,Jenica Flores,San Marcos,45.18,92.99,40.82,117.93,251.74,Single-ply,SBD,F
Girls,47.85,9,Gema Hernandez,Brownsville Pace,46.81,102.06,40.82,108.86,251.74,Single-ply,SBD,F
Girls,47.85,10,Taylor Skinner,Midlothian,47.26,97.52,52.16,92.99,242.67,Single-ply,SBD,F
Girls,47.85,11,Liliana Esquivel,Midlothian,45.54,92.99,36.29,102.06,231.33,Single-ply,SBD,F
Girls,47.85,12,Eugenie Raymond,Katy Mayde Creek,46.54,83.91,36.29,102.06,222.26,Single-ply,SBD,F
Girls,47.85,13,Mercedes Sagum,Mansfield Timberview,47.26,81.65,36.29,104.33,222.26,Single-ply,SBD,F
Girls,47.85,14,Ashia Haddock,Cedar Hill,46.63,83.91,43.09,90.72,217.72,Single-ply,SBD,F
Girls,47.85,15,Brianna Garcia,Odessa,46.99,58.97,31.75,74.84,165.56,Single-ply,SBD,F
Girls,47.85,DQ,Emilie Martinez,Weslaco,47.17,,,,,Single-ply,SBD,F
Girls,51.94,1,Alle Elizondo,Los Fresnos,51.8,145.15,77.11,149.69,371.95,Single-ply,SBD,F
Girls,51.94,2,Lily Escamilla,Midlothian,51.17,147.42,63.5,147.42,358.34,Single-ply,SBD,F
Girls,51.94,3,Katie San Miguel,Weslaco East,50.44,129.27,54.43,161.03,344.73,Single-ply,SBD,F
Girls,51.94,4,Gabby Rios,Weslaco East,50.8,142.88,58.97,136.08,337.93,Single-ply,SBD,F
Girls,51.94,5,Josefann Barber,PSJA North,51.44,115.67,58.97,145.15,319.78,Single-ply,SBD,F
Girls,51.94,6,Sydney Platt,Clute Brazoswood,50.89,111.13,74.84,122.47,308.44,Single-ply,SBD,F
Girls,51.94,7,Tiffany Landeros,Laredo United South,51.62,124.74,45.36,131.54,301.64,Single-ply,SBD,F
Girls,51.94,8,Jazmine Serrano,Weslaco East,50.71,120.2,54.43,122.47,297.1,Single-ply,SBD,F
Girls,51.94,9,Ashley Martinez,Donna,49.62,113.4,54.43,127.01,294.84,Single-ply,SBD,F
Girls,51.94,10,Melissa Rojas,Mission Sharyland,51.44,102.06,58.97,133.81,294.84,Single-ply,SBD,F
Girls,51.94,11,Sarah Moraida,Brownsville Pace,51.62,117.93,58.97,117.93,294.84,Single-ply,SBD,F
Girls,51.94,12,Lizbeth Camarillo,Laredo United South,51.17,129.27,54.43,108.86,292.57,Single-ply,SBD,F
Girls,51.94,13,Priscilla Reyna,Mission Sharyland,50.17,111.13,52.16,127.01,290.3,Single-ply,SBD,F
Girls,51.94,14,Janie Ramos,Weslaco East,51.07,111.13,45.36,133.81,290.3,Single-ply,SBD,F
Girls,51.94,15,Christi Corkran,College Station A&M Cons,49.8,108.86,49.9,127.01,285.76,Single-ply,SBD,F
Girls,51.94,16,Kris Vallejo,San Benito,49.9,99.79,52.16,122.47,274.42,Single-ply,SBD,F
Girls,51.94,17,Kaitlyn Harris,Bryan,50.89,104.33,47.63,122.47,274.42,Single-ply,SBD,F
Girls,51.94,18,McKynsi Moore,Midlothian,51.26,92.99,49.9,111.13,254.01,Single-ply,SBD,F
Girls,51.94,19,Charli Miller,Mansfield,51.89,92.99,49.9,111.13,254.01,Single-ply,SBD,F
Girls,51.94,20,Morgan McMahon,Katy Mayde Creek,50.35,90.72,47.63,102.06,240.4,Single-ply,SBD,F
Girls,51.94,21,Hope Boyd,Abilene,50.98,81.65,45.36,97.52,224.53,Single-ply,SBD,F
Girls,51.94,DQ,Alyson Galanga,Cedar Hill,50.53,,,,,Single-ply,SBD,F
Girls,51.94,DQ,Nicole Brown #1,Los Fresnos,51.17,,,,,Single-ply,SBD,F
Girls,51.94,DQ,Calie Spencer,Comal Canyon,50.44,,,,,Single-ply,SBD,F
Girls,51.94,DQ,Alissa Leija,PSJA North,51.07,108.86,,,,Single-ply,SBD,F
Girls,51.94,DQ,Karrina Garza,PSJA North,51.07,106.14,,,,Single-ply,SBD,F
Girls,56.02,1,Alexandra Winfree,Mission Sharyland,54.25,133.81,63.5,165.56,362.87,Single-ply,SBD,F
Girls,56.02,2,Doris Gutierrez,Weslaco East,55.25,147.42,58.97,156.49,362.87,Single-ply,SBD,F
Girls,56.02,3,Isabel Garcia,Mission Sharyland,54.43,145.15,58.97,147.42,351.53,Single-ply,SBD,F
Girls,56.02,4,Darlyn Umanzor,Donna,55.7,149.69,56.7,136.08,342.46,Single-ply,SBD,F
Girls,56.02,5,Byanka Arreola,Los Fresnos,55.16,136.08,52.16,147.42,335.66,Single-ply,SBD,F
Girls,56.02,6,Kristan Cazares,Weslaco East,54.16,142.88,58.97,129.27,331.12,Single-ply,SBD,F
Girls,56.02,7,Sasha Alvardo,Weslaco East,55.16,129.27,54.43,129.27,312.98,Single-ply,SBD,F
Girls,56.02,8,Cassy Cordova,PSJA,55.34,106.59,65.77,138.35,310.71,Single-ply,SBD,F
Girls,56.02,9,Chase Magnuson,Manvel,54.43,113.4,61.23,129.27,303.91,Single-ply,SBD,F
Girls,56.02,10,Tia Coleman,Mansfield Timberview,54.25,99.79,49.9,147.42,297.1,Single-ply,SBD,F
Girls,56.02,11,Hannah Hendrix,Midlothian,54.43,113.4,52.16,111.13,276.69,Single-ply,SBD,F
Girls,56.02,12,Azia Valdez,Mansfield Timberview,54.88,115.67,45.36,115.67,276.69,Single-ply,SBD,F
Girls,56.02,13,Danielle Vasquez,Alvin,55.25,97.52,54.43,124.74,276.69,Single-ply,SBD,F
Girls,56.02,14,Brianna Carrisalez,Abilene,53.52,88.45,43.09,104.33,235.87,Single-ply,SBD,F
Girls,56.02,DQ,Kristian Martinez #1,San Benito,54.79,99.79,,,,Single-ply,SBD,F
Girls,56.02,DQ,Briana Webster,Odessa Permian,55.16,,,,,Single-ply,SBD,F
Girls,56.02,DQ,Salina Rutherford,Belton,52.44,,,,,Single-ply,SBD,F
Girls,56.02,DQ,Amber Boyd,Copperas Cove,53.71,,,,,Single-ply,SBD,F
Girls,60.1,1,Karina Garcia,San Benito,58.6,154.22,72.57,154.22,381.02,Single-ply,SBD,F
Girls,60.1,2,Bryanna Ramirez,Mission Sharyland,57.52,131.54,65.77,158.76,356.07,Single-ply,SBD,F
Girls,60.1,3,Kathy Gonzalez,Weslaco East,58.33,142.88,58.97,147.42,349.27,Single-ply,SBD,F
Girls,60.1,4,Vivian Saldana,PSJA North,59.51,129.27,56.7,149.69,335.66,Single-ply,SBD,F
Girls,60.1,5,Kristin Nwakama,Mansfield Timberview,58.51,133.81,54.43,133.81,322.05,Single-ply,SBD,F
Girls,60.1,6,Cierra Jackson,Mansfield Timberview,58.15,122.47,49.9,136.08,308.44,Single-ply,SBD,F
Girls,60.1,7,Lexias Ozen,Port Arthur Memorial,60.06,120.2,54.43,127.01,301.64,Single-ply,SBD,F
Girls,60.1,8,Kassie Riley,Beaumont West Brook,58.51,115.67,49.9,127.01,292.57,Single-ply,SBD,F
Girls,60.1,9,Andrea Castro,Midlothian,58.42,117.93,45.36,108.86,272.16,Single-ply,SBD,F
Girls,60.1,10,Molly Earles,Abilene,59.69,83.91,38.56,99.79,222.26,Single-ply,SBD,F
Girls,60.1,DQ,Grace Bell,Midlothian,59.15,124.74,,,,Single-ply,SBD,F
Girls,67.36,1,Kristian Hernandez,PSJA North,63.68,147.42,77.11,165.56,390.09,Single-ply,SBD,F
Girls,67.36,2,Mayte Escalante,Weslaco East,60.78,147.42,65.77,145.15,358.34,Single-ply,SBD,F
Girls,67.36,3,Reagan McGuire,Midlothian,65.86,145.15,61.23,145.15,351.53,Single-ply,SBD,F
Girls,67.36,4,Janelle Davila,PSJA North,65.86,127.01,68.04,149.69,344.73,Single-ply,SBD,F
Girls,67.36,5,Maegen Delgado,San Marcos,65.68,127.01,61.23,149.69,337.93,Single-ply,SBD,F
Girls,67.36,6,Maggie Salinas,Donna,66.04,136.08,54.43,145.15,335.66,Single-ply,SBD,F
Girls,67.36,7,Cassie Urrea,San Marcos,67.31,120.2,81.65,131.54,333.39,Single-ply,SBD,F
Girls,67.36,8,Maritza De La Fuente,Weslaco East,65.41,127.01,68.04,127.01,322.05,Single-ply,SBD,F
Girls,67.36,9,Keyaire Williams,Cedar Hill,66.41,111.13,56.7,136.08,303.91,Single-ply,SBD,F
Girls,67.36,10,Kaylee Goerig,Midlothian,65.68,127.01,52.16,115.67,294.84,Single-ply,SBD,F
Girls,67.36,11,Shania Hamrick,Manvel,65.41,113.4,52.16,115.67,281.23,Single-ply,SBD,F
Girls,67.36,12,Loresa Cassola,Alvin,60.96,111.13,56.7,90.72,258.55,Single-ply,SBD,F
Girls,67.36,13,Katlyn McCoy,Abilene,61.33,97.52,49.9,111.13,258.55,Single-ply,SBD,F
Girls,67.36,DQ,Osheiona Gipson,Cedar Hill,65.32,,,,,Single-ply,SBD,F
Girls,75.07,1,Olivia Espinoza,Weslaco East,73.57,183.7,95.25,151.95,430.91,Single-ply,SBD,F
Girls,75.07,2,Dakota Young,College Station A&M Cons,70.49,163.29,72.57,181.44,417.3,Single-ply,SBD,F
Girls,75.07,3,Lyn Trejo,PSJA North,73.21,163.29,79.38,154.22,396.89,Single-ply,SBD,F
Girls,75.07,4,Victoria Davila,San Marcos,73.57,167.83,81.65,147.42,396.89,Single-ply,SBD,F
Girls,75.07,5,Mary Ann Gonzalez,Brownsville Porter,73.75,163.29,61.23,133.81,358.34,Single-ply,SBD,F
Girls,75.07,6,Ashley Garza,Mission Sharyland,72.3,142.88,70.31,142.88,356.07,Single-ply,SBD,F
Girls,75.07,7,Megan Denman,Conroe,73.03,138.35,52.16,151.95,342.46,Single-ply,SBD,F
Girls,75.07,8,Kya Charron,Keller Timber Creek,69.94,129.27,74.84,136.08,340.19,Single-ply,SBD,F
Girls,75.07,9,Aleesha Coffer,Longview,70.85,129.27,63.5,147.42,340.19,Single-ply,SBD,F
Girls,75.07,10,Elena Zamora,La Joya Juarez-Lincoln,72.39,133.81,58.97,145.15,337.93,Single-ply,SBD,F
Girls,75.07,11,Laycae Hood,Cedar Hill,73.66,127.01,52.16,140.61,319.78,Single-ply,SBD,F
Girls,75.07,12,Madelynn Mahoney,Manvel,71.49,124.74,49.9,115.67,290.3,Single-ply,SBD,F
Girls,75.07,13,Hannah Wood,Odessa Permian,70.03,99.79,43.09,106.59,249.48,Single-ply,SBD,F
Girls,75.07,DQ,Susana Mancilla,Midlothian,71.67,,,,,Single-ply,SBD,F
Girls,82.33,1,Cindy Galvan,Weslaco East,80.65,210.92,117.93,170.1,498.95,Single-ply,SBD,F
Girls,82.33,2,Vynesa Wilburn,San Marcos,79.74,163.29,79.38,156.49,399.16,Single-ply,SBD,F
Girls,82.33,3,Jessica Lopez,PSJA,77.93,147.42,81.65,165.56,394.63,Single-ply,SBD,F
Girls,82.33,4,Kyndall Foust,College Station A&M Cons,78.38,154.22,74.84,158.76,387.82,Single-ply,SBD,F
Girls,82.33,5,Mischelle Rodriguez,PSJA North,79.47,167.83,68.04,140.61,376.48,Single-ply,SBD,F
Girls,82.33,6,Destinie Holiday,Beaumont West Brook,77.29,136.08,74.84,161.03,371.95,Single-ply,SBD,F
Girls,82.33,7,Julie Torres,Los Fresnos,78.02,161.03,63.5,145.15,369.68,Single-ply,SBD,F
Girls,82.33,8,Stephany Garza,Keller Timber Creek,79.47,154.22,72.57,136.08,362.87,Single-ply,SBD,F
Girls,82.33,9,Lauren Higbee,Rockwall-Heath,75.39,124.74,56.7,151.95,333.39,Single-ply,SBD,F
Girls,82.33,10,Kayla Petersen,Clute Brazoswood,81.92,104.33,56.7,138.35,299.37,Single-ply,SBD,F
Girls,82.33,11,Storri Williams,Midlothian,78.74,113.4,54.43,129.27,297.1,Single-ply,SBD,F
Girls,82.33,12,Francesqa Kaggwa,San Angelo Central,76.48,120.2,58.97,108.86,288.03,Single-ply,SBD,F
Girls,82.33,13,Ryen Russeau,Tyler Lee,78.02,102.06,49.9,127.01,278.96,Single-ply,SBD,F
Girls,82.33,14,Ti'Tanna Morgan,Abilene,78.29,90.72,47.63,99.79,238.14,Single-ply,SBD,F
Girls,82.33,DQ,Crystal Leal,Brownsville Pace,76.11,,,,,Single-ply,SBD,F
Girls,90.04,1,Kami Stockett,Mansfield,84.46,165.56,74.84,181.44,421.84,Single-ply,SBD,F
Girls,90.04,2,Teresita Silva,Los Fresnos,87.91,176.9,90.72,147.42,415.04,Single-ply,SBD,F
Girls,90.04,3,Delila Silva,San Benito,86.91,163.29,92.99,142.88,399.16,Single-ply,SBD,F
Girls,90.04,4,Sophia Ortiz,PSJA Memorial,87.82,154.22,65.77,154.22,374.21,Single-ply,SBD,F
Girls,90.04,5,Riley Garza,San Benito,87.27,131.54,90.72,142.88,365.14,Single-ply,SBD,F
Girls,90.04,6,Cecelia Sambrano,Alvin,88.9,158.76,70.31,136.08,365.14,Single-ply,SBD,F
Girls,90.04,7,Abbey Dolan,Belton,88.9,142.88,63.5,138.35,344.73,Single-ply,SBD,F
Girls,90.04,8,Danessa Ruiz,Belton,87.82,117.93,58.97,120.2,297.1,Single-ply,SBD,F
Girls,90.04,9,Brasjanae Riley-Morgan,Cedar Hill,85,124.74,56.7,113.4,294.84,Single-ply,SBD,F
Girls,90.04,10,Staci McGaughy,Tyler Lee,85.37,99.79,52.16,120.2,272.16,Single-ply,SBD,F
Girls,90.04,DQ,Alyssa Morales,Clute Brazoswood,89.45,124.74,,,,Single-ply,SBD,F
Girls,90.04,DQ,Claudia Gomez,Mission Sharyland,88.99,,,,,Single-ply,SBD,F
Girls,100.02,1,Alyssa Jaramillo,Weslaco East,95.89,217.72,99.79,185.97,503.49,Single-ply,SBD,F
Girls,100.02,2,Sol Villarreal,San Benito,97.98,197.31,88.45,163.29,449.06,Single-ply,SBD,F
Girls,100.02,3,Chloe Lewis,Belton,94.08,161.03,90.72,174.63,426.38,Single-ply,SBD,F
Girls,100.02,4,Monica Gonzalez,Brownsville Veterans Memorial,95.89,183.7,72.57,158.76,415.04,Single-ply,SBD,F
Girls,100.02,5,Faith Olszak,Weslaco East,98.43,183.7,74.84,154.22,412.77,Single-ply,SBD,F
Girls,100.02,6,Audra Ochoa,PSJA,97.25,163.29,74.84,149.69,387.82,Single-ply,SBD,F
Girls,100.02,7,Alexis Delgado #1,Weslaco,97.07,170.1,72.57,136.08,378.75,Single-ply,SBD,F
Girls,100.02,8,Meghan Williams,Beaumont West Brook,94.26,147.42,70.31,149.69,367.41,Single-ply,SBD,F
Girls,100.02,9,Antonia Rodriguez,Copperas Cove,99.52,140.61,70.31,156.49,367.41,Single-ply,SBD,F
Girls,100.02,10,Maxine Etti,Mansfield Timberview,90.08,131.54,54.43,158.76,344.73,Single-ply,SBD,F
Girls,100.02,11,Amauche Orji,Mansfield Timberview,94.8,131.54,52.16,158.76,342.46,Single-ply,SBD,F
Girls,100.02,12,Jerrika McDonald,Clute Brazoswood,97.07,138.35,63.5,138.35,340.19,Single-ply,SBD,F
Girls,100.02,13,Ketta Timmons,Tyler Lee,97.25,97.52,52.16,124.74,274.42,Single-ply,SBD,F
Girls,100.02,14,Mattison Drake,Midlothian,98.79,113.4,40.82,111.13,265.35,Single-ply,SBD,F
Girls,100.02,15,Erika Castro,Abilene,97.61,102.06,38.56,113.4,254.01,Single-ply,SBD,F
Girls,100.02+,1,Jaelynn Clark,San Antonio East Central,124.38,272.16,117.93,213.19,603.28,Single-ply,SBD,F
Girls,100.02+,2,Alexia Correa,San Benito,116.85,215.46,97.52,181.44,494.42,Single-ply,SBD,F
Girls,100.02+,3,Courtney Delgado,San Antonio East Central,108.5,190.51,83.91,154.22,428.64,Single-ply,SBD,F
Girls,100.02+,4,Olivia de la Cruz,Copperas Cove,109.13,181.44,74.84,170.1,426.38,Single-ply,SBD,F
Girls,100.02+,5,Brisi Herrera,Donna,106.78,190.51,86.18,147.42,424.11,Single-ply,SBD,F
Girls,100.02+,6,Charis Pompa,Weslaco,126.64,181.44,79.38,161.03,421.84,Single-ply,SBD,F
Girls,100.02+,7,Racquel Blue,Bryan,112.13,154.22,77.11,156.49,387.82,Single-ply,SBD,F
Girls,100.02+,8,Courtney Trice,Midland,117.3,142.88,65.77,154.22,362.87,Single-ply,SBD,F
Girls,100.02+,9,Devin Cantu #1,Cedar Hill,110.86,140.61,65.77,149.69,356.07,Single-ply,SBD,F
Girls,100.02+,10,Mariah Ramos,Odessa,122.92,154.22,68.04,124.74,347,Single-ply,SBD,F
Girls,100.02+,11,Krystal Gonzalez,Manvel,103.42,145.15,56.7,122.47,324.32,Single-ply,SBD,F
Girls,100.02+,DQ,Blanca Vega,Cedar Hill,111.67,,,,,Single-ply,SBD,F
Girls,100.02+,DQ,Daizya Adams,Beaumont West Brook,159.3,,,,,Single-ply,SBD,F
Girls,,NS,Emily Torrez,Austin Bowie,,,,,,Single-ply,SBD,F
Girls,,NS,Jordan Lopez #1,Midland,,,,,,Single-ply,SBD,F
Girls,,NS,Claire Parker,San Angelo Central,,,,,,Single-ply,SBD,F
