<?xml version="1.0" encoding="UTF-8" standalone="no"?>
<!DOCTYPE svg PUBLIC "-//W3C//DTD SVG 1.1//EN" "http://www.w3.org/Graphics/SVG/1.1/DTD/svg11.dtd">
<svg width="100%" height="100%" viewBox="0 0 800 600" version="1.1" xmlns="http://www.w3.org/2000/svg" xmlns:xlink="http://www.w3.org/1999/xlink" xml:space="preserve" xmlns:serif="http://www.serif.com/" style="fill-rule:evenodd;clip-rule:evenodd;stroke-linejoin:round;stroke-miterlimit:2;">
    <g id="ar-camera" transform="matrix(0.294922,0,0,0.294922,400,301.5)">
        <g transform="matrix(1,0,0,1,-256,-256)">
            <clipPath id="_clip1">
                <rect x="0" y="0" width="512" height="512"/>
            </clipPath>
            <g clip-path="url(#_clip1)">
                <g>
                    <path d="M467,121L380.297,121L369.12,65.117C366.326,51.143 353.954,41 339.703,41L172.297,41C158.047,41 145.674,51.143 142.88,65.117L131.703,121L45,121C20.187,121 0,141.187 0,166L0,426C0,450.813 20.187,471 45,471L467,471C491.813,471 512,450.813 512,426L512,166C512,141.187 491.813,121 467,121ZM172.297,71L339.703,71L349.703,121L162.297,121L172.297,71ZM482,426C482,434.271 475.271,441 467,441L45,441C36.729,441 30,434.271 30,426L30,166C30,157.729 36.729,151 45,151L467,151C475.271,151 482,157.729 482,166L482,426Z" style="fill-rule:nonzero;"/>
                    <path d="M256,185C194.794,185 145,234.794 145,296C145,357.206 194.794,407 256,407C317.206,407 367,357.206 367,296C367,234.794 317.206,185 256,185ZM256,377C211.336,377 175,340.663 175,296C175,251.337 211.336,215 256,215C300.664,215 337,251.337 337,296C337,340.663 300.664,377 256,377Z" style="fill-rule:nonzero;"/>
                    <path d="M128,185L80,185C71.716,185 65,191.716 65,200C65,208.284 71.716,215 80,215L128,215C136.284,215 143,208.284 143,200C143,191.716 136.284,185 128,185Z" style="fill-rule:nonzero;"/>
                </g>
            </g>
        </g>
    </g>
    <g transform="matrix(6.4,0,0,4.61538,-672,-221.538)">
        <rect x="105" y="48" width="125" height="130" style="fill-opacity:0.1;"/>
    </g>
</svg>
