{
  "log_in": [
    {
      "imageSrc": "",
      "title": "عالم الجغرافية",
      "description": "في هذه الدورة تجدون مكثفة شاملة في مادة عالم الجغرافية للصف التاسع الأساسي",
      "stars": 4.6,
      "reviews": 122,
      "points": 1000
    },
    {
      "imageSrc": "",
      "title": "اللّغة العربيّة",
      "description": "في هذه الدورة تجدون مكثفة شاملة في مادة الفيزياء و الكيمياء للصف التاسع الأساسي",
      "stars": 4.5,
      "reviews": 132,
      "points": 1100
    },
    {
      "imageSrc": "",
      "title": "علم الأحياء و الأرض",
      "description": "في هذه الدورة تجدون مكثفة شاملة في مادة علم الأحياء و الأرض للصف التاسع الأساسي",
      "stars": 3.6,
      "reviews": 32,
      "points": 1200
    },
    {
      "imageSrc": "",
      "title": "الفيزياء و الكيمياء",
      "description": "في هذه الدورة تجدون مكثفة شاملة في مادة الفيزياء و الكيمياء للصف التاسع الأساسي",
      "stars": 3,
      "reviews": 12,
      "points": 900
    },
    {
      "imageSrc": "",
      "title": "عالم الجغرافية",
      "description": "في هذه الدورة تجدون مكثفة شاملة في مادة عالم الجغرافية للصف التاسع الأساسي",
      "stars": 4.6,
      "reviews": 122,
      "points": 1000
    },
    {
      "imageSrc": "",
      "title": "اللّغة العربيّة",
      "description": "في هذه الدورة تجدون مكثفة شاملة في مادة الفيزياء و الكيمياء للصف التاسع الأساسي",
      "stars": 4.5,
      "reviews": 132,
      "points": 1100
    }
  ],
  "register": [
    {
      "country_code": "963",
      "phone": "777656445",
      "full_name": "محمد همام عبدالباقي",
      "father_name": "يوسف",
      "country": "الجمهورية العربية السورية",
      "state": "",
      "location": "",
      "password": "JKJJF*&84jkjf89r84",
      "confirm_password": "JKJJF*&84jkjf89r84",
      "Device_id": "455",
      "id": 1
    },
    {
      "country_code": "49",
      "phone": "634231423423",
      "full_name": "محمد همام عبدالباقي",
      "father_name": "يوسف",
      "country": "جمهورية مصر العربية",
      "state": "",
      "location": "",
      "password": "234@#$fsdfFASDF",
      "confirm_password": "234@#$fsdfFASDF",
      "Device_id": "455",
      "id": 2
    }
  ],
  "login": [
    {
      "country_code": "963",
      "phone": "54235435235",
      "password": "JJHjhh766%%",
      "Device_id": "455",
      "id": 1
    },
    {
      "country_code": "1",
      "phone": "3623628881",
      "password": "JHjh&^7676T7",
      "Device_id": "455",
      "id": 2
    },
    {
      "country_code": "963",
      "phone": "985924835982",
      "password": "P@ss2324",
      "Device_id": "455",
      "id": 3
    },
    {
      "country_code": "963",
      "phone": "985924835982",
      "password": "kfjaskdjf*&*8787Jjk",
      "Device_id": "455",
      "id": 4
    },
    {
      "country_code": "963",
      "phone": "34124324",
      "password": "fFFD445$ff",
      "Device_id": "455",
      "id": 5
    },
    {
      "country_code": "963",
      "phone": "4312413241",
      "password": "fasdfFD$$%55",
      "Device_id": "455",
      "id": 6
    },
    {
      "country_code": "963",
      "phone": "412431432143",
      "password": "KJkjk655^^^",
      "Device_id": "455",
      "id": 7
    },
    {
      "country_code": "963",
      "phone": "8989898989",
      "password": "LKKLLkkkj^^565",
      "Device_id": "455",
      "id": 8
    }
  ]
}