{
    "openapi": "3.0.0",
    "info": {
        "title": "Loaner app",
        "description": "find the lone you want",
        "version": "1.0.0",
        "x-logo": {
            "url": "https://via.placeholder.com/190x90.png?text=L5-Swagger"
        }
    },
    "paths": {
        "/api/admin/apply": {
            "get": {
                "tags": [
                    "Admin"
                ],
                "summary": "Get list of Applies",
                "description": "Returns list of Applies",
                "operationId": "getAllApplies",
                "responses": {
                    "200": {
                        "description": "Successful operation"
                    },
                    "401": {
                        "description": "Unauthenticated"
                    },
                    "403": {
                        "description": "Forbidden"
                    }
                },
                "security": [
                    {
                        "Bearer": []
                    }
                ]
            }
        },
        "/api/admin/apply/{id}": {
            "get": {
                "tags": [
                    "Admin"
                ],
                "summary": "Get a apply",
                "description": "Returns q apply",
                "operationId": "getaApply",
                "parameters": [
                    {
                        "name": "id",
                        "in": "path",
                        "required": true
                    }
                ],
                "responses": {
                    "200": {
                        "description": "Successful operation"
                    },
                    "401": {
                        "description": "Unauthenticated"
                    },
                    "403": {
                        "description": "Forbidden"
                    },
                    "404": {
                        "description": "Not Found"
                    }
                },
                "security": [
                    {
                        "Bearer": []
                    }
                ]
            },
            "put": {
                "tags": [
                    "Admin"
                ],
                "summary": "update apply",
                "description": "update apply",
                "operationId": "putApply",
                "parameters": [
                    {
                        "name": "id",
                        "in": "path",
                        "required": true
                    }
                ],
                "requestBody": {
                    "content": {
                        "application/json": {
                            "schema": {
                                "properties": {
                                    "status": {
                                        "type": "string",
                                        "example": "accept"
                                    }
                                },
                                "type": "object"
                            }
                        }
                    }
                },
                "responses": {
                    "200": {
                        "description": "successful operation",
                        "content": {
                            "application/json": {
                                "schema": {
                                    "properties": {
                                        "msq": {
                                            "type": "string",
                                            "example": "updated successfully"
                                        },
                                        "data": {
                                            "type": "object",
                                            "example": "{...}"
                                        }
                                    },
                                    "type": "object"
                                }
                            }
                        }
                    }
                }
            }
        },
        "/api/admin/contract": {
            "get": {
                "tags": [
                    "Admin"
                ],
                "summary": "Get list of Contracts",
                "description": "Returns list of Contracts",
                "operationId": "getAllContracts",
                "responses": {
                    "200": {
                        "description": "Successful operation"
                    },
                    "401": {
                        "description": "Unauthenticated"
                    },
                    "403": {
                        "description": "Forbidden"
                    }
                },
                "security": [
                    {
                        "Bearer": []
                    }
                ]
            }
        },
        "/api/admin/contract/{id}": {
            "get": {
                "tags": [
                    "Admin"
                ],
                "summary": "Get a Contract",
                "description": "Returns q Contract",
                "operationId": "getContracts",
                "parameters": [
                    {
                        "name": "id",
                        "in": "path",
                        "required": true
                    }
                ],
                "responses": {
                    "200": {
                        "description": "Successful operation"
                    },
                    "401": {
                        "description": "Unauthenticated"
                    },
                    "403": {
                        "description": "Forbidden"
                    },
                    "404": {
                        "description": "Not Found"
                    }
                },
                "security": [
                    {
                        "Bearer": []
                    }
                ]
            }
        },
        "/api/register": {
            "post": {
                "tags": [
                    "Auth"
                ],
                "summary": "Register User",
                "description": "Register User",
                "operationId": "postRegister",
                "requestBody": {
                    "content": {
                        "application/json": {
                            "schema": {
                                "properties": {
                                    "name": {
                                        "type": "string",
                                        "example": "hassan"
                                    },
                                    "email": {
                                        "type": "string",
                                        "example": "hassan@gmail.com"
                                    },
                                    "address": {
                                        "type": "string",
                                        "example": "hassan street"
                                    },
                                    "mobile": {
                                        "type": "integer",
                                        "example": "09121112233"
                                    },
                                    "nin": {
                                        "type": "integer",
                                        "example": "0010102564"
                                    },
                                    "password": {
                                        "type": "string",
                                        "example": "hassan@123"
                                    },
                                    "password_confirmation": {
                                        "type": "string",
                                        "example": "hassan@123"
                                    }
                                },
                                "type": "object"
                            }
                        }
                    }
                },
                "responses": {
                    "200": {
                        "description": "successful operation",
                        "content": {
                            "application/json": {
                                "schema": {
                                    "properties": {
                                        "msq": {
                                            "type": "string",
                                            "example": "your registration has been successfully completed"
                                        }
                                    },
                                    "type": "object"
                                }
                            }
                        }
                    }
                }
            }
        },
        "/api/login": {
            "post": {
                "tags": [
                    "Auth"
                ],
                "summary": "Login User",
                "description": "Login User",
                "operationId": "postLogin",
                "requestBody": {
                    "content": {
                        "application/json": {
                            "schema": {
                                "properties": {
                                    "email": {
                                        "type": "string",
                                        "example": "user@user.com"
                                    },
                                    "password": {
                                        "type": "string",
                                        "example": "user@123"
                                    }
                                },
                                "type": "object"
                            }
                        }
                    }
                },
                "responses": {
                    "200": {
                        "description": "successful operation",
                        "content": {
                            "application/json": {
                                "schema": {
                                    "properties": {
                                        "msq": {
                                            "type": "string",
                                            "example": "login successful"
                                        },
                                        "access_token": {
                                            "type": "string",
                                            "example": "ecdfsd...."
                                        }
                                    },
                                    "type": "object"
                                }
                            }
                        }
                    }
                }
            }
        },
        "/api/loan-category": {
            "get": {
                "tags": [
                    "Admin",
                    "User"
                ],
                "summary": "Get list of categories",
                "description": "Returns list of categories",
                "operationId": "getLoanCategoryList",
                "responses": {
                    "200": {
                        "description": "Successful operation"
                    },
                    "401": {
                        "description": "Unauthenticated"
                    },
                    "403": {
                        "description": "Forbidden"
                    }
                },
                "security": [
                    {
                        "Bearer": []
                    }
                ]
            },
            "post": {
                "tags": [
                    "Admin"
                ],
                "summary": "create category",
                "description": "create category",
                "operationId": "postCategory",
                "requestBody": {
                    "content": {
                        "application/json": {
                            "schema": {
                                "properties": {
                                    "title": {
                                        "type": "string",
                                        "example": "category 2"
                                    },
                                    "description": {
                                        "type": "string",
                                        "example": "category 2 description"
                                    }
                                },
                                "type": "object"
                            }
                        }
                    }
                },
                "responses": {
                    "200": {
                        "description": "successful operation",
                        "content": {
                            "application/json": {
                                "schema": {
                                    "properties": {
                                        "msq": {
                                            "type": "string",
                                            "example": "stored successfully"
                                        },
                                        "data": {
                                            "type": "object",
                                            "example": "{...}"
                                        }
                                    },
                                    "type": "object"
                                }
                            }
                        }
                    }
                }
            }
        },
        "/api/loan-category/{id}": {
            "get": {
                "tags": [
                    "Admin",
                    "User"
                ],
                "summary": "Get a category",
                "description": "Get a category",
                "operationId": "getLoanCategory",
                "parameters": [
                    {
                        "name": "id",
                        "in": "path",
                        "required": true
                    }
                ],
                "responses": {
                    "200": {
                        "description": "Successful operation"
                    },
                    "401": {
                        "description": "Unauthenticated"
                    },
                    "403": {
                        "description": "Forbidden"
                    }
                },
                "security": [
                    {
                        "Bearer": []
                    }
                ]
            },
            "put": {
                "tags": [
                    "Admin"
                ],
                "summary": "update category",
                "description": "update category",
                "operationId": "putCategory",
                "parameters": [
                    {
                        "name": "id",
                        "in": "path",
                        "required": true
                    }
                ],
                "requestBody": {
                    "content": {
                        "application/json": {
                            "schema": {
                                "properties": {
                                    "title": {
                                        "type": "string",
                                        "example": "category 3"
                                    },
                                    "description": {
                                        "type": "string",
                                        "example": "cate 3"
                                    }
                                },
                                "type": "object"
                            }
                        }
                    }
                },
                "responses": {
                    "200": {
                        "description": "successful operation",
                        "content": {
                            "application/json": {
                                "schema": {
                                    "properties": {
                                        "msq": {
                                            "type": "string",
                                            "example": "updated successfully"
                                        },
                                        "data": {
                                            "type": "object",
                                            "example": "{...}"
                                        }
                                    },
                                    "type": "object"
                                }
                            }
                        }
                    }
                }
            },
            "delete": {
                "tags": [
                    "Admin"
                ],
                "summary": "delete category",
                "description": "delete category",
                "operationId": "deleteCategory",
                "parameters": [
                    {
                        "name": "id",
                        "in": "path",
                        "required": true
                    }
                ],
                "responses": {
                    "200": {
                        "description": "successful operation",
                        "content": {
                            "application/json": {
                                "schema": {
                                    "properties": {
                                        "msq": {
                                            "type": "string",
                                            "example": "deleted successfully"
                                        },
                                        "data": {
                                            "type": "object",
                                            "example": "{...}"
                                        }
                                    },
                                    "type": "object"
                                }
                            }
                        }
                    }
                }
            }
        },
        "/api/loan-contract": {
            "get": {
                "tags": [
                    "User"
                ],
                "summary": "Get User Contracts",
                "description": "Returns User Contracts",
                "operationId": "getUserContracts",
                "parameters": [
                    {
                        "name": "id",
                        "in": "path",
                        "required": true
                    }
                ],
                "responses": {
                    "200": {
                        "description": "Successful operation"
                    },
                    "401": {
                        "description": "Unauthenticated"
                    },
                    "403": {
                        "description": "Forbidden"
                    },
                    "404": {
                        "description": "Not Found"
                    }
                },
                "security": [
                    {
                        "Bearer": []
                    }
                ]
            },
            "post": {
                "tags": [
                    "Admin"
                ],
                "summary": "create contract",
                "description": "create contract",
                "operationId": "postContract",
                "requestBody": {
                    "content": {
                        "application/json": {
                            "schema": {
                                "properties": {
                                    "user_id": {
                                        "type": "integer",
                                        "example": "2"
                                    },
                                    "contract": {
                                        "type": "string",
                                        "example": "contract hash"
                                    }
                                },
                                "type": "object"
                            }
                        }
                    }
                },
                "responses": {
                    "200": {
                        "description": "successful operation",
                        "content": {
                            "application/json": {
                                "schema": {
                                    "properties": {
                                        "msq": {
                                            "type": "string",
                                            "example": "you applied successfully"
                                        },
                                        "data": {
                                            "type": "object",
                                            "example": "{...}"
                                        }
                                    },
                                    "type": "object"
                                }
                            }
                        }
                    }
                }
            }
        },
        "/api/loan-contract/{id}": {
            "get": {
                "tags": [
                    "User"
                ],
                "summary": "Get a contract",
                "description": "Returns a contract",
                "operationId": "getaContract",
                "parameters": [
                    {
                        "name": "id",
                        "in": "path",
                        "required": true
                    }
                ],
                "responses": {
                    "200": {
                        "description": "Successful operation"
                    },
                    "401": {
                        "description": "Unauthenticated"
                    },
                    "403": {
                        "description": "Forbidden"
                    },
                    "404": {
                        "description": "Not Found"
                    }
                },
                "security": [
                    {
                        "Bearer": []
                    }
                ]
            },
            "put": {
                "tags": [
                    "Admin"
                ],
                "summary": "update contract",
                "description": "update contract",
                "operationId": "putContract",
                "parameters": [
                    {
                        "name": "id",
                        "in": "path",
                        "required": true
                    }
                ],
                "requestBody": {
                    "content": {
                        "application/json": {
                            "schema": {
                                "properties": {
                                    "payment": {
                                        "type": "integer",
                                        "example": "1"
                                    }
                                },
                                "type": "object"
                            }
                        }
                    }
                },
                "responses": {
                    "200": {
                        "description": "successful operation",
                        "content": {
                            "application/json": {
                                "schema": {
                                    "properties": {
                                        "msq": {
                                            "type": "string",
                                            "example": "updated successfully"
                                        },
                                        "data": {
                                            "type": "object",
                                            "example": "{...}"
                                        }
                                    },
                                    "type": "object"
                                }
                            }
                        }
                    }
                }
            }
        },
        "/api/loans": {
            "get": {
                "tags": [
                    "User",
                    "Admin"
                ],
                "summary": "Get list of projects",
                "description": "Returns list of projects",
                "operationId": "getLoans",
                "responses": {
                    "200": {
                        "description": "Successful operation"
                    },
                    "401": {
                        "description": "Unauthenticated"
                    },
                    "403": {
                        "description": "Forbidden"
                    }
                },
                "security": [
                    {
                        "Bearer": []
                    }
                ]
            },
            "post": {
                "tags": [
                    "Admin"
                ],
                "summary": "create loan",
                "description": "create loan",
                "operationId": "postLoan",
                "requestBody": {
                    "content": {
                        "application/json": {
                            "schema": {
                                "properties": {
                                    "title": {
                                        "type": "string",
                                        "example": "loan1t2"
                                    },
                                    "loan_category_id": {
                                        "type": "string",
                                        "example": "1"
                                    },
                                    "amount": {
                                        "type": "integer",
                                        "example": "120000"
                                    },
                                    "tenure": {
                                        "type": "integer",
                                        "example": "12"
                                    },
                                    "interest_rate": {
                                        "type": "integer",
                                        "example": "5"
                                    },
                                    "processing_fee": {
                                        "type": "string",
                                        "example": "300"
                                    },
                                    "requirements": {
                                        "type": "string",
                                        "example": "all type of requirements"
                                    }
                                },
                                "type": "object"
                            }
                        }
                    }
                },
                "responses": {
                    "200": {
                        "description": "successful operation",
                        "content": {
                            "application/json": {
                                "schema": {
                                    "properties": {
                                        "msq": {
                                            "type": "string",
                                            "example": "loan stored successfully"
                                        },
                                        "data": {
                                            "type": "object",
                                            "example": "{...}"
                                        }
                                    },
                                    "type": "object"
                                }
                            }
                        }
                    }
                }
            }
        },
        "/api/loans/{id}": {
            "get": {
                "tags": [
                    "User",
                    "Admin"
                ],
                "summary": "Get list of projects",
                "description": "Returns list of projects",
                "operationId": "getLoan",
                "parameters": [
                    {
                        "name": "id",
                        "in": "path",
                        "required": true
                    }
                ],
                "responses": {
                    "200": {
                        "description": "Successful operation"
                    },
                    "401": {
                        "description": "Unauthenticated"
                    },
                    "403": {
                        "description": "Forbidden"
                    },
                    "404": {
                        "description": "Not Found"
                    }
                },
                "security": [
                    {
                        "Bearer": []
                    }
                ]
            },
            "put": {
                "tags": [
                    "Admin"
                ],
                "summary": "update loan",
                "description": "update loan",
                "operationId": "putLoan",
                "parameters": [
                    {
                        "name": "id",
                        "in": "path",
                        "required": true
                    }
                ],
                "requestBody": {
                    "content": {
                        "application/json": {
                            "schema": {
                                "properties": {
                                    "title": {
                                        "type": "string",
                                        "example": "loan1t2"
                                    },
                                    "loan_category_id": {
                                        "type": "string",
                                        "example": "1"
                                    },
                                    "amount": {
                                        "type": "integer",
                                        "example": "120000"
                                    },
                                    "tenure": {
                                        "type": "integer",
                                        "example": "12"
                                    },
                                    "interest_rate": {
                                        "type": "integer",
                                        "example": "5"
                                    },
                                    "processing_fee": {
                                        "type": "string",
                                        "example": "300"
                                    },
                                    "requirements": {
                                        "type": "string",
                                        "example": "all type of requirements"
                                    }
                                },
                                "type": "object"
                            }
                        }
                    }
                },
                "responses": {
                    "200": {
                        "description": "successful operation",
                        "content": {
                            "application/json": {
                                "schema": {
                                    "properties": {
                                        "msq": {
                                            "type": "string",
                                            "example": "loan updated successfully"
                                        },
                                        "data": {
                                            "type": "object",
                                            "example": "{...}"
                                        }
                                    },
                                    "type": "object"
                                }
                            }
                        }
                    }
                }
            },
            "delete": {
                "tags": [
                    "Admin"
                ],
                "summary": "delete loan",
                "description": "delete loan",
                "operationId": "deleteLoan",
                "parameters": [
                    {
                        "name": "id",
                        "in": "path",
                        "required": true
                    }
                ],
                "responses": {
                    "200": {
                        "description": "successful operation",
                        "content": {
                            "application/json": {
                                "schema": {
                                    "properties": {
                                        "msq": {
                                            "type": "string",
                                            "example": "loan deleted successfully"
                                        },
                                        "data": {
                                            "type": "object",
                                            "example": "{...}"
                                        }
                                    },
                                    "type": "object"
                                }
                            }
                        }
                    }
                }
            }
        },
        "/api/apply": {
            "get": {
                "tags": [
                    "User"
                ],
                "summary": "Get list of Applies",
                "description": "Returns list of Applies",
                "operationId": "getApplies",
                "responses": {
                    "200": {
                        "description": "Successful operation"
                    },
                    "401": {
                        "description": "Unauthenticated"
                    },
                    "403": {
                        "description": "Forbidden"
                    }
                },
                "security": [
                    {
                        "Bearer": []
                    }
                ]
            },
            "post": {
                "tags": [
                    "User"
                ],
                "summary": "create apply",
                "description": "create apply",
                "operationId": "postApply",
                "requestBody": {
                    "content": {
                        "application/json": {
                            "schema": {
                                "properties": {
                                    "loan_id": {
                                        "type": "integer",
                                        "example": "2"
                                    },
                                    "user_application": {
                                        "type": "string",
                                        "example": "user_application"
                                    }
                                },
                                "type": "object"
                            }
                        }
                    }
                },
                "responses": {
                    "200": {
                        "description": "successful operation",
                        "content": {
                            "application/json": {
                                "schema": {
                                    "properties": {
                                        "msq": {
                                            "type": "string",
                                            "example": "you applied successfully"
                                        },
                                        "data": {
                                            "type": "object",
                                            "example": "{...}"
                                        }
                                    },
                                    "type": "object"
                                }
                            }
                        }
                    }
                }
            }
        },
        "/api/apply/{id}": {
            "get": {
                "tags": [
                    "User"
                ],
                "summary": "Get a apply",
                "description": "Returns q apply",
                "operationId": "getApply",
                "parameters": [
                    {
                        "name": "id",
                        "in": "path",
                        "required": true
                    }
                ],
                "responses": {
                    "200": {
                        "description": "Successful operation"
                    },
                    "401": {
                        "description": "Unauthenticated"
                    },
                    "403": {
                        "description": "Forbidden"
                    },
                    "404": {
                        "description": "Not Found"
                    }
                },
                "security": [
                    {
                        "Bearer": []
                    }
                ]
            }
        }
    },
    "components": {
        "securitySchemes": {
            "Bearer": {
                "type": "apiKey",
                "description": "Enter token in format (Bearer token)",
                "schema": "Bearer",
                "name": "Authorization",
                "in": "header"
            }
        }
    },
    "security": [
        {
            "Bearer": []
        }
    ]
}