<svg width="83" height="15" viewBox="0 0 83 15" fill="none" xmlns="http://www.w3.org/2000/svg">
<path d="M9.28 4.016H10.8C10.7147 3.408 10.5333 2.87467 10.256 2.416C9.97867 1.94667 9.632 1.55733 9.216 1.248C8.8 0.938666 8.32533 0.704 7.792 0.544C7.25867 0.384 6.69333 0.304 6.096 0.304C5.22133 0.304 4.44267 0.464 3.76 0.783999C3.088 1.09333 2.52267 1.52 2.064 2.064C1.616 2.608 1.27467 3.248 1.04 3.984C0.805333 4.70933 0.688 5.488 0.688 6.32C0.688 7.152 0.794667 7.93067 1.008 8.656C1.232 9.38133 1.56267 10.0107 2 10.544C2.43733 11.0773 2.98667 11.4987 3.648 11.808C4.30933 12.1067 5.08267 12.256 5.968 12.256C7.42933 12.256 8.58133 11.856 9.424 11.056C10.2667 10.256 10.7627 9.136 10.912 7.696H9.392C9.36 8.16533 9.264 8.60267 9.104 9.008C8.944 9.41333 8.72 9.76533 8.432 10.064C8.15467 10.352 7.81867 10.5813 7.424 10.752C7.04 10.912 6.59733 10.992 6.096 10.992C5.41333 10.992 4.82667 10.864 4.336 10.608C3.84533 10.352 3.44 10.0107 3.12 9.584C2.81067 9.14667 2.58133 8.64 2.432 8.064C2.28267 7.47733 2.208 6.85867 2.208 6.208C2.208 5.61067 2.28267 5.03467 2.432 4.48C2.58133 3.92533 2.81067 3.43467 3.12 3.008C3.44 2.57067 3.84 2.224 4.32 1.968C4.81067 1.712 5.39733 1.584 6.08 1.584C6.88 1.584 7.568 1.78667 8.144 2.192C8.73067 2.59733 9.10933 3.20533 9.28 4.016ZM13.5629 7.872C13.5629 7.37067 13.6269 6.928 13.7549 6.544C13.8935 6.14933 14.0802 5.81867 14.3149 5.552C14.5495 5.28533 14.8215 5.08267 15.1309 4.944C15.4509 4.80533 15.7869 4.736 16.1389 4.736C16.4909 4.736 16.8215 4.80533 17.1309 4.944C17.4509 5.08267 17.7282 5.28533 17.9629 5.552C18.1975 5.81867 18.3789 6.14933 18.5069 6.544C18.6455 6.928 18.7149 7.37067 18.7149 7.872C18.7149 8.37333 18.6455 8.82133 18.5069 9.216C18.3789 9.6 18.1975 9.92533 17.9629 10.192C17.7282 10.448 17.4509 10.6453 17.1309 10.784C16.8215 10.9227 16.4909 10.992 16.1389 10.992C15.7869 10.992 15.4509 10.9227 15.1309 10.784C14.8215 10.6453 14.5495 10.448 14.3149 10.192C14.0802 9.92533 13.8935 9.6 13.7549 9.216C13.6269 8.82133 13.5629 8.37333 13.5629 7.872ZM12.1229 7.872C12.1229 8.48 12.2082 9.04533 12.3789 9.568C12.5495 10.0907 12.8055 10.5493 13.1469 10.944C13.4882 11.328 13.9095 11.632 14.4109 11.856C14.9122 12.0693 15.4882 12.176 16.1389 12.176C16.8002 12.176 17.3762 12.0693 17.8669 11.856C18.3682 11.632 18.7895 11.328 19.1309 10.944C19.4722 10.5493 19.7282 10.0907 19.8989 9.568C20.0695 9.04533 20.1549 8.48 20.1549 7.872C20.1549 7.264 20.0695 6.69867 19.8989 6.176C19.7282 5.64267 19.4722 5.184 19.1309 4.8C18.7895 4.40533 18.3682 4.096 17.8669 3.872C17.3762 3.648 16.8002 3.536 16.1389 3.536C15.4882 3.536 14.9122 3.648 14.4109 3.872C13.9095 4.096 13.4882 4.40533 13.1469 4.8C12.8055 5.184 12.5495 5.64267 12.3789 6.176C12.2082 6.69867 12.1229 7.264 12.1229 7.872ZM21.7584 3.728V12H23.1184V6.848C23.1184 6.688 23.1557 6.49067 23.2304 6.256C23.3157 6.01067 23.4437 5.776 23.6144 5.552C23.7957 5.328 24.025 5.136 24.3024 4.976C24.5904 4.816 24.9317 4.736 25.3264 4.736C25.6357 4.736 25.8864 4.784 26.0784 4.88C26.281 4.96533 26.441 5.09333 26.5584 5.264C26.6757 5.424 26.7557 5.616 26.7984 5.84C26.8517 6.064 26.8784 6.30933 26.8784 6.576V12H28.2384V6.848C28.2384 6.208 28.4304 5.696 28.8144 5.312C29.1984 4.928 29.7264 4.736 30.3984 4.736C30.729 4.736 30.9957 4.784 31.1984 4.88C31.4117 4.976 31.577 5.10933 31.6944 5.28C31.8117 5.44 31.8917 5.632 31.9344 5.856C31.977 6.08 31.9984 6.32 31.9984 6.576V12H33.3584V5.936C33.3584 5.50933 33.289 5.14667 33.1504 4.848C33.0224 4.53867 32.8357 4.288 32.5904 4.096C32.3557 3.904 32.0677 3.76533 31.7264 3.68C31.3957 3.584 31.0224 3.536 30.6064 3.536C30.0624 3.536 29.561 3.65867 29.1024 3.904C28.6544 4.14933 28.2917 4.496 28.0144 4.944C27.8437 4.432 27.5504 4.06933 27.1344 3.856C26.7184 3.64267 26.2544 3.536 25.7424 3.536C24.5797 3.536 23.689 4.00533 23.0704 4.944H23.0384V3.728H21.7584ZM35.399 3.728V12H36.759V6.848C36.759 6.688 36.7963 6.49067 36.871 6.256C36.9563 6.01067 37.0843 5.776 37.255 5.552C37.4363 5.328 37.6657 5.136 37.943 4.976C38.231 4.816 38.5723 4.736 38.967 4.736C39.2763 4.736 39.527 4.784 39.719 4.88C39.9217 4.96533 40.0817 5.09333 40.199 5.264C40.3163 5.424 40.3963 5.616 40.439 5.84C40.4923 6.064 40.519 6.30933 40.519 6.576V12H41.879V6.848C41.879 6.208 42.071 5.696 42.455 5.312C42.839 4.928 43.367 4.736 44.039 4.736C44.3697 4.736 44.6363 4.784 44.839 4.88C45.0523 4.976 45.2177 5.10933 45.335 5.28C45.4523 5.44 45.5323 5.632 45.575 5.856C45.6177 6.08 45.639 6.32 45.639 6.576V12H46.999V5.936C46.999 5.50933 46.9297 5.14667 46.791 4.848C46.663 4.53867 46.4763 4.288 46.231 4.096C45.9963 3.904 45.7083 3.76533 45.367 3.68C45.0363 3.584 44.663 3.536 44.247 3.536C43.703 3.536 43.2017 3.65867 42.743 3.904C42.295 4.14933 41.9323 4.496 41.655 4.944C41.4843 4.432 41.191 4.06933 40.775 3.856C40.359 3.64267 39.895 3.536 39.383 3.536C38.2203 3.536 37.3297 4.00533 36.711 4.944H36.679V3.728H35.399ZM55.8876 12V3.728H54.5276V8.4C54.5276 8.77333 54.4743 9.12 54.3676 9.44C54.2716 9.74933 54.1223 10.0213 53.9196 10.256C53.717 10.4907 53.461 10.672 53.1516 10.8C52.853 10.928 52.4956 10.992 52.0796 10.992C51.557 10.992 51.1463 10.8427 50.8476 10.544C50.549 10.2453 50.3996 9.84 50.3996 9.328V3.728H49.0396V9.168C49.0396 9.616 49.0823 10.0267 49.1676 10.4C49.2636 10.7627 49.4236 11.0773 49.6476 11.344C49.8716 11.6107 50.165 11.8187 50.5276 11.968C50.8903 12.1067 51.3436 12.176 51.8876 12.176C52.4956 12.176 53.0236 12.0587 53.4716 11.824C53.9196 11.5787 54.2876 11.2 54.5756 10.688H54.6076V12H55.8876ZM57.9303 3.728V12H59.2903V7.328C59.2903 6.95467 59.3383 6.61333 59.4343 6.304C59.5409 5.984 59.6956 5.70667 59.8983 5.472C60.1009 5.23733 60.3516 5.056 60.6503 4.928C60.9596 4.8 61.3223 4.736 61.7383 4.736C62.2609 4.736 62.6716 4.88533 62.9703 5.184C63.2689 5.48267 63.4183 5.888 63.4183 6.4V12H64.7783V6.56C64.7783 6.112 64.7303 5.70667 64.6343 5.344C64.5489 4.97067 64.3943 4.65067 64.1703 4.384C63.9463 4.11733 63.6529 3.90933 63.2903 3.76C62.9276 3.61067 62.4743 3.536 61.9303 3.536C60.7036 3.536 59.8076 4.03733 59.2423 5.04H59.2103V3.728H57.9303ZM68.2609 2.24V0.575999H66.9009V2.24H68.2609ZM66.9009 3.728V12H68.2609V3.728H66.9009ZM72.2558 3.728V1.248H70.8958V3.728H69.4878V4.928H70.8958V10.192C70.8958 10.576 70.9331 10.8853 71.0078 11.12C71.0824 11.3547 71.1944 11.536 71.3438 11.664C71.5038 11.792 71.7064 11.8827 71.9518 11.936C72.2078 11.9787 72.5118 12 72.8638 12H73.9038V10.8H73.2798C73.0664 10.8 72.8904 10.7947 72.7518 10.784C72.6238 10.7627 72.5224 10.7253 72.4478 10.672C72.3731 10.6187 72.3198 10.544 72.2878 10.448C72.2664 10.352 72.2558 10.224 72.2558 10.064V4.928H73.9038V3.728H72.2558ZM78.6626 13.088L82.2626 3.728H80.8226L78.5026 10.496H78.4706L76.0546 3.728H74.5186L77.7986 11.952L77.2386 13.344C77.1106 13.5893 76.9613 13.776 76.7906 13.904C76.62 14.032 76.396 14.096 76.1186 14.096C75.98 14.096 75.8413 14.0747 75.7026 14.032C75.5746 13.9893 75.4466 13.9467 75.3186 13.904V15.152C75.468 15.2053 75.6226 15.2427 75.7826 15.264C75.9426 15.2853 76.1026 15.296 76.2626 15.296C76.572 15.296 76.8386 15.2533 77.0626 15.168C77.2866 15.0933 77.4893 14.9653 77.6706 14.784C77.8626 14.6133 78.0333 14.3893 78.1826 14.112C78.3426 13.8347 78.5026 13.4933 78.6626 13.088Z" fill="white" fill-opacity="0.5"/>
</svg>
