<svg width="69" height="16" viewBox="0 0 69 16" fill="none" xmlns="http://www.w3.org/2000/svg">
<path d="M0.264375 0.575999V12H1.70438V2.496H1.73638L5.30438 12H6.60038L10.1684 2.496H10.2004V12H11.6404V0.575999H9.56038L5.94438 10.176L2.34438 0.575999H0.264375ZM17.1939 13.088L20.7939 3.728H19.3539L17.0339 10.496H17.0019L14.5859 3.728H13.0499L16.3299 11.952L15.7699 13.344C15.6419 13.5893 15.4925 13.776 15.3219 13.904C15.1512 14.032 14.9272 14.096 14.6499 14.096C14.5112 14.096 14.3725 14.0747 14.2339 14.032C14.1059 13.9893 13.9779 13.9467 13.8499 13.904V15.152C13.9992 15.2053 14.1539 15.2427 14.3139 15.264C14.4739 15.2853 14.6339 15.296 14.7939 15.296C15.1032 15.296 15.3699 15.2533 15.5939 15.168C15.8179 15.0933 16.0205 14.9653 16.2019 14.784C16.3939 14.6133 16.5645 14.3893 16.7139 14.112C16.8739 13.8347 17.0339 13.4933 17.1939 13.088ZM29.343 6.128L25.375 12H27.071L30.239 7.28L33.311 12H35.167L31.151 6.128L34.927 0.575999H33.231L30.255 5.04L27.407 0.575999H25.583L29.343 6.128ZM37.9243 5.488V1.856H40.9643C41.2949 1.856 41.6043 1.87733 41.8923 1.92C42.1909 1.952 42.4523 2.032 42.6763 2.16C42.9003 2.288 43.0763 2.46933 43.2043 2.704C43.3323 2.93867 43.3963 3.25867 43.3963 3.664C43.3963 4.272 43.2043 4.73067 42.8203 5.04C42.4469 5.33867 41.8283 5.488 40.9643 5.488H37.9243ZM36.4043 0.575999V12H41.9243C42.4896 12 42.9856 11.9093 43.4123 11.728C43.8496 11.536 44.2123 11.2907 44.5003 10.992C44.7989 10.6827 45.0229 10.3307 45.1723 9.936C45.3216 9.54133 45.3963 9.136 45.3963 8.72C45.3963 8.016 45.2096 7.41867 44.8363 6.928C44.4629 6.43733 43.9243 6.11733 43.2203 5.968V5.936C43.7643 5.72267 44.1803 5.39733 44.4683 4.96C44.7669 4.512 44.9163 3.984 44.9163 3.376C44.9163 2.8 44.7829 2.31467 44.5163 1.92C44.2603 1.52533 43.9456 1.216 43.5723 0.992C43.4016 0.885333 43.1936 0.805333 42.9483 0.752C42.7136 0.698667 42.4576 0.661333 42.1803 0.639999C41.9029 0.607999 41.6203 0.591999 41.3323 0.591999C41.0549 0.581333 40.7936 0.575999 40.5483 0.575999H36.4043ZM37.9243 10.72V6.768H41.3963C41.7163 6.768 42.0256 6.8 42.3243 6.864C42.6229 6.91733 42.8843 7.01867 43.1083 7.168C43.3429 7.30667 43.5296 7.49867 43.6683 7.744C43.8069 7.98933 43.8763 8.29867 43.8763 8.672C43.8763 9.312 43.6843 9.81333 43.3003 10.176C42.9269 10.5387 42.4043 10.72 41.7323 10.72H37.9243ZM48.2374 6.288C48.2374 5.712 48.312 5.14667 48.4614 4.592C48.6107 4.02667 48.8454 3.52 49.1654 3.072C49.4854 2.624 49.896 2.26667 50.3974 2C50.8987 1.72267 51.496 1.584 52.1894 1.584C52.8827 1.584 53.48 1.72267 53.9814 2C54.4827 2.26667 54.8934 2.624 55.2134 3.072C55.5334 3.52 55.768 4.02667 55.9174 4.592C56.0667 5.14667 56.1414 5.712 56.1414 6.288C56.1414 6.864 56.0667 7.43467 55.9174 8C55.768 8.55467 55.5334 9.056 55.2134 9.504C54.8934 9.952 54.4827 10.3147 53.9814 10.592C53.48 10.8587 52.8827 10.992 52.1894 10.992C51.496 10.992 50.8987 10.8587 50.3974 10.592C49.896 10.3147 49.4854 9.952 49.1654 9.504C48.8454 9.056 48.6107 8.55467 48.4614 8C48.312 7.43467 48.2374 6.864 48.2374 6.288ZM46.7174 6.288C46.7174 7.06667 46.8294 7.81867 47.0534 8.544C47.288 9.25867 47.6347 9.89333 48.0934 10.448C48.552 11.0027 49.1227 11.4453 49.8054 11.776C50.488 12.096 51.2827 12.256 52.1894 12.256C53.096 12.256 53.8907 12.096 54.5734 11.776C55.256 11.4453 55.8267 11.0027 56.2854 10.448C56.744 9.89333 57.0854 9.25867 57.3094 8.544C57.544 7.81867 57.6614 7.06667 57.6614 6.288C57.6614 5.50933 57.544 4.76267 57.3094 4.048C57.0854 3.32267 56.744 2.68267 56.2854 2.128C55.8267 1.57333 55.256 1.13067 54.5734 0.799999C53.8907 0.469333 53.096 0.304 52.1894 0.304C51.2827 0.304 50.488 0.469333 49.8054 0.799999C49.1227 1.13067 48.552 1.57333 48.0934 2.128C47.6347 2.68267 47.288 3.32267 47.0534 4.048C46.8294 4.76267 46.7174 5.50933 46.7174 6.288ZM62.2336 6.128L58.2656 12H59.9616L63.1296 7.28L66.2016 12H68.0576L64.0416 6.128L67.8176 0.575999H66.1216L63.1456 5.04L60.2976 0.575999H58.4736L62.2336 6.128Z" fill="white" fill-opacity="0.5"/>
</svg>
