{
	"author": {
		"email": "support@mooregoodideas.com",
		"name": "Moore Good Ideas, Inc",
		"url": "https://www.mooregoodideas.com"
	},
	"contributors": [
		{
			"email": "derek@mooregoodideas.com",
			"name": "Derek Trepanier",
			"url": "https://www.mooregoodideas.com/"
		}
	],
	"dependencies": {
		"@mgi/database-interface": "^0.1.1"
	},
	"devDependencies": {
		"@mgi/query-builder": "^0.1.1"
	},
	"license": "BSD-3-Clause",
	"lvversion": ">=17",
	"name": "@mgi/sqlite",
	"version": "0.1.0"
}