{
	"author": {
		"email": "support@mooregoodideas.com",
		"name": "Moore Good Ideas, Inc",
		"url": "https://www.mooregoodideas.com"
	},
	"bugs": "https://gitlab.com/mgi/gpm-packages/query-builder/issues",
	"contributors": [
		{
			"email": "derek@mooregoodideas.com",
			"name": "Derek Trepanier",
			"url": "http://www.mooregoodideas.com/"
		}
	],
	"dependencies": {
		"@mgi/database-interface": "^0.1.0"
	},
	"description": "A toolkit to help easily build database queries from LabVIEW data types.",
	"keywords": [
		"select",
		"update",
		"delete",
		"insert"
	],
	"license": "BSD-3-Clause",
	"lvversion": ">=17",
	"name": "@mgi/query-builder",
	"repository": "https://gitlab.com/mgi/gpm-packages/query-builder",
	"version": "0.1.2",
	"files": [
		"Query Builder"
	]
}