{
	"author": {
		"email": "support@mooregoodideas.com",
		"name": "Moore Good Ideas, Inc",
		"url": "https://www.mooregoodideas.com"
	},
	"bugs": "https://gitlab.com/mgi/gpm-packages/mdi-panels/issues",
	"contributors": [
		{
			"email": "derek@mooregoodideas.com",
			"name": "Derek Trepanier",
			"url": "https://www.mooregoodideas.com/"
		}
	],
	"dependencies": {
		"@mgi/panel-manager": "^2.0.0"
	},
	"description": "Provides a Multiple Document Interface (MDI) extension for the MGI Panel Manager Framework.",
	"files": [
		"Source/"
	],
	"keywords": [
		"UI"
	],
	"license": "BSD-3-Clause",
	"lvversion": ">=17",
	"name": "@mgi/mdi-panels",
	"os": [
		"Windows 3.1",
		"Windows 95/NT",
		"Windows x64"
	],
	"repository": "https://gitlab.com/mgi/gpm-packages/mdi-panels",
	"version": "2.0.1"
}