{
	"author": {
		"email": "support@mooregoodideas.com",
		"name": "Moore Good Ideas, Inc",
		"url": "https://www.mooregoodideas.com"
	},
	"bugs": "https://gitlab.com/mgi/gpm-packages/markdown-viewer/issues",
	"contributors": [
		{
			"email": "derek@mooregoodideas.com",
			"name": "Derek Trepanier",
			"url": "https://www.mooregoodideas.com/"
		}
	],
	"dependencies": {
		"@mgi/panel-actors": "^3.0.3"
	},
	"description": "Displays Rendered Markdown",
	"files": [
		"Source/"
	],
	"keywords": [
		"html"
	],
	"license": "BSD-3-Clause",
	"lvversion": ">=17",
	"name": "@mgi/markdown-viewer",
	"os": [
		"Windows 3.1",
		"Windows 95/NT",
		"Windows x64"
	],
	"repository": "https://gitlab.com/mgi/gpm-packages/markdown-viewer",
	"version": "0.1.1"
}