{
	"author": {
		"email": "support@mooregoodideas.com",
		"name": "Moore Good Ideas, Inc",
		"url": "https://www.mooregoodideas.com"
	},
	"bugs": "https://gitlab.com/mgi/gpm-packages/error-file-logger-panel/issues",
	"contributors": [
		{
			"email": "derek@mooregoodideas.com",
			"name": "Derek Trepanier",
			"url": "https://www.mooregoodideas.com/"
		}
	],
	"dependencies": {
		"@mgi/error-logger-panel": "^0.1.2"
	},
	"description": "A basic file logger panel interface.",
	"files": [
		"Source/"
	],
	"keywords": [
		"error reporter"
	],
	"license": "BSD-3-Clause",
	"lvversion": ">=17",
	"name": "@mgi/error-file-logger-panel",
	"repository": "https://gitlab.com/mgi/gpm-packages/error-file-logger-panel",
	"version": "0.1.3"
}