{
	"author": {
		"email": "support@mooregoodideas.com",
		"name": "Moore Good Ideas, Inc",
		"url": "https://www.mooregoodideas.com"
	},
	"bugs": "https://gitlab.com/mgi/gpm-packages/JSON/issues",
	"contributors": [
		{
			"email": "derek.trepanier@microsoft.com",
			"name": "Derek Trepanier",
			"url": "http://www.mooregoodideas.com/"
		},
		{
			"email": "david@mooregoodideas.com",
			"name": "David A. Moore",
			"url": "http://www.mooregoodideas.com/"
		}
	],
	"description": "Fast and flexible JSON Parsing.",
	"files": [
		"JSON/"
	],
	"license": "BSD-3-Clause",
	"lvversion": ">=17",
	"name": "@mgi/json",
	"repository": "https://gitlab.com/mgi/gpm-packages/JSON",
	"version": "1.0.1"
}