@startuml Class diagram
!theme vibrant
package edu.mondragon.webeng1.backend.dao_login {
    class Main {
        + static void main(String[] args)
    }
}

package controller {
    class LoginController<? extends HTTPServlet> << (C, #CECECE) Controller for /login >> {
        - static final long serialVersionUID
        + LoginController()
        # void doGet(HttpServletRequest request, HttpServletResponse response)
        # void doPost(HttpServletRequest request, HttpServletResponse response)
        - void void login(HttpSession session, String username, String password)        
        - void void logout(HttpSession session)
    }
}

package domain.users.dao {
    class LoginFacade {
        - DaoLogin login
        + LoginFacade()
        + boolean exists(String username, String password)
        - String loadDatabaseToUseFromFile()
    }
    
    interface DaoLogin {
        + boolean exists(String username, String password)
    }

    class DaoLoginProperties {
        - String fileName
        - Properties prop
        + DaoLoginProperties()
        + boolean exists(String username, String password)
    }

    class DaoLoginMySQL {
        - MySQLConfig mysqlConfig
        + DaoLoginMySQL()
        + boolean exists(String username, String password)    
    }
}
package config {
    class MySQLConfig << (S,#FF7700) Singleton >> {
        - static MySQLConfig myconfig;
        - String username
        - String password
        - String connectionString
        + static MySQLConfig getInstance()
        - MySQLConfig()
        + Connection connect()
        + void disconnect(Connection connection, Statement statement)
    }
}

DaoLogin <|-- DaoLoginProperties : implements
DaoLogin <|-- DaoLoginMySQL : implements
DaoLogin *-- LoginFacade : uses
LoginFacade *-- LoginController : uses
MySQLConfig *-- DaoLoginMySQL : uses
@enduml