<!DOCTYPE svg PUBLIC "-//W3C//DTD SVG 1.1//EN" "http://www.w3.org/Graphics/SVG/1.1/DTD/svg11.dtd">
<!-- Uploaded to: SVG Repo, www.svgrepo.com, Transformed by: SVG Repo Mixer Tools -->
<svg width="800px" height="800px" viewBox="0 0 1024 1024" class="icon" version="1.1" xmlns="http://www.w3.org/2000/svg" fill="#000000">
<g id="SVGRepo_bgCarrier" stroke-width="0"/>
<g id="SVGRepo_tracerCarrier" stroke-linecap="round" stroke-linejoin="round"/>
<g id="SVGRepo_iconCarrier">
<path d="M853.333333 960H170.666667V64h469.333333l213.333333 213.333333z" fill="#25B7D3"/>
<path d="M821.333333 298.666667H618.666667V96z" fill="#ffffff"/>
<path d="M341.333333 448h362.666667v42.666667H341.333333zM341.333333 533.333333h277.333334v42.666667H341.333333zM341.333333 618.666667h362.666667v42.666666H341.333333zM341.333333 704h277.333334v42.666667H341.333333z" fill="#ffffff"/>
</g>
</svg>