<!DOCTYPE svg PUBLIC "-//W3C//DTD SVG 1.1//EN" "http://www.w3.org/Graphics/SVG/1.1/DTD/svg11.dtd">

<!-- Uploaded to: SVG Repo, www.svgrepo.com, Transformed by: SVG Repo Mixer Tools -->
<svg width="800px" height="800px" viewBox="0 0 1024 1024" class="icon" version="1.1" xmlns="http://www.w3.org/2000/svg" fill="#000000">

<g id="SVGRepo_bgCarrier" stroke-width="0"/>

<g id="SVGRepo_tracerCarrier" stroke-linecap="round" stroke-linejoin="round"/>

<g id="SVGRepo_iconCarrier">

<path d="M768 938.666667H170.666667V170.666667h426.666666l170.666667 170.666666z" fill="#25B7D3"/>

<path d="M853.333333 853.333333H256V85.333333h426.666667l170.666666 170.666667z" fill="#90CAF9"/>

<path d="M821.333333 277.333333H661.333333V117.333333z" fill="#ffffff"/>

<path d="M341.333333 448h362.666667v42.666667H341.333333zM341.333333 533.333333h277.333334v42.666667H341.333333zM341.333333 618.666667h362.666667v42.666666H341.333333zM341.333333 704h277.333334v42.666667H341.333333z" fill="#ffffff" transform="scale(0.95, 0.95) translate(60, -30)"/>

</g>

</svg>
