{
    "files" : ["*.cpp", "*.cxx", "*.c++", "*.h", "*.c", "*.hpp"],
    "collapsible_starts_block_number" : 0,
    "run_command_set" : [
        { "index" : 1, "command" : "g++ -o $CURFILE_path/$CURFILE_base $CURFILE" },
        { "index" : 1, "command" : "make" }
    ],
    "lexical" :
    {
        "id_extra_symbols" : "_",
        "national_alphabet" : "",
        "punctuation_chars" : "*=,.()/+-;#!{}:~[]'|?<>&%",
        "is_case_sensitive" : true,
        "may_national_letters_use" : false,
        "may_national_letters_mix" : false,
        "markups" : [
            {
                "start" : "/*",
                "end" : "*/",
                "ignore_sign" : "",
                "type" : "Comment"
            },
            {
                "start" : "//",
                "end" : "",
                "ignore_sign" : "",
                "type" : "Comment"
            },
            {
                "start" : "R\"(",
                "end" : ")\"",
                "type" : "Annotation"
            },
            {
                "start" : "u\"",
                "end" : "\"",
                "ignore_sign" : "\\",
                "type" : "Annotation"
            },
            {
                "start" : "\"",
                "end" : "\"",
                "ignore_sign" : "\\",
                "type" : "Annotation"
            },
            {
                "start" : "'",
                "end" : "'",
                "ignore_sign" : "\\",
                "type" : "Annotation"
            }
        ],
        "punctuation_words": [
            "define",
            "include",
            "ifndef",
            "ifdef",
            "endif",
            "bool",
            "break",
            "case",
            "undef",
            "char",
            "class",
            "const",
            "continue",
            "cout",
            "default",
            "delete",
            "do",
            "double",
            "else",
            "enum",
            "explicit",
            "extern",
            "false",
            "float",
            "for",
            "friend",
            "goto",
            "if",
            "inline",
            "int",
            "long",
            "mutable",
            "namespace",
            "new",
            "private",
            "protected",
            "public",
            "return",
            "short",
            "signed",
            "sizeof",
            "static",
            "struct",
            "switch",
            "template",
            "this",
            "true",
            "typedef",
            "union",
            "unsigned",
            "using",
            "virtual",
            "void",
            "volatile",
            "while",
            "try",
            "catch"
            ]

    }
}