{
    "files" : ["*.html"],
    "lexical" : 
    {
        "id_extra_symbols" : "_",
        "punctuation_chars" : "*=,.()/+-;#!{}:~[]'|?<>&",
        "is_case_sensitive" : false,
        "may_national_letters_use" : false,
        "may_national_letters_mix" : false,
        "markups" : [
            {
                "start" : "<!--",
                "end" : "-->",
                "ignore_sign" : "",
                "type" : "Comment"
            },
            {
                "start" : "\"",
                "end" : "\"",
                "ignore_sign" : "\\",
                "type" : "Annotation"
            },
            {
                "start" : "'",
                "end" : "'",
                "ignore_sign" : "\\",
                "type" : "Annotation"
            }
        ],
        "punctuation_words": [
            "A",
            "B",
            "BODY",
			"FORM",
            "HTML",
            "HEAD",
			"CANVAS",
			"DIV",
            "DOCTYPE",
            "H1",
            "H2",
            "H3",
            "H4",
            "H5",
            "H6",
            "I",
			"INPUT",
            "META",
            "P",
            "SCRIPT",
            "STRONG",
            "TITLE",
            "U"
            ]
    }
}