{
    "files" : ["*.fuze"],
    "run_command_set" : [
        { "text" : "Просмотр правил грамматики", "command" : "\"$DATADIR/../bin/simfuze\" -p data/grammar -r $CURFILE_base" },
        { "text" : "Просмотр грамматических структур", "command" : "\"$DATADIR/../bin/simfuze\" -p data/grammar -i $CURFILE_base" },
        { "text" : "Создать DOT-файл графа переходов состояний грамматики", "command" : "\"$DATADIR/../bin/simfuze\" -p data/grammar -d $CURFILE_base.dot $CURFILE_base" },
        { "text" : "Создать PNG-файл графа переходов состояний грамматики", "command" : "dot -O -Tpng $CURFILE_base.dot" }
    ],
    "collapsible_starts_block_number" : 0,
    "grammar" : "fuze",
    "semantic" : "fuze",
    "interpreter" : ""
}