{
    "doc" : "Qt Stylesheet lexis",
    "files" : ["*.qss"],
    "lexical" :
    {
        "id_extra_symbols" : "-_",
        "punctuation_chars" : "*=,.()/+;#!{}:~[]'|?<>&%",
        "is_case_sensitive" : true,
        "may_national_letters_use" : false,
        "may_national_letters_mix" : false,
        "markups" : [
            {
                "start" : "/*",
                "end" : "*/",
                "ignore_sign" : "",
                "type" : "Comment"
            },
            {
                "start" : "\"",
                "end" : "\"",
                "ignore_sign" : "\\",
                "type" : "Annotation"
            }
        ],
        "masks"  : [
            {
                "chars" : "#nnnnnn",
                "type"  : "Number",
                "system": 16
            },
            {
                "chars" : "Npx",
                "type"  : "Number",
                "system": 10
            },
            {
                "chars" : "N",
                "type"  : "Number",
                "system": 10
            }
        ],
        "punctuation_words": [
            "alternate-background-color",
            "background",
            "background-color",
            "background-image",
            "background-repeat",
            "background-position",
            "background-attachment",
            "background-clip",
            "background-origin",
            "border",
            "border-top",
            "border-right",
            "border-bottom",
            "border-left",
            "border-color",
            "border-top-color",
            "border-right-color",
            "border-bottom-color",
            "border-left-color",
            "border-image",
            "border-radius",
            "border-top-left-radius",
            "border-top-right-radius",
            "border-bottom-right-radius",
            "border-bottom-left-radius",
            "border-style",
            "border-top-style",
            "border-right-style",
            "border-bottom-style",
            "border-left-style",
            "border-width",
            "border-top-width",
            "border-right-width",
            "border-bottom-width",
            "border-left-width",
            "bottom",
            "button-layout",
            "color",
            "font",
            "font-family",
            "font-size",
            "font-style",
            "font-weight",
            "height",
            "icon-size",
            "image-position",
            "left",
            "margin",
            "margin-top",
            "margin-right",
            "margin-bottom",
            "margin-left",
            "max-height",
            "max-width",
            "min-height",
            "min-width",
            "outline",
            "outline-color",
            "outline-offset",
            "outline-style",
            "outline-radius",
            "outline-bottom-left-radius",
            "outline-bottom-right-radius",
            "outline-top-left-radius",
            "outline-top-right-radius",
            "padding",
            "padding-top",
            "padding-right",
            "padding-bottom",
            "padding-left",
            "paint-alternating-row-colors-for-empty-area",
            "position",
            "right",
            "text-align",
            "text-decoration",
            "top",
            "width",
            "dialogbuttonbox-buttons-have-icons",
            "gridline-color",
            "image",
            "lineedit-password-character",
            "lineedit-password-mask-delay",
            "messagebox-text-interaction-flags",
            "opacity",
            "selection-background-color",
            "selection-color",
            "show-decoration-selected",
            "spacing",
            "subcontrol-origin",
            "subcontrol-position",
            "titlebar-show-tooltips-on-buttons",
            "widget-animation-duration",
            "-qt-background-role",
            "-qt-style-features"
            ]
    },
    "type_format_words" : [
        "qlineargradient",
        "QAbstractScrollArea",
        "QCheckBox",
        "QColumnView",
        "QComboBox",
        "QDateEdit",
        "QDateTimeEdit",
        "QDialog",
        "QDialogButtonBox",
        "QDockWidget",
        "QDoubleSpinBox",
        "QFrame",
        "QGroupBox",
        "QHeaderView",
        "QLabel",
        "QLineEdit",
        "QListView",
        "QListWidget",
        "QMainWindow",
        "QMenu",
        "QMenuBar",
        "QMessageBox",
        "QProgressBar",
        "QPushButton",
        "QRadioButton",
        "QScrollBar",
        "QSizeGrip",
        "QSlider",
        "QSpinBox",
        "QSplitter",
        "QStatusBar",
        "QTabBar",
        "QTabWidget",
        "QTableView",
        "QTableWidget",
        "QTextEdit",
        "QTimeEdit",
        "QToolBar",
        "QToolButton",
        "QToolBox",
        "QToolTip",
        "QTreeView",
        "QTreeWidget",
        "QWidget",

        "active",
        "adjoins-item",
        "alternate",
        "bottom",
        "checked",
        "closable",
        "closed",
        "default",
        "disabled",
        "editable",
        "edit-focus",
        "enabled",
        "exclusive",
        "first",
        "flat",
        "floatable",
        "focus",
        "has-children",
        "has-siblings",
        "horizontal",
        "hover",
        "indeterminate",
        "last",
        "left",
        "maximized",
        "middle",
        "minimized",
        "movable",
        "no-frame",
        "non-exclusive",
        "off",
        "on",
        "only-one",
        "open",
        "next-selected",
        "pressed",
        "previous-selected",
        "read-only",
        "right",
        "selected",
        "top",
        "unchecked",
        "vertical",
        "window",
        "add-line",
        "add-page",
        "branch",
        "chunk",
        "close-button",
        "corner",
        "down-arrow",
        "down-button",
        "drop-down",
        "float-button",
        "groove",
        "indicator",
        "handle",
        "icon",
        "item",
        "left-arrow",
        "left-corner",
        "menu-arrow",
        "menu-button",
        "menu-indicator",
        "right-arrow",
        "pane",
        "right-corner",
        "scroller",
        "section",
        "separator",
        "sub-line",
        "sub-page",
        "tab",
        "tab-bar",
        "tear",
        "tearoff",
        "text",
        "title",
        "up-arrow",
        "up-button"
        ]
}