﻿{
    "_comment_" : "Структура LexicalParameters для SIMODO script",
    "markups" : [
        {
            "start"       : "/*",
            "end"         : "*/",
            "ignore_sign" : "",
            "type"        : "Comment"
        },
        {
            "start"       : "//",
            "end"         : "",
            "ignore_sign" : "",
            "type"        : "Comment"
        },
        {
            "start"       : "\"",
            "end"         : "\"",
            "ignore_sign" : "\\",
            "type"        : "Annotation"
        }
    ],
    "masks" : [
        {"chars" : "0bN", "type" : "Number", "system" : 2},
        {"chars" : "0oN", "type" : "Number", "system" : 8},
        {"chars" : "0xN", "type" : "Number", "system" : 16},
        {"chars" : "@BUILDING_NUMBER_MASK", "type" : "Number", "system" : 10}
    ],
    "punctuation_chars" : ";=?:|&!<>+-*/%^()[].,{}",
    "--punctuation_words" : [],
    "digits"            : "0123456789ABCDEF",
    "latin_alphabet"    : "abcdefghijklmnopqrstuvwxyzABCDEFGHIJKLMNOPQRSTUVWXYZ",
    "national_alphabet" : "абвгдеёжзийклмнопрстуфхцчшщъыьэюяАБВГДЕЁЖЗИЙКЛМНОПРСТУФХЦЧШЩЪЫЬЭЮЯ",
    "id_extra_symbols"  : "_",
    "may_national_letters_use" : true,
    "may_national_letters_mix" : false,
    "is_case_sensitive" : true
}