/* XPM */
static char *gron[]={
"20 20 15 1",
". c None",
"i c #00ff00",
"g c #41ff41",
"# c #626562",
"a c #7b7d7b",
"f c #8bff8b",
"b c #949594",
"c c #acaeac",
"d c #cdcacd",
"e c #cdcecd",
"h c #d5ffd5",
"l c #e6e2e6",
"j c #e6e6e6",
"m c #fffaff",
"k c #ffffff",
"....................",
"....................",
".......#aabbc.......",
".....###aabbccd.....",
"....#####abccdde....",
"...#####fgggcdeee...",
"...###ffhffggieej...",
"..####fhhhffggjjjj..",
"..aa#fhhhhffggijkk..",
"..aaagfhhhffggikkk..",
"..bbbgffffffggikkk..",
"..bbcggffffgggikkk..",
"..ccccgggggggikkkk..",
"...cddggggggiikkk...",
"...ddllmiiiikkkkk...",
"....lllmmkkkkkkk....",
".....lmmkkkkkkk.....",
".......mkkkkk.......",
"....................",
"...................."};
