%!PS-Adobe-3.0
%%Creator: PCBNEW
%%CreationDate: Sun Oct  4 11:10:15 2020
%%Title: /Users/felixd/projekty/metrologia/4-wire-short/4-wire-short/gerber/4-wire-short-drl_map.ps
%%Pages: 1
%%PageOrder: Ascend
%%BoundingBox: 0 0 596 842
%%DocumentMedia: A4 595 842 0 () ()
%%Orientation: Landscape
%%EndComments
%%BeginProlog
/line { newpath moveto lineto stroke } bind def
/cir0 { newpath 0 360 arc stroke } bind def
/cir1 { newpath 0 360 arc gsave fill grestore stroke } bind def
/cir2 { newpath 0 360 arc gsave fill grestore stroke } bind def
/arc0 { newpath arc stroke } bind def
/arc1 { newpath 4 index 4 index moveto arc closepath gsave fill
    grestore stroke } bind def
/arc2 { newpath 4 index 4 index moveto arc closepath gsave fill
    grestore stroke } bind def
/poly0 { stroke } bind def
/poly1 { closepath gsave fill grestore stroke } bind def
/poly2 { closepath gsave fill grestore stroke } bind def
/rect0 { rectstroke } bind def
/rect1 { rectfill } bind def
/rect2 { rectfill } bind def
/linemode0 { 0 setlinecap 0 setlinejoin 0 setlinewidth } bind def
/linemode1 { 1 setlinecap 1 setlinejoin } bind def
/dashedline { [200] 100 setdash } bind def
/solidline { [] 0 setdash } bind def
/phantomshow { moveto
    /KicadFont findfont 0.000001 scalefont setfont
    show } bind def
/textshow { gsave
    findfont exch scalefont setfont concat 1 scale 0 0 moveto show
    } bind def
/reencodefont {
  findfont dup length dict begin
  { 1 index /FID ne
    { def }
    { pop pop } ifelse
  } forall
  /Encoding ISOLatin1Encoding def
  currentdict
  end } bind def
/KicadFont /Helvetica reencodefont definefont pop
/KicadFont-Bold /Helvetica-Bold reencodefont definefont pop
/KicadFont-Oblique /Helvetica-Oblique reencodefont definefont pop
/KicadFont-BoldOblique /Helvetica-BoldOblique reencodefont definefont pop
%%EndProlog
%%Page: 1 1
%%BeginPageSetup
gsave
0.0072 0.0072 scale
linemode1
82680 0 translate 90 rotate
150 setlinewidth
%%EndPageSetup
0 0 0 setrgbcolor
11.811 setlinewidth
newpath
82382.3 75622.1 moveto
34547.7 75622.1 lineto
stroke
0 0 0 setrgbcolor
34547.7 73259.9 2362.2 90 180 arc0
0 0 0 setrgbcolor
newpath
32185.5 73259.9 moveto
32185.5 42492.1 lineto
stroke
0 0 0 setrgbcolor
34547.7 42492.1 2362.21 180 270 arc0
0 0 0 setrgbcolor
newpath
34547.7 40129.9 moveto
82382.3 40129.9 lineto
stroke
0 0 0 setrgbcolor
82382.3 42492.1 2362.2 -90 -0 arc0
0 0 0 setrgbcolor
newpath
84744.5 42492.1 moveto
84744.5 73259.9 lineto
stroke
0 0 0 setrgbcolor
82382.3 73259.9 2362.2 -0 90 arc0
78.7394 setlinewidth
newpath
71734.7 71665.4 moveto
76813.4 66586.6 lineto
stroke
newpath
76813.4 71665.4 moveto
71734.7 66586.6 lineto
stroke
newpath
69667.8 66626 moveto
78880.4 66626 lineto
stroke
newpath
69667.8 71626 moveto
78880.4 71626 lineto
stroke
78880.4 69126 2500 270 450 arc0
69667.8 69126 2500 90 270 arc0
newpath
40104.8 49165.4 moveto
45183.5 44086.6 lineto
stroke
newpath
45183.5 49165.4 moveto
40104.8 44086.6 lineto
stroke
newpath
38037.8 44126 moveto
47250.4 44126 lineto
stroke
newpath
38037.8 49126 moveto
47250.4 49126 lineto
stroke
47250.4 46626 2500 270 450 arc0
38037.8 46626 2500 90 270 arc0
newpath
71734.7 49165.4 moveto
76813.4 44086.6 lineto
stroke
newpath
76813.4 49165.4 moveto
71734.7 44086.6 lineto
stroke
newpath
69667.8 44126 moveto
78880.4 44126 lineto
stroke
newpath
69667.8 49126 moveto
78880.4 49126 lineto
stroke
78880.4 46626 2500 270 450 arc0
69667.8 46626 2500 90 270 arc0
newpath
40104.8 71665.4 moveto
45183.5 66586.6 lineto
stroke
newpath
45183.5 71665.4 moveto
40104.8 66586.6 lineto
stroke
newpath
38037.8 66626 moveto
47250.4 66626 lineto
stroke
newpath
38037.8 71626 moveto
47250.4 71626 lineto
stroke
47250.4 69126 2500 270 450 arc0
38037.8 69126 2500 90 270 arc0
118.11 setlinewidth
0 0 0 setrgbcolor
0 0 0 setrgbcolor
newpath
33307.2 38290.5 moveto
33307.2 39471.6 lineto
33588.5 39471.6 lineto
33757.2 39415.4 lineto
33869.7 39302.9 lineto
33925.9 39190.4 lineto
33982.2 38965.4 lineto
33982.2 38796.7 lineto
33925.9 38571.7 lineto
33869.7 38459.2 lineto
33757.2 38346.8 lineto
33588.5 38290.5 lineto
33307.2 38290.5 lineto
stroke
newpath
34488.3 38290.5 moveto
34488.3 39077.9 lineto
stroke
newpath
34488.3 38852.9 moveto
34544.6 38965.4 lineto
34600.8 39021.7 lineto
34713.3 39077.9 lineto
34825.8 39077.9 lineto
stroke
newpath
35219.5 38290.5 moveto
35219.5 39077.9 lineto
stroke
newpath
35219.5 39471.6 moveto
35163.3 39415.4 lineto
35219.5 39359.1 lineto
35275.7 39415.4 lineto
35219.5 39471.6 lineto
35219.5 39359.1 lineto
stroke
newpath
35950.7 38290.5 moveto
35838.2 38346.8 lineto
35781.9 38459.2 lineto
35781.9 39471.6 lineto
stroke
newpath
36569.3 38290.5 moveto
36456.8 38346.8 lineto
36400.6 38459.2 lineto
36400.6 39471.6 lineto
stroke
newpath
37919.2 38290.5 moveto
37919.2 39471.6 lineto
38312.9 38628 lineto
38706.6 39471.6 lineto
38706.6 38290.5 lineto
stroke
newpath
39775.2 38290.5 moveto
39775.2 38909.2 lineto
39718.9 39021.7 lineto
39606.4 39077.9 lineto
39381.5 39077.9 lineto
39269 39021.7 lineto
stroke
newpath
39775.2 38346.8 moveto
39662.7 38290.5 lineto
39381.5 38290.5 lineto
39269 38346.8 lineto
39212.7 38459.2 lineto
39212.7 38571.7 lineto
39269 38684.2 lineto
39381.5 38740.5 lineto
39662.7 38740.5 lineto
39775.2 38796.7 lineto
stroke
newpath
40337.6 39077.9 moveto
40337.6 37896.8 lineto
stroke
newpath
40337.6 39021.7 moveto
40450.1 39077.9 lineto
40675.1 39077.9 lineto
40787.6 39021.7 lineto
40843.8 38965.4 lineto
40900 38852.9 lineto
40900 38515.5 lineto
40843.8 38403 lineto
40787.6 38346.8 lineto
40675.1 38290.5 lineto
40450.1 38290.5 lineto
40337.6 38346.8 lineto
stroke
newpath
41406.2 38403 moveto
41462.5 38346.8 lineto
41406.2 38290.5 lineto
41350 38346.8 lineto
41406.2 38403 lineto
41406.2 38290.5 lineto
stroke
newpath
41406.2 39021.7 moveto
41462.5 38965.4 lineto
41406.2 38909.2 lineto
41350 38965.4 lineto
41406.2 39021.7 lineto
41406.2 38909.2 lineto
stroke
newpath
27100.8 38883.9 moveto
32179.6 33805.1 lineto
stroke
newpath
32179.6 38883.9 moveto
27100.8 33805.1 lineto
stroke
0 0 0 setrgbcolor
0 0 0 setrgbcolor
newpath
33813.4 36597.6 moveto
33813.4 35810.2 lineto
stroke
newpath
33532.2 37047.5 moveto
33251 36203.9 lineto
33982.2 36203.9 lineto
stroke
newpath
34432.1 35922.7 moveto
34488.3 35866.4 lineto
34432.1 35810.2 lineto
34375.9 35866.4 lineto
34432.1 35922.7 lineto
34432.1 35810.2 lineto
stroke
newpath
34882 36991.3 moveto
35613.2 36991.3 lineto
35219.5 36541.4 lineto
35388.2 36541.4 lineto
35500.7 36485.1 lineto
35557 36428.9 lineto
35613.2 36316.4 lineto
35613.2 36035.2 lineto
35557 35922.7 lineto
35500.7 35866.4 lineto
35388.2 35810.2 lineto
35050.8 35810.2 lineto
34938.3 35866.4 lineto
34882 35922.7 lineto
stroke
newpath
36344.4 36991.3 moveto
36456.8 36991.3 lineto
36569.3 36935.1 lineto
36625.6 36878.8 lineto
36681.8 36766.3 lineto
36738.1 36541.4 lineto
36738.1 36260.1 lineto
36681.8 36035.2 lineto
36625.6 35922.7 lineto
36569.3 35866.4 lineto
36456.8 35810.2 lineto
36344.4 35810.2 lineto
36231.9 35866.4 lineto
36175.6 35922.7 lineto
36119.4 36035.2 lineto
36063.1 36260.1 lineto
36063.1 36541.4 lineto
36119.4 36766.3 lineto
36175.6 36878.8 lineto
36231.9 36935.1 lineto
36344.4 36991.3 lineto
stroke
newpath
37244.2 35810.2 moveto
37244.2 36597.6 lineto
stroke
newpath
37244.2 36485.1 moveto
37300.5 36541.4 lineto
37413 36597.6 lineto
37581.7 36597.6 lineto
37694.2 36541.4 lineto
37750.4 36428.9 lineto
37750.4 35810.2 lineto
stroke
newpath
37750.4 36428.9 moveto
37806.7 36541.4 lineto
37919.2 36597.6 lineto
38087.9 36597.6 lineto
38200.4 36541.4 lineto
38256.6 36428.9 lineto
38256.6 35810.2 lineto
stroke
newpath
38819 35810.2 moveto
38819 36597.6 lineto
stroke
newpath
38819 36485.1 moveto
38875.3 36541.4 lineto
38987.8 36597.6 lineto
39156.5 36597.6 lineto
39269 36541.4 lineto
39325.2 36428.9 lineto
39325.2 35810.2 lineto
stroke
newpath
39325.2 36428.9 moveto
39381.5 36541.4 lineto
39494 36597.6 lineto
39662.7 36597.6 lineto
39775.2 36541.4 lineto
39831.4 36428.9 lineto
39831.4 35810.2 lineto
stroke
newpath
42137.4 37047.5 moveto
41125 35529 lineto
stroke
newpath
43655.9 36991.3 moveto
43768.4 36991.3 lineto
43880.9 36935.1 lineto
43937.2 36878.8 lineto
43993.4 36766.3 lineto
44049.6 36541.4 lineto
44049.6 36260.1 lineto
43993.4 36035.2 lineto
43937.2 35922.7 lineto
43880.9 35866.4 lineto
43768.4 35810.2 lineto
43655.9 35810.2 lineto
43543.5 35866.4 lineto
43487.2 35922.7 lineto
43431 36035.2 lineto
43374.7 36260.1 lineto
43374.7 36541.4 lineto
43431 36766.3 lineto
43487.2 36878.8 lineto
43543.5 36935.1 lineto
43655.9 36991.3 lineto
stroke
newpath
44555.8 35922.7 moveto
44612.1 35866.4 lineto
44555.8 35810.2 lineto
44499.6 35866.4 lineto
44555.8 35922.7 lineto
44555.8 35810.2 lineto
stroke
newpath
45736.9 35810.2 moveto
45062 35810.2 lineto
stroke
newpath
45399.5 35810.2 moveto
45399.5 36991.3 lineto
45287 36822.6 lineto
45174.5 36710.1 lineto
45062 36653.8 lineto
stroke
newpath
46749.3 36991.3 moveto
46524.3 36991.3 lineto
46411.8 36935.1 lineto
46355.6 36878.8 lineto
46243.1 36710.1 lineto
46186.9 36485.1 lineto
46186.9 36035.2 lineto
46243.1 35922.7 lineto
46299.4 35866.4 lineto
46411.8 35810.2 lineto
46636.8 35810.2 lineto
46749.3 35866.4 lineto
46805.6 35922.7 lineto
46861.8 36035.2 lineto
46861.8 36316.4 lineto
46805.6 36428.9 lineto
46749.3 36485.1 lineto
46636.8 36541.4 lineto
46411.8 36541.4 lineto
46299.4 36485.1 lineto
46243.1 36428.9 lineto
46186.9 36316.4 lineto
stroke
newpath
47424.2 35810.2 moveto
47649.2 35810.2 lineto
47761.7 35866.4 lineto
47817.9 35922.7 lineto
47930.4 36091.4 lineto
47986.7 36316.4 lineto
47986.7 36766.3 lineto
47930.4 36878.8 lineto
47874.2 36935.1 lineto
47761.7 36991.3 lineto
47536.7 36991.3 lineto
47424.2 36935.1 lineto
47368 36878.8 lineto
47311.7 36766.3 lineto
47311.7 36485.1 lineto
47368 36372.6 lineto
47424.2 36316.4 lineto
47536.7 36260.1 lineto
47761.7 36260.1 lineto
47874.2 36316.4 lineto
47930.4 36372.6 lineto
47986.7 36485.1 lineto
stroke
newpath
48436.6 36991.3 moveto
48436.6 36766.3 lineto
stroke
newpath
48886.5 36991.3 moveto
48886.5 36766.3 lineto
stroke
newpath
50630.1 35360.3 moveto
50573.8 35416.5 lineto
50461.3 35585.2 lineto
50405.1 35697.7 lineto
50348.9 35866.4 lineto
50292.6 36147.7 lineto
50292.6 36372.6 lineto
50348.9 36653.8 lineto
50405.1 36822.6 lineto
50461.3 36935.1 lineto
50573.8 37103.8 lineto
50630.1 37160 lineto
stroke
newpath
51305 36991.3 moveto
51417.5 36991.3 lineto
51530 36935.1 lineto
51586.2 36878.8 lineto
51642.4 36766.3 lineto
51698.7 36541.4 lineto
51698.7 36260.1 lineto
51642.4 36035.2 lineto
51586.2 35922.7 lineto
51530 35866.4 lineto
51417.5 35810.2 lineto
51305 35810.2 lineto
51192.5 35866.4 lineto
51136.3 35922.7 lineto
51080 36035.2 lineto
51023.8 36260.1 lineto
51023.8 36541.4 lineto
51080 36766.3 lineto
51136.3 36878.8 lineto
51192.5 36935.1 lineto
51305 36991.3 lineto
stroke
newpath
53104.8 35810.2 moveto
53104.8 36991.3 lineto
stroke
newpath
53610.9 35810.2 moveto
53610.9 36428.9 lineto
53554.7 36541.4 lineto
53442.2 36597.6 lineto
53273.5 36597.6 lineto
53161 36541.4 lineto
53104.8 36485.1 lineto
stroke
newpath
54342.1 35810.2 moveto
54229.6 35866.4 lineto
54173.4 35922.7 lineto
54117.1 36035.2 lineto
54117.1 36372.6 lineto
54173.4 36485.1 lineto
54229.6 36541.4 lineto
54342.1 36597.6 lineto
54510.8 36597.6 lineto
54623.3 36541.4 lineto
54679.6 36485.1 lineto
54735.8 36372.6 lineto
54735.8 36035.2 lineto
54679.6 35922.7 lineto
54623.3 35866.4 lineto
54510.8 35810.2 lineto
54342.1 35810.2 lineto
stroke
newpath
55410.7 35810.2 moveto
55298.2 35866.4 lineto
55242 35978.9 lineto
55242 36991.3 lineto
stroke
newpath
56310.6 35866.4 moveto
56198.1 35810.2 lineto
55973.2 35810.2 lineto
55860.7 35866.4 lineto
55804.4 35978.9 lineto
55804.4 36428.9 lineto
55860.7 36541.4 lineto
55973.2 36597.6 lineto
56198.1 36597.6 lineto
56310.6 36541.4 lineto
56366.9 36428.9 lineto
56366.9 36316.4 lineto
55804.4 36203.9 lineto
stroke
newpath
56816.8 35866.4 moveto
56929.3 35810.2 lineto
57154.3 35810.2 lineto
57266.7 35866.4 lineto
57323 35978.9 lineto
57323 36035.2 lineto
57266.7 36147.7 lineto
57154.3 36203.9 lineto
56985.5 36203.9 lineto
56873 36260.1 lineto
56816.8 36372.6 lineto
56816.8 36428.9 lineto
56873 36541.4 lineto
56985.5 36597.6 lineto
57154.3 36597.6 lineto
57266.7 36541.4 lineto
stroke
newpath
58729.1 36260.1 moveto
59628.9 36260.1 lineto
stroke
newpath
59179 35810.2 moveto
59179 36710.1 lineto
stroke
newpath
61597.5 36597.6 moveto
61597.5 35810.2 lineto
stroke
newpath
61316.2 37047.5 moveto
61035 36203.9 lineto
61766.2 36203.9 lineto
stroke
newpath
63059.8 35866.4 moveto
63172.3 35810.2 lineto
63397.2 35810.2 lineto
63509.7 35866.4 lineto
63566 35978.9 lineto
63566 36035.2 lineto
63509.7 36147.7 lineto
63397.2 36203.9 lineto
63228.5 36203.9 lineto
63116 36260.1 lineto
63059.8 36372.6 lineto
63059.8 36428.9 lineto
63116 36541.4 lineto
63228.5 36597.6 lineto
63397.2 36597.6 lineto
63509.7 36541.4 lineto
stroke
newpath
64240.9 35810.2 moveto
64128.4 35866.4 lineto
64072.1 35978.9 lineto
64072.1 36991.3 lineto
stroke
newpath
64859.5 35810.2 moveto
64747.1 35866.4 lineto
64690.8 35922.7 lineto
64634.6 36035.2 lineto
64634.6 36372.6 lineto
64690.8 36485.1 lineto
64747.1 36541.4 lineto
64859.5 36597.6 lineto
65028.3 36597.6 lineto
65140.8 36541.4 lineto
65197 36485.1 lineto
65253.2 36372.6 lineto
65253.2 36035.2 lineto
65197 35922.7 lineto
65140.8 35866.4 lineto
65028.3 35810.2 lineto
64859.5 35810.2 lineto
stroke
newpath
65590.7 36597.6 moveto
66040.6 36597.6 lineto
stroke
newpath
65759.4 36991.3 moveto
65759.4 35978.9 lineto
65815.7 35866.4 lineto
65928.2 35810.2 lineto
66040.6 35810.2 lineto
stroke
newpath
66378.1 35866.4 moveto
66490.6 35810.2 lineto
66715.6 35810.2 lineto
66828 35866.4 lineto
66884.3 35978.9 lineto
66884.3 36035.2 lineto
66828 36147.7 lineto
66715.6 36203.9 lineto
66546.8 36203.9 lineto
66434.3 36260.1 lineto
66378.1 36372.6 lineto
66378.1 36428.9 lineto
66434.3 36541.4 lineto
66546.8 36597.6 lineto
66715.6 36597.6 lineto
66828 36541.4 lineto
stroke
newpath
67278 35360.3 moveto
67334.2 35416.5 lineto
67446.7 35585.2 lineto
67503 35697.7 lineto
67559.2 35866.4 lineto
67615.4 36147.7 lineto
67615.4 36372.6 lineto
67559.2 36653.8 lineto
67503 36822.6 lineto
67446.7 36935.1 lineto
67334.2 37103.8 lineto
67278 37160 lineto
stroke
showpage
grestore
%%EOF
