{
"type": "FeatureCollection",
"creator": "svg2geojson v0.7.0",
"name": "line1-simple-dashed",
  "features": [
    {
      "type": "Feature",
      "geometry": {
        "type": "LineString",
        "coordinates": [
          [ 4.399263, 50.839219 ], [ 4.390981, 50.840973 ], [ 4.384689, 50.842298 ], [ 4.366333, 50.84616 ], [ 4.366301, 50.846166 ], [ 4.366236, 50.846177 ], [ 4.36617, 50.846186 ], [ 4.366102, 50.846192 ], [ 4.366033, 50.846196 ], [ 4.365963, 50.846198 ], [ 4.365893, 50.846198 ], [ 4.365822, 50.846197 ], [ 4.365751, 50.846193 ], [ 4.36568, 50.846189 ], [ 4.36561, 50.846183 ], [ 4.36554, 50.846175 ], [ 4.365471, 50.846167 ], [ 4.365402, 50.846157 ], [ 4.365335, 50.846147 ], [ 4.36527, 50.846136 ], [ 4.365237, 50.84613 ], [ 4.362292, 50.845589 ], [ 4.362245, 50.84558 ], [ 4.36215, 50.845564 ], [ 4.362053, 50.845548 ], [ 4.361954, 50.845533 ], [ 4.361854, 50.84552 ], [ 4.361753, 50.845508 ], [ 4.361652, 50.845497 ], [ 4.361549, 50.845487 ], [ 4.361446, 50.84548 ], [ 4.361343, 50.845474 ], [ 4.361239, 50.845469 ], [ 4.361136, 50.845467 ], [ 4.361032, 50.845467 ], [ 4.360929, 50.845469 ], [ 4.360827, 50.845473 ], [ 4.360725, 50.84548 ], [ 4.360625, 50.84549 ], [ 4.360525, 50.845502 ], [ 4.360427, 50.845517 ], [ 4.360331, 50.845534 ], [ 4.360236, 50.845555 ], [ 4.360143, 50.845579 ], [ 4.360074, 50.8456 ], [ 4.360029, 50.845614 ], [ 4.359985, 50.845629 ], [ 4.359941, 50.845646 ], [ 4.359898, 50.845663 ], [ 4.359856, 50.845681 ], [ 4.359814, 50.8457 ], [ 4.359773, 50.84572 ], [ 4.359732, 50.845741 ], [ 4.359693, 50.845762 ], [ 4.359654, 50.845785 ], [ 4.359616, 50.845809 ], [ 4.359579, 50.845834 ], [ 4.359542, 50.84586 ], [ 4.359506, 50.845887 ], [ 4.359472, 50.845915 ], [ 4.359438, 50.845944 ], [ 4.359405, 50.845974 ], [ 4.359373, 50.846005 ], [ 4.359342, 50.846037 ], [ 4.359327, 50.846054 ], [ 4.358547, 50.846922 ], [ 4.35849, 50.846985 ], [ 4.358408, 50.847073 ], [ 4.358349, 50.847131 ], [ 4.358282, 50.847191 ], [ 4.358223, 50.847239 ], [ 4.358179, 50.847273 ], [ 4.358104, 50.847328 ], [ 4.357985, 50.84741 ], [ 4.357917, 50.847456 ], [ 4.356893, 50.848128 ], [ 4.356841, 50.848161 ], [ 4.35674, 50.848225 ], [ 4.356639, 50.848286 ], [ 4.356539, 50.848343 ], [ 4.35644, 50.848397 ], [ 4.356343, 50.848448 ], [ 4.356247, 50.848496 ], [ 4.356152, 50.848541 ], [ 4.356058, 50.848583 ], [ 4.355966, 50.848623 ], [ 4.355875, 50.84866 ], [ 4.355786, 50.848696 ], [ 4.355698, 50.848728 ], [ 4.355612, 50.848759 ], [ 4.355528, 50.848788 ], [ 4.355445, 50.848815 ], [ 4.355324, 50.848853 ], [ 4.35517, 50.848898 ], [ 4.355024, 50.848937 ], [ 4.354886, 50.848973 ], [ 4.354757, 50.849006 ], [ 4.354637, 50.849037 ], [ 4.354527, 50.849067 ], [ 4.354451, 50.849089 ], [ 4.354404, 50.849105 ], [ 4.354381, 50.849112 ], [ 4.353733, 50.849339 ], [ 4.353718, 50.849344 ], [ 4.353689, 50.849356 ], [ 4.353643, 50.849376 ], [ 4.35358, 50.849406 ], [ 4.353515, 50.84944 ], [ 4.353451, 50.849476 ], [ 4.353387, 50.849514 ], [ 4.353295, 50.84957 ], [ 4.353238, 50.849605 ], [ 4.352157, 50.850284 ], [ 4.352131, 50.8503 ], [ 4.352072, 50.850336 ], [ 4.352003, 50.850375 ], [ 4.351924, 50.850418 ], [ 4.351837, 50.850464 ], [ 4.351742, 50.850512 ], [ 4.35164, 50.850561 ], [ 4.35153, 50.850612 ], [ 4.351414, 50.850664 ], [ 4.351292, 50.850715 ], [ 4.351165, 50.850766 ], [ 4.351034, 50.850816 ], [ 4.350898, 50.850865 ], [ 4.350758, 50.850911 ], [ 4.350651, 50.850944 ], [ 4.350579, 50.850964 ], [ 4.350507, 50.850984 ], [ 4.350434, 50.851004 ], [ 4.350397, 50.851013 ], [ 4.35036, 50.851022 ], [ 4.350286, 50.851038 ], [ 4.350213, 50.851054 ], [ 4.35014, 50.851067 ], [ 4.350067, 50.85108 ], [ 4.349995, 50.851092 ], [ 4.349888, 50.851107 ], [ 4.349748, 50.851125 ], [ 4.349613, 50.851141 ], [ 4.349482, 50.851156 ], [ 4.349356, 50.851171 ], [ 4.349237, 50.851187 ], [ 4.349152, 50.8512 ], [ 4.349098, 50.85121 ], [ 4.349046, 50.85122 ], [ 4.348996, 50.851232 ], [ 4.348948, 50.851244 ], [ 4.348902, 50.851258 ], [ 4.348859, 50.851273 ], [ 4.348818, 50.851289 ], [ 4.34878, 50.851307 ], [ 4.348745, 50.851326 ], [ 4.348712, 50.851348 ], [ 4.348682, 50.851371 ], [ 4.348655, 50.851397 ], [ 4.348631, 50.851425 ], [ 4.34862, 50.851439 ], [ 4.3473, 50.853354 ], [ 4.34729, 50.853368 ], [ 4.347269, 50.853396 ], [ 4.347247, 50.853423 ], [ 4.347223, 50.853449 ], [ 4.347199, 50.853473 ], [ 4.347173, 50.853497 ], [ 4.347146, 50.85352 ], [ 4.347118, 50.853542 ], [ 4.347089, 50.853563 ], [ 4.347059, 50.853583 ], [ 4.347028, 50.853602 ], [ 4.346996, 50.853621 ], [ 4.346963, 50.853638 ], [ 4.346929, 50.853655 ], [ 4.346894, 50.853671 ], [ 4.346858, 50.853686 ], [ 4.346821, 50.8537 ], [ 4.346783, 50.853714 ], [ 4.346725, 50.853733 ], [ 4.346644, 50.853755 ], [ 4.34656, 50.853775 ], [ 4.346472, 50.853793 ], [ 4.346382, 50.853808 ], [ 4.346288, 50.85382 ], [ 4.346192, 50.853831 ], [ 4.346143, 50.853835 ], [ 4.342916, 50.854115 ], [ 4.342836, 50.854122 ], [ 4.342674, 50.854139 ], [ 4.342549, 50.854153 ], [ 4.342464, 50.854165 ], [ 4.342379, 50.854177 ], [ 4.342294, 50.854192 ], [ 4.342209, 50.854208 ], [ 4.342123, 50.854226 ], [ 4.342038, 50.854247 ], [ 4.341953, 50.85427 ], [ 4.341869, 50.854296 ], [ 4.341786, 50.854325 ], [ 4.341703, 50.854357 ], [ 4.341622, 50.854392 ], [ 4.341582, 50.854411 ], [ 4.3383, 50.856011 ], [ 4.338234, 50.856043 ], [ 4.3381, 50.856107 ], [ 4.337964, 50.85617 ], [ 4.337824, 50.856232 ], [ 4.337682, 50.856294 ], [ 4.337538, 50.856355 ], [ 4.337391, 50.856414 ], [ 4.337243, 50.856473 ], [ 4.337092, 50.85653 ], [ 4.336939, 50.856586 ], [ 4.336784, 50.856641 ], [ 4.336628, 50.856694 ], [ 4.33647, 50.856745 ], [ 4.33631, 50.856794 ], [ 4.336149, 50.856842 ], [ 4.335987, 50.856887 ], [ 4.335824, 50.85693 ], [ 4.33566, 50.856971 ], [ 4.335495, 50.857009 ], [ 4.335329, 50.857044 ], [ 4.335163, 50.857077 ], [ 4.334996, 50.857107 ], [ 4.334829, 50.857134 ], [ 4.334661, 50.857158 ], [ 4.334494, 50.857179 ], [ 4.334326, 50.857197 ], [ 4.334158, 50.857211 ], [ 4.334033, 50.857219 ], [ 4.333949, 50.857223 ], [ 4.333866, 50.857227 ], [ 4.333782, 50.857229 ], [ 4.333699, 50.857231 ], [ 4.333616, 50.857231 ], [ 4.333533, 50.857231 ], [ 4.33345, 50.857229 ], [ 4.333368, 50.857227 ], [ 4.333285, 50.857223 ], [ 4.333244, 50.857221 ], [ 4.331343, 50.857116 ], [ 4.331274, 50.857112 ], [ 4.331138, 50.857102 ], [ 4.331007, 50.857091 ], [ 4.330879, 50.857079 ], [ 4.330756, 50.857066 ], [ 4.330637, 50.857052 ], [ 4.330466, 50.85703 ], [ 4.330253, 50.857001 ], [ 4.330057, 50.856975 ], [ 4.329921, 50.856958 ], [ 4.329836, 50.856949 ], [ 4.329755, 50.856941 ], [ 4.329678, 50.856935 ], [ 4.329641, 50.856934 ], [ 4.328299, 50.856872 ], [ 4.328236, 50.856869 ], [ 4.32811, 50.856861 ], [ 4.327984, 50.856852 ], [ 4.327858, 50.856841 ], [ 4.327733, 50.856828 ], [ 4.327607, 50.856814 ], [ 4.327483, 50.856797 ], [ 4.327359, 50.856779 ], [ 4.327236, 50.856759 ], [ 4.327114, 50.856737 ], [ 4.326993, 50.856713 ], [ 4.326873, 50.856687 ], [ 4.326755, 50.856659 ], [ 4.326639, 50.856629 ], [ 4.326525, 50.856597 ], [ 4.326412, 50.856563 ], [ 4.326302, 50.856527 ], [ 4.326194, 50.856489 ], [ 4.326088, 50.856449 ], [ 4.325986, 50.856406 ], [ 4.325886, 50.856362 ], [ 4.325788, 50.856315 ], [ 4.325694, 50.856266 ], [ 4.325604, 50.856215 ], [ 4.325516, 50.856162 ], [ 4.325433, 50.856106 ], [ 4.325353, 50.856048 ], [ 4.325277, 50.855988 ], [ 4.325205, 50.855925 ], [ 4.325154, 50.855877 ], [ 4.325121, 50.855843 ], [ 4.325089, 50.85581 ], [ 4.325059, 50.855775 ], [ 4.325029, 50.85574 ], [ 4.325001, 50.855705 ], [ 4.324987, 50.855687 ], [ 4.324113, 50.854515 ], [ 4.324095, 50.85449 ], [ 4.324058, 50.854434 ], [ 4.32402, 50.85437 ], [ 4.323981, 50.854301 ], [ 4.323943, 50.854226 ], [ 4.323904, 50.854147 ], [ 4.323846, 50.854024 ], [ 4.323733, 50.853772 ], [ 4.323631, 50.853539 ], [ 4.323572, 50.853408 ], [ 4.323545, 50.853354 ], [ 4.322719, 50.851678 ], [ 4.31999, 50.84764 ], [ 4.320589, 50.84876 ], [ 4.320605, 50.848788 ], [ 4.320641, 50.848851 ], [ 4.320685, 50.848921 ], [ 4.320735, 50.848998 ], [ 4.320822, 50.849125 ], [ 4.320956, 50.849314 ], [ 4.321108, 50.849521 ], [ 4.321272, 50.849741 ], [ 4.321534, 50.850088 ], [ 4.321892, 50.850558 ], [ 4.322149, 50.850896 ], [ 4.322306, 50.851106 ], [ 4.322449, 50.851299 ], [ 4.322571, 50.851471 ], [ 4.322648, 50.851583 ], [ 4.322691, 50.851649 ], [ 4.322727, 50.851707 ], [ 4.322755, 50.851757 ], [ 4.322766, 50.851778 ]
        ]
      }
    }
  ]
}
