
{
  "type": "FeatureCollection",
  "creator": "svg2geojson v0.7.0",
  "name": "line2",
  "features": [
    {
      "type": "Feature",
      "properties": {},
      "geometry": {
        "type": "MultiLineString",
        "coordinates": [
          [ [ 4.332236, 50.864317 ], [ 4.332245, 50.864325 ], [ 4.332262, 50.864344 ], [ 4.332278, 50.864366 ], [ 4.332292, 50.86439 ], [ 4.332312, 50.864429 ], [ 4.332337, 50.864488 ], [ 4.332364, 50.864549 ], [ 4.332386, 50.864596 ], [ 4.332402, 50.864627 ], [ 4.332421, 50.864657 ], [ 4.332441, 50.864686 ], [ 4.332464, 50.864714 ], [ 4.332489, 50.86474 ], [ 4.332503, 50.864752 ], [ 4.334625, 50.866532 ], [ 4.334637, 50.866541 ], [ 4.334665, 50.86656 ], [ 4.334698, 50.866579 ], [ 4.334735, 50.866598 ], [ 4.334774, 50.866617 ], [ 4.334816, 50.866636 ], [ 4.334879, 50.866662 ], [ 4.334962, 50.866693 ], [ 4.335035, 50.866719 ], [ 4.33511, 50.866743 ], [ 4.335127, 50.866749 ] ] ,
          [ [ 4.333191, 50.865527 ], [ 4.3332, 50.865534 ], [ 4.333222, 50.865548 ], [ 4.333247, 50.865561 ], [ 4.333274, 50.865573 ], [ 4.333319, 50.865588 ], [ 4.333385, 50.865608 ], [ 4.333455, 50.865629 ], [ 4.333508, 50.865646 ], [ 4.333543, 50.865659 ], [ 4.333578, 50.865674 ], [ 4.333611, 50.865691 ], [ 4.333643, 50.865709 ], [ 4.333674, 50.86573 ], [ 4.333688, 50.865742 ] ] ,
          [ [ 4.334522, 50.866439 ], [ 4.33453, 50.866447 ], [ 4.334546, 50.866465 ], [ 4.334559, 50.866484 ], [ 4.334569, 50.866505 ], [ 4.334583, 50.866539 ], [ 4.334599, 50.866587 ], [ 4.334615, 50.866639 ], [ 4.33463, 50.866678 ], [ 4.334642, 50.866704 ], [ 4.334656, 50.86673 ], [ 4.334674, 50.866756 ], [ 4.334694, 50.866781 ], [ 4.334718, 50.866806 ], [ 4.334732, 50.866818 ] ] ,
          [ [ 4.33149, 50.863236 ], [ 4.332276, 50.863009 ], [ 4.333101, 50.862772 ], [ 4.345745, 50.85912 ], [ 4.345944, 50.859063 ], [ 4.346337, 50.858952 ], [ 4.346728, 50.858842 ], [ 4.347122, 50.858731 ], [ 4.347322, 50.858674 ], [ 4.356838, 50.855943 ], [ 4.356864, 50.855936 ], [ 4.356925, 50.855922 ], [ 4.357033, 50.855902 ], [ 4.357187, 50.855875 ], [ 4.357294, 50.855854 ], [ 4.357354, 50.855841 ], [ 4.35738, 50.855834 ], [ 4.358834, 50.855411 ], [ 4.358956, 50.855376 ], [ 4.359215, 50.855302 ], [ 4.35936, 50.855261 ], [ 4.359406, 50.855249 ], [ 4.359453, 50.855236 ], [ 4.359546, 50.855211 ], [ 4.359637, 50.855188 ], [ 4.359727, 50.855166 ], [ 4.359815, 50.855145 ], [ 4.359902, 50.855126 ], [ 4.360029, 50.855099 ], [ 4.360194, 50.855068 ], [ 4.360354, 50.855041 ], [ 4.360508, 50.855018 ], [ 4.360658, 50.854999 ], [ 4.360804, 50.854984 ], [ 4.360946, 50.854971 ], [ 4.361083, 50.854962 ], [ 4.361218, 50.854954 ], [ 4.361349, 50.854949 ], [ 4.361477, 50.854945 ], [ 4.361665, 50.854942 ], [ 4.361908, 50.85494 ], [ 4.362145, 50.854939 ], [ 4.36232, 50.854937 ], [ 4.362436, 50.854935 ], [ 4.362552, 50.854931 ], [ 4.362669, 50.854925 ], [ 4.362786, 50.854917 ], [ 4.362903, 50.854907 ], [ 4.363022, 50.854894 ], [ 4.363142, 50.854878 ], [ 4.363264, 50.854858 ], [ 4.363388, 50.854834 ], [ 4.363483, 50.854814 ], [ 4.363546, 50.854799 ], [ 4.363611, 50.854783 ], [ 4.363676, 50.854766 ], [ 4.363709, 50.854757 ], [ 4.366844, 50.853877 ], [ 4.366878, 50.853867 ], [ 4.366946, 50.853847 ], [ 4.367014, 50.853825 ], [ 4.36708, 50.853801 ], [ 4.367144, 50.853777 ], [ 4.367208, 50.853751 ], [ 4.36727, 50.853724 ], [ 4.367331, 50.853697 ], [ 4.36739, 50.853668 ], [ 4.367448, 50.853638 ], [ 4.367504, 50.853608 ], [ 4.367559, 50.853577 ], [ 4.367612, 50.853545 ], [ 4.367663, 50.853513 ], [ 4.367713, 50.85348 ], [ 4.367761, 50.853446 ], [ 4.367807, 50.853412 ], [ 4.367851, 50.853378 ], [ 4.367893, 50.853343 ], [ 4.367933, 50.853308 ], [ 4.367971, 50.853273 ], [ 4.368007, 50.853237 ], [ 4.368041, 50.853202 ], [ 4.368072, 50.853167 ], [ 4.368101, 50.853131 ], [ 4.368128, 50.853096 ], [ 4.368153, 50.853061 ], [ 4.368175, 50.853026 ], [ 4.368195, 50.852991 ], [ 4.368212, 50.852957 ], [ 4.368226, 50.852923 ], [ 4.368238, 50.85289 ], [ 4.368243, 50.852873 ], [ 4.369559, 50.848123 ], [ 4.369576, 50.84806 ], [ 4.36961, 50.847936 ], [ 4.369634, 50.847843 ], [ 4.369647, 50.847782 ], [ 4.369659, 50.84772 ], [ 4.369668, 50.847659 ], [ 4.369675, 50.847598 ], [ 4.369678, 50.847537 ], [ 4.369678, 50.847476 ], [ 4.369674, 50.847415 ], [ 4.369665, 50.847355 ], [ 4.369651, 50.847294 ], [ 4.369632, 50.847234 ], [ 4.369614, 50.847188 ], [ 4.3696, 50.847158 ], [ 4.369592, 50.847143 ], [ 4.366446, 50.840959 ], [ 4.366435, 50.840939 ], [ 4.366412, 50.840897 ], [ 4.366386, 50.840856 ], [ 4.366357, 50.840814 ], [ 4.366326, 50.840773 ], [ 4.366293, 50.840733 ], [ 4.366257, 50.840692 ], [ 4.366219, 50.840653 ], [ 4.366179, 50.840614 ], [ 4.366137, 50.840577 ], [ 4.366093, 50.840541 ], [ 4.366048, 50.840505 ], [ 4.366, 50.840472 ], [ 4.365951, 50.84044 ], [ 4.365901, 50.840409 ], [ 4.365849, 50.840381 ], [ 4.365822, 50.840368 ], [ 4.365452, 50.840186 ], [ 4.364739, 50.839838 ], [ 4.364061, 50.839511 ], [ 4.363417, 50.839202 ], [ 4.362803, 50.838911 ], [ 4.362219, 50.838637 ], [ 4.36166, 50.838378 ], [ 4.361127, 50.838132 ], [ 4.360615, 50.8379 ], [ 4.360123, 50.837679 ], [ 4.359648, 50.837469 ], [ 4.359189, 50.837268 ], [ 4.358743, 50.837074 ], [ 4.358308, 50.836888 ], [ 4.357882, 50.836706 ], [ 4.357462, 50.836529 ], [ 4.35684, 50.836269 ], [ 4.356012, 50.835926 ], [ 4.355171, 50.835578 ], [ 4.354297, 50.835215 ], [ 4.35361, 50.834928 ], [ 4.353133, 50.834727 ], [ 4.352638, 50.834516 ], [ 4.352123, 50.834295 ], [ 4.351585, 50.834063 ], [ 4.351023, 50.833818 ], [ 4.350433, 50.833558 ], [ 4.349815, 50.833284 ], [ 4.349494, 50.833141 ], [ 4.349459, 50.833125 ], [ 4.349389, 50.833095 ], [ 4.349319, 50.833067 ], [ 4.34925, 50.83304 ], [ 4.349181, 50.833015 ], [ 4.349113, 50.832991 ], [ 4.349044, 50.832969 ], [ 4.348977, 50.832949 ], [ 4.348909, 50.83293 ], [ 4.348841, 50.832912 ], [ 4.348773, 50.832896 ], [ 4.348706, 50.832881 ], [ 4.348638, 50.832868 ], [ 4.34857, 50.832855 ], [ 4.348501, 50.832844 ], [ 4.348432, 50.832834 ], [ 4.348363, 50.832825 ], [ 4.348293, 50.832816 ], [ 4.348223, 50.832809 ], [ 4.348152, 50.832803 ], [ 4.348044, 50.832796 ], [ 4.347896, 50.832789 ], [ 4.347745, 50.832785 ], [ 4.347589, 50.832783 ], [ 4.347428, 50.832784 ], [ 4.347261, 50.832787 ], [ 4.347175, 50.832789 ], [ 4.345768, 50.832825 ], [ 4.345687, 50.832827 ], [ 4.345533, 50.832833 ], [ 4.34539, 50.832841 ], [ 4.345256, 50.832851 ], [ 4.345131, 50.832863 ], [ 4.345014, 50.832877 ], [ 4.344906, 50.832893 ], [ 4.344804, 50.83291 ], [ 4.344709, 50.832929 ], [ 4.344621, 50.83295 ], [ 4.344538, 50.832972 ], [ 4.344459, 50.832996 ], [ 4.344385, 50.833021 ], [ 4.344315, 50.833048 ], [ 4.344248, 50.833076 ], [ 4.344183, 50.833106 ], [ 4.344152, 50.833121 ], [ 4.343986, 50.833201 ], [ 4.343647, 50.833369 ], [ 4.343297, 50.833543 ], [ 4.342936, 50.833723 ], [ 4.342752, 50.833816 ] ] ,
          [ [ 4.338358, 50.836439 ], [ 4.337065, 50.837146 ], [ 4.337042, 50.837159 ], [ 4.336995, 50.837187 ], [ 4.336948, 50.837217 ], [ 4.3369, 50.83725 ], [ 4.336851, 50.837285 ], [ 4.336803, 50.837322 ], [ 4.336728, 50.837382 ], [ 4.336628, 50.837467 ], [ 4.336526, 50.837558 ], [ 4.33637, 50.837702 ], [ 4.336159, 50.837904 ], [ 4.335998, 50.838055 ], [ 4.33589, 50.838155 ], [ 4.335781, 50.838251 ], [ 4.335672, 50.838344 ], [ 4.33559, 50.83841 ], [ 4.335536, 50.838452 ], [ 4.335481, 50.838492 ], [ 4.335427, 50.838531 ], [ 4.335399, 50.838549 ], [ 4.33258, 50.840437 ], [ 4.332544, 50.84046 ], [ 4.332472, 50.840504 ], [ 4.332399, 50.840545 ], [ 4.332327, 50.840584 ], [ 4.332221, 50.84064 ], [ 4.332119, 50.840695 ], [ 4.332054, 50.840734 ], [ 4.332023, 50.840754 ], [ 4.330969, 50.841449 ], [ 4.330951, 50.841461 ], [ 4.330919, 50.841484 ], [ 4.330891, 50.841505 ], [ 4.330866, 50.841526 ], [ 4.330833, 50.841556 ], [ 4.330794, 50.841594 ], [ 4.330757, 50.84163 ], [ 4.330717, 50.841667 ], [ 4.330683, 50.841696 ], [ 4.330656, 50.841715 ], [ 4.330626, 50.841735 ], [ 4.330592, 50.841756 ], [ 4.330574, 50.841767 ], [ 4.327581, 50.843473 ], [ 4.327547, 50.843493 ], [ 4.327478, 50.843531 ], [ 4.327406, 50.843569 ], [ 4.327333, 50.843606 ], [ 4.327221, 50.843662 ], [ 4.327066, 50.843735 ], [ 4.326908, 50.843807 ], [ 4.326746, 50.843879 ], [ 4.326501, 50.843986 ], [ 4.326255, 50.844094 ], [ 4.326093, 50.844167 ], [ 4.325933, 50.844241 ], [ 4.325777, 50.844317 ], [ 4.325663, 50.844374 ], [ 4.325589, 50.844413 ], [ 4.325516, 50.844453 ], [ 4.325445, 50.844493 ], [ 4.325376, 50.844534 ], [ 4.325309, 50.844575 ], [ 4.325245, 50.844617 ], [ 4.325182, 50.84466 ], [ 4.325152, 50.844681 ], [ 4.323935, 50.845556 ], [ 4.32387, 50.845604 ], [ 4.323706, 50.845726 ], [ 4.323401, 50.845955 ], [ 4.323062, 50.84621 ], [ 4.322836, 50.846378 ], [ 4.322675, 50.846495 ], [ 4.322574, 50.846567 ], [ 4.32248, 50.846632 ], [ 4.322395, 50.84669 ], [ 4.322356, 50.846715 ], [ 4.322311, 50.846745 ], [ 4.322217, 50.846811 ], [ 4.322142, 50.846868 ], [ 4.32209, 50.846908 ], [ 4.322038, 50.846951 ], [ 4.321986, 50.846996 ], [ 4.321933, 50.847043 ], [ 4.321881, 50.847092 ], [ 4.321828, 50.847142 ], [ 4.321777, 50.847195 ], [ 4.321727, 50.84725 ], [ 4.321678, 50.847306 ], [ 4.32163, 50.847364 ], [ 4.321584, 50.847423 ], [ 4.321541, 50.847484 ], [ 4.3215, 50.847546 ], [ 4.321462, 50.84761 ], [ 4.321427, 50.847675 ], [ 4.321395, 50.847741 ], [ 4.321367, 50.847808 ], [ 4.321343, 50.847877 ], [ 4.321323, 50.847946 ], [ 4.321307, 50.848016 ], [ 4.321297, 50.848087 ], [ 4.321291, 50.848159 ], [ 4.321291, 50.848213 ], [ 4.321292, 50.848249 ], [ 4.321295, 50.848286 ], [ 4.321299, 50.848322 ], [ 4.321305, 50.848359 ], [ 4.321312, 50.848396 ], [ 4.321321, 50.848433 ], [ 4.321332, 50.84847 ], [ 4.321344, 50.848507 ], [ 4.321358, 50.848544 ], [ 4.321366, 50.848563 ], [ 4.321881, 50.849636 ] ] ,
          [ [ 4.3224, 50.852042 ], [ 4.322502, 50.852248 ], [ 4.322639, 50.852526 ], [ 4.323118, 50.853499 ], [ 4.32314, 50.853541 ], [ 4.323183, 50.853625 ], [ 4.323251, 50.853752 ], [ 4.323347, 50.853919 ], [ 4.323447, 50.854086 ], [ 4.323551, 50.854252 ], [ 4.323658, 50.854416 ], [ 4.323821, 50.854661 ], [ 4.32404, 50.854982 ], [ 4.324202, 50.855219 ], [ 4.324306, 50.855375 ], [ 4.324407, 50.855529 ], [ 4.324504, 50.855681 ], [ 4.324596, 50.855832 ], [ 4.324681, 50.85598 ], [ 4.324721, 50.856054 ], [ 4.324739, 50.856085 ], [ 4.324778, 50.856153 ], [ 4.324846, 50.856262 ], [ 4.324941, 50.85641 ], [ 4.325007, 50.856514 ], [ 4.325044, 50.856576 ], [ 4.32506, 50.856604 ], [ 4.325555, 50.857496 ], [ 4.325568, 50.857519 ], [ 4.325601, 50.857567 ], [ 4.325661, 50.857646 ], [ 4.325747, 50.857755 ], [ 4.325807, 50.857833 ], [ 4.32584, 50.857882 ], [ 4.325853, 50.857905 ], [ 4.325922, 50.858028 ], [ 4.326061, 50.858273 ], [ 4.326201, 50.858519 ], [ 4.326345, 50.858764 ], [ 4.326493, 50.859008 ], [ 4.326645, 50.859251 ], [ 4.326762, 50.859432 ], [ 4.326842, 50.859552 ], [ 4.326923, 50.859672 ], [ 4.327006, 50.859791 ], [ 4.327091, 50.85991 ], [ 4.327177, 50.860028 ], [ 4.327265, 50.860145 ], [ 4.327355, 50.860262 ], [ 4.327447, 50.860377 ], [ 4.327541, 50.860492 ], [ 4.327638, 50.860607 ], [ 4.327736, 50.86072 ], [ 4.327837, 50.860832 ], [ 4.327941, 50.860944 ], [ 4.328047, 50.861054 ], [ 4.328155, 50.861163 ], [ 4.328267, 50.861271 ], [ 4.328381, 50.861378 ], [ 4.328497, 50.861484 ], [ 4.328617, 50.861588 ], [ 4.328678, 50.86164 ], [ 4.329164, 50.862048 ], [ 4.329189, 50.862069 ], [ 4.329242, 50.862115 ], [ 4.329329, 50.862195 ], [ 4.329529, 50.862383 ], [ 4.329751, 50.862595 ], [ 4.329906, 50.862741 ], [ 4.330063, 50.862885 ], [ 4.330179, 50.862989 ], [ 4.330255, 50.863055 ], [ 4.330293, 50.863087 ], [ 4.331154, 50.863811 ], [ 4.331865, 50.864417 ], [ 4.333197, 50.865533 ] ] ,
          [ [ 4.331357, 50.863089 ], [ 4.332162, 50.862857 ], [ 4.333016, 50.86261 ], [ 4.345662, 50.85896 ], [ 4.345862, 50.858902 ], [ 4.346263, 50.858789 ], [ 4.346663, 50.858677 ], [ 4.347063, 50.858564 ], [ 4.347264, 50.858506 ], [ 4.356718, 50.855793 ], [ 4.356733, 50.855789 ], [ 4.356763, 50.855779 ], [ 4.356811, 50.855761 ], [ 4.356917, 50.855718 ], [ 4.357064, 50.855656 ], [ 4.35717, 50.855614 ], [ 4.357219, 50.855596 ], [ 4.357249, 50.855586 ], [ 4.357264, 50.855582 ], [ 4.358714, 50.855159 ], [ 4.358757, 50.855147 ], [ 4.358886, 50.855111 ], [ 4.359111, 50.85505 ], [ 4.359219, 50.85502 ], [ 4.359266, 50.855007 ], [ 4.359359, 50.854982 ], [ 4.359452, 50.854958 ], [ 4.359545, 50.854936 ], [ 4.359636, 50.854914 ], [ 4.359727, 50.854894 ], [ 4.359817, 50.854876 ], [ 4.359907, 50.854858 ], [ 4.36004, 50.854833 ], [ 4.360216, 50.854804 ], [ 4.360389, 50.854779 ], [ 4.36056, 50.854757 ], [ 4.360729, 50.854738 ], [ 4.360895, 50.854722 ], [ 4.361059, 50.854709 ], [ 4.361221, 50.854698 ], [ 4.361381, 50.854689 ], [ 4.361539, 50.854681 ], [ 4.361772, 50.854672 ], [ 4.362225, 50.854659 ], [ 4.362591, 50.854647 ], [ 4.362735, 50.854641 ], [ 4.362877, 50.854634 ], [ 4.363018, 50.854625 ], [ 4.363157, 50.854615 ], [ 4.363295, 50.854602 ], [ 4.363431, 50.854587 ], [ 4.363566, 50.854569 ], [ 4.363701, 50.854548 ], [ 4.3638, 50.85453 ], [ 4.363867, 50.854517 ], [ 4.363932, 50.854503 ], [ 4.363998, 50.854488 ], [ 4.364064, 50.854472 ], [ 4.364129, 50.854454 ], [ 4.364161, 50.854445 ], [ 4.366788, 50.85371 ], [ 4.366815, 50.853702 ], [ 4.366868, 50.853686 ], [ 4.366921, 50.853668 ], [ 4.366973, 50.853649 ], [ 4.367025, 50.853629 ], [ 4.367077, 50.853607 ], [ 4.367127, 50.853585 ], [ 4.367177, 50.853562 ], [ 4.367226, 50.853537 ], [ 4.367275, 50.853512 ], [ 4.367322, 50.853486 ], [ 4.367368, 50.853459 ], [ 4.367413, 50.853431 ], [ 4.367457, 50.853403 ], [ 4.3675, 50.853374 ], [ 4.367541, 50.853344 ], [ 4.367582, 50.853314 ], [ 4.36762, 50.853284 ], [ 4.367657, 50.853253 ], [ 4.367693, 50.853222 ], [ 4.367727, 50.85319 ], [ 4.367759, 50.853158 ], [ 4.367789, 50.853127 ], [ 4.367818, 50.853095 ], [ 4.367844, 50.853063 ], [ 4.367869, 50.853031 ], [ 4.367891, 50.852999 ], [ 4.367912, 50.852967 ], [ 4.36793, 50.852936 ], [ 4.367945, 50.852904 ], [ 4.367959, 50.852874 ], [ 4.36797, 50.852843 ], [ 4.367974, 50.852828 ], [ 4.36929, 50.848077 ], [ 4.369307, 50.848015 ], [ 4.369339, 50.847892 ], [ 4.369361, 50.847801 ], [ 4.369373, 50.84774 ], [ 4.369384, 50.84768 ], [ 4.369392, 50.84762 ], [ 4.369397, 50.847561 ], [ 4.369399, 50.847501 ], [ 4.369397, 50.847442 ], [ 4.369392, 50.847382 ], [ 4.369382, 50.847322 ], [ 4.369367, 50.847263 ], [ 4.369348, 50.847203 ], [ 4.369323, 50.847142 ], [ 4.369308, 50.847112 ], [ 4.366225, 50.841053 ], [ 4.366214, 50.841033 ], [ 4.366191, 50.840992 ], [ 4.366165, 50.84095 ], [ 4.366136, 50.840909 ], [ 4.366105, 50.840868 ], [ 4.366072, 50.840828 ], [ 4.366037, 50.840788 ], [ 4.365999, 50.840748 ], [ 4.365959, 50.84071 ], [ 4.365917, 50.840672 ], [ 4.365873, 50.840636 ], [ 4.365828, 50.840601 ], [ 4.36578, 50.840567 ], [ 4.365731, 50.840535 ], [ 4.36568, 50.840505 ], [ 4.365628, 50.840476 ], [ 4.365601, 50.840463 ], [ 4.365231, 50.840281 ], [ 4.364518, 50.839933 ], [ 4.363841, 50.839606 ], [ 4.363196, 50.839297 ], [ 4.362583, 50.839006 ], [ 4.361998, 50.838732 ], [ 4.36144, 50.838473 ], [ 4.360906, 50.838227 ], [ 4.360395, 50.837995 ], [ 4.359903, 50.837774 ], [ 4.359428, 50.837564 ], [ 4.358969, 50.837362 ], [ 4.358523, 50.837169 ], [ 4.358088, 50.836982 ], [ 4.357662, 50.836801 ], [ 4.357242, 50.836624 ], [ 4.35662, 50.836364 ], [ 4.355792, 50.836021 ], [ 4.35495, 50.835673 ], [ 4.354076, 50.835311 ], [ 4.353389, 50.835023 ], [ 4.352912, 50.834822 ], [ 4.352417, 50.834612 ], [ 4.351902, 50.834391 ], [ 4.351364, 50.834158 ], [ 4.350802, 50.833913 ], [ 4.350212, 50.833654 ], [ 4.349594, 50.83338 ], [ 4.349273, 50.833236 ], [ 4.349251, 50.833226 ], [ 4.349206, 50.833208 ], [ 4.34916, 50.83319 ], [ 4.349113, 50.833172 ], [ 4.349064, 50.833156 ], [ 4.349014, 50.833141 ], [ 4.348963, 50.833126 ], [ 4.34891, 50.833112 ], [ 4.348857, 50.833099 ], [ 4.348802, 50.833087 ], [ 4.348745, 50.833076 ], [ 4.348688, 50.833065 ], [ 4.348629, 50.833055 ], [ 4.348569, 50.833046 ], [ 4.348476, 50.833033 ], [ 4.348348, 50.833019 ], [ 4.348214, 50.833008 ], [ 4.348075, 50.832999 ], [ 4.347931, 50.832993 ], [ 4.347781, 50.832989 ], [ 4.347625, 50.832988 ], [ 4.347463, 50.832989 ], [ 4.347296, 50.832991 ], [ 4.34721, 50.832994 ], [ 4.345764, 50.833032 ], [ 4.345606, 50.833037 ], [ 4.345396, 50.833045 ], [ 4.345272, 50.833051 ], [ 4.345159, 50.833057 ], [ 4.345056, 50.833065 ], [ 4.344962, 50.833074 ], [ 4.344876, 50.833085 ], [ 4.344796, 50.833097 ], [ 4.344722, 50.833111 ], [ 4.344653, 50.833128 ], [ 4.344586, 50.833146 ], [ 4.344522, 50.833167 ], [ 4.344458, 50.833191 ], [ 4.344394, 50.833218 ], [ 4.344328, 50.833247 ], [ 4.344294, 50.833263 ], [ 4.344131, 50.833344 ], [ 4.343795, 50.833509 ], [ 4.343448, 50.833682 ], [ 4.343091, 50.833861 ], [ 4.342909, 50.833953 ], [ 4.342759, 50.834038 ], [ 4.342454, 50.834208 ], [ 4.342145, 50.834379 ], [ 4.341834, 50.83455 ], [ 4.341366, 50.834805 ], [ 4.340746, 50.835139 ], [ 4.340145, 50.835463 ], [ 4.339573, 50.83577 ], [ 4.339171, 50.835988 ], [ 4.338918, 50.836126 ], [ 4.338681, 50.836257 ], [ 4.338459, 50.836382 ], [ 4.338354, 50.836441 ] ] ,
          [ [ 4.34047, 50.836535 ], [ 4.338018, 50.837866 ], [ 4.337995, 50.837878 ], [ 4.337946, 50.837902 ], [ 4.337892, 50.837926 ], [ 4.337831, 50.837951 ], [ 4.337766, 50.837976 ], [ 4.337696, 50.838001 ], [ 4.337584, 50.83804 ], [ 4.337423, 50.838093 ], [ 4.33725, 50.838146 ], [ 4.336979, 50.838228 ], [ 4.336702, 50.83831 ], [ 4.33652, 50.838364 ], [ 4.336345, 50.838418 ], [ 4.336178, 50.838472 ], [ 4.336062, 50.838511 ], [ 4.335989, 50.838537 ], [ 4.33592, 50.838563 ], [ 4.335856, 50.838588 ], [ 4.335797, 50.838613 ], [ 4.335743, 50.838637 ], [ 4.335695, 50.838662 ], [ 4.335654, 50.838685 ], [ 4.335636, 50.838697 ], [ 4.332797, 50.840581 ], [ 4.332767, 50.840601 ], [ 4.332711, 50.840643 ], [ 4.332631, 50.840708 ], [ 4.332554, 50.840774 ], [ 4.332501, 50.840818 ], [ 4.332447, 50.840861 ], [ 4.33239, 50.840903 ], [ 4.332361, 50.840923 ], [ 4.331371, 50.841569 ], [ 4.331352, 50.841581 ], [ 4.331314, 50.841605 ], [ 4.331255, 50.841639 ], [ 4.331175, 50.841682 ], [ 4.331093, 50.841723 ], [ 4.330968, 50.841784 ], [ 4.330844, 50.841846 ], [ 4.330762, 50.841889 ], [ 4.330722, 50.841911 ], [ 4.327732, 50.843618 ], [ 4.327663, 50.843657 ], [ 4.327523, 50.843733 ], [ 4.327378, 50.843809 ], [ 4.327231, 50.843884 ], [ 4.327005, 50.843997 ], [ 4.326699, 50.844147 ], [ 4.32647, 50.844261 ], [ 4.326319, 50.844338 ], [ 4.32617, 50.844415 ], [ 4.326023, 50.844494 ], [ 4.325881, 50.844574 ], [ 4.325742, 50.844655 ], [ 4.325642, 50.844717 ], [ 4.325577, 50.844759 ], [ 4.325514, 50.844802 ], [ 4.325452, 50.844844 ], [ 4.325421, 50.844866 ], [ 4.324206, 50.845742 ] ] ,
          [ [ 4.32174, 50.848508 ], [ 4.322244, 50.849555 ], [ 4.322502, 50.850097 ], [ 4.322915, 50.850967 ], [ 4.323117, 50.85139 ], [ 4.323247, 50.851656 ], [ 4.323309, 50.851782 ], [ 4.323358, 50.851882 ], [ 4.323417, 50.852 ], [ 4.323513, 50.852189 ], [ 4.323582, 50.852325 ], [ 4.324086, 50.853317 ], [ 4.324106, 50.853357 ], [ 4.324146, 50.853439 ], [ 4.324203, 50.853563 ], [ 4.324277, 50.853732 ], [ 4.324347, 50.853904 ], [ 4.324414, 50.854079 ], [ 4.32448, 50.854256 ], [ 4.324575, 50.854523 ], [ 4.324699, 50.854875 ], [ 4.324791, 50.855134 ], [ 4.324854, 50.855303 ], [ 4.324918, 50.855467 ], [ 4.324983, 50.855626 ], [ 4.325051, 50.855778 ], [ 4.325103, 50.855888 ], [ 4.325139, 50.855959 ], [ 4.325157, 50.855994 ], [ 4.32519, 50.856056 ], [ 4.325259, 50.85619 ], [ 4.325329, 50.856327 ], [ 4.325394, 50.856454 ], [ 4.325424, 50.856511 ], [ 4.325922, 50.857407 ], [ 4.325928, 50.857418 ], [ 4.325939, 50.857443 ], [ 4.325955, 50.857482 ], [ 4.325973, 50.85754 ], [ 4.32599, 50.857601 ], [ 4.326007, 50.857663 ], [ 4.326024, 50.857724 ], [ 4.326042, 50.857781 ], [ 4.326058, 50.857821 ], [ 4.326069, 50.857845 ], [ 4.326075, 50.857857 ], [ 4.326143, 50.857979 ], [ 4.326281, 50.858224 ], [ 4.326421, 50.858468 ], [ 4.326564, 50.85871 ], [ 4.32671, 50.858952 ], [ 4.326822, 50.859132 ], [ 4.326899, 50.859251 ], [ 4.326976, 50.85937 ], [ 4.327055, 50.859489 ], [ 4.327136, 50.859607 ], [ 4.327218, 50.859724 ], [ 4.327302, 50.859841 ], [ 4.327388, 50.859957 ], [ 4.327475, 50.860073 ], [ 4.327565, 50.860188 ], [ 4.327657, 50.860302 ], [ 4.32775, 50.860416 ], [ 4.327846, 50.860529 ], [ 4.327945, 50.860641 ], [ 4.328046, 50.860752 ], [ 4.328149, 50.860863 ], [ 4.328255, 50.860973 ], [ 4.328364, 50.861082 ], [ 4.328475, 50.861189 ], [ 4.328589, 50.861297 ], [ 4.328707, 50.861403 ], [ 4.328827, 50.861508 ], [ 4.328889, 50.86156 ], [ 4.3293, 50.861907 ], [ 4.32937, 50.861965 ], [ 4.329525, 50.862091 ], [ 4.329781, 50.862294 ], [ 4.330239, 50.862651 ], [ 4.330387, 50.862766 ], [ 4.331479, 50.863686 ], [ 4.331769, 50.863928 ], [ 4.33195, 50.864078 ], [ 4.331973, 50.864098 ], [ 4.332078, 50.864187 ], [ 4.332175, 50.864268 ], [ 4.332227, 50.864311 ] ] ,
          [ [ 4.330419, 50.84208 ], [ 4.330429, 50.842074 ], [ 4.330447, 50.842059 ], [ 4.330465, 50.842039 ], [ 4.330483, 50.842015 ], [ 4.33051, 50.841974 ], [ 4.330544, 50.841914 ], [ 4.330577, 50.841851 ], [ 4.330609, 50.841792 ], [ 4.330631, 50.841754 ], [ 4.330646, 50.841733 ], [ 4.330659, 50.841715 ], [ 4.330673, 50.841702 ], [ 4.330679, 50.841698 ] ] ,
          [ [ 4.332311, 50.840591 ], [ 4.332318, 50.840587 ], [ 4.332334, 50.84058 ], [ 4.33236, 50.84057 ], [ 4.3324, 50.840558 ], [ 4.332445, 50.840547 ], [ 4.332495, 50.840536 ], [ 4.332547, 50.840526 ], [ 4.332628, 50.840513 ], [ 4.332736, 50.840497 ], [ 4.332836, 50.840483 ], [ 4.3329, 50.840472 ], [ 4.332936, 50.840465 ], [ 4.332964, 50.840458 ], [ 4.33298, 50.840453 ], [ 4.332988, 50.840449 ], [ 4.332991, 50.840447 ] ] ,
          [ [ 4.342761, 50.83381 ], [ 4.342689, 50.833846 ], [ 4.342551, 50.833918 ], [ 4.34242, 50.833988 ], [ 4.342295, 50.834056 ], [ 4.342178, 50.834123 ], [ 4.342067, 50.834189 ], [ 4.341962, 50.834253 ], [ 4.341864, 50.834315 ], [ 4.341771, 50.834377 ], [ 4.341684, 50.834436 ], [ 4.341603, 50.834495 ], [ 4.341528, 50.834552 ], [ 4.341458, 50.834608 ], [ 4.341392, 50.834663 ], [ 4.341332, 50.834716 ], [ 4.341276, 50.834768 ], [ 4.341225, 50.834819 ], [ 4.341179, 50.834869 ], [ 4.341136, 50.834918 ], [ 4.341097, 50.834966 ], [ 4.341062, 50.835013 ], [ 4.341031, 50.835059 ], [ 4.341003, 50.835104 ], [ 4.340978, 50.835148 ], [ 4.340957, 50.835191 ], [ 4.340938, 50.835233 ], [ 4.340922, 50.835274 ], [ 4.340908, 50.835315 ], [ 4.340897, 50.835355 ], [ 4.340888, 50.835394 ], [ 4.34088, 50.835432 ], [ 4.340875, 50.83547 ], [ 4.340869, 50.835525 ], [ 4.340866, 50.835597 ], [ 4.340866, 50.835667 ], [ 4.340869, 50.835735 ], [ 4.340872, 50.835801 ], [ 4.340874, 50.835866 ], [ 4.340874, 50.83593 ], [ 4.34087, 50.835993 ], [ 4.340864, 50.83604 ], [ 4.340858, 50.836071 ], [ 4.34085, 50.836102 ], [ 4.34084, 50.836133 ], [ 4.340827, 50.836164 ], [ 4.340813, 50.836195 ], [ 4.340796, 50.836226 ], [ 4.340776, 50.836257 ], [ 4.340753, 50.836289 ], [ 4.340728, 50.83632 ], [ 4.340699, 50.836352 ], [ 4.340666, 50.836384 ], [ 4.34063, 50.836416 ], [ 4.34059, 50.836448 ], [ 4.340546, 50.836481 ], [ 4.340497, 50.836514 ], [ 4.340472, 50.836531 ] ] ,
          [ [ 4.347778, 50.832986 ], [ 4.347768, 50.832986 ], [ 4.347748, 50.832983 ], [ 4.347727, 50.832979 ], [ 4.347705, 50.832973 ], [ 4.34767, 50.832961 ], [ 4.347619, 50.832942 ], [ 4.347576, 50.832928 ], [ 4.347545, 50.832918 ], [ 4.347511, 50.832909 ], [ 4.347475, 50.832901 ], [ 4.347437, 50.832895 ], [ 4.347395, 50.832889 ], [ 4.347351, 50.832886 ], [ 4.347303, 50.832885 ], [ 4.347278, 50.832886 ], [ 4.345847, 50.832927 ], [ 4.345824, 50.832928 ], [ 4.345779, 50.832932 ], [ 4.345736, 50.832937 ], [ 4.345696, 50.832944 ], [ 4.345658, 50.832952 ], [ 4.345621, 50.832962 ], [ 4.345571, 50.832977 ], [ 4.34548, 50.833008 ], [ 4.345415, 50.833029 ], [ 4.345392, 50.833035 ], [ 4.345369, 50.83304 ], [ 4.345347, 50.833043 ], [ 4.345337, 50.833044 ] ] ,
          [ [ 4.324419, 50.853487 ], [ 4.324435, 50.853529 ], [ 4.324465, 50.853608 ], [ 4.324508, 50.853715 ], [ 4.324551, 50.85382 ], [ 4.32458, 50.853894 ], [ 4.324609, 50.853975 ], [ 4.324639, 50.854067 ], [ 4.324654, 50.854118 ], [ 4.32466, 50.854139 ], [ 4.324667, 50.85418 ], [ 4.324671, 50.85422 ], [ 4.324672, 50.854259 ], [ 4.32467, 50.854298 ], [ 4.324665, 50.854335 ], [ 4.324656, 50.85439 ], [ 4.324641, 50.85446 ], [ 4.324631, 50.854511 ], [ 4.324626, 50.854543 ], [ 4.324623, 50.854576 ], [ 4.324622, 50.854607 ], [ 4.324625, 50.854638 ], [ 4.324631, 50.854669 ], [ 4.324636, 50.854684 ] ] ,
          [ [ 4.368504, 50.845004 ], [ 4.368499, 50.844995 ], [ 4.368483, 50.844976 ], [ 4.368462, 50.844955 ], [ 4.368435, 50.844933 ], [ 4.368388, 50.844897 ], [ 4.368315, 50.844845 ], [ 4.368239, 50.844791 ], [ 4.368183, 50.844751 ], [ 4.368149, 50.844725 ], [ 4.368117, 50.8447 ], [ 4.36809, 50.844675 ], [ 4.368068, 50.844652 ], [ 4.368051, 50.84463 ], [ 4.368045, 50.84462 ] ] ,
          [ [ 4.354281, 50.856491 ], [ 4.35427, 50.856495 ], [ 4.354248, 50.856506 ], [ 4.354225, 50.85652 ], [ 4.354203, 50.856537 ], [ 4.354169, 50.856567 ], [ 4.354122, 50.856612 ], [ 4.354074, 50.85666 ], [ 4.354036, 50.856696 ], [ 4.35401, 50.856718 ], [ 4.353983, 50.856739 ], [ 4.353955, 50.856757 ], [ 4.353927, 50.856773 ], [ 4.353897, 50.856786 ], [ 4.353882, 50.85679 ] ] ,
          [ [ 4.321879, 50.849633 ], [ 4.321888, 50.849656 ], [ 4.321906, 50.849706 ], [ 4.321924, 50.849762 ], [ 4.321942, 50.849824 ], [ 4.321969, 50.849926 ], [ 4.322003, 50.850078 ], [ 4.322037, 50.850245 ], [ 4.32207, 50.850422 ], [ 4.322119, 50.850701 ], [ 4.322183, 50.851077 ], [ 4.32223, 50.851348 ], [ 4.322261, 50.851516 ], [ 4.322291, 50.85167 ], [ 4.322322, 50.851807 ], [ 4.322345, 50.851895 ], [ 4.322361, 50.851947 ], [ 4.322376, 50.851993 ], [ 4.322391, 50.852031 ], [ 4.322399, 50.852048 ] ] ,
          [ [ 4.359553, 50.855208 ], [ 4.359568, 50.855204 ], [ 4.3596, 50.855193 ], [ 4.359633, 50.855179 ], [ 4.359668, 50.855163 ], [ 4.359722, 50.855135 ], [ 4.359804, 50.855094 ], [ 4.359873, 50.855061 ], [ 4.359923, 50.855039 ], [ 4.359978, 50.855017 ], [ 4.360037, 50.854995 ], [ 4.3601, 50.854974 ], [ 4.360169, 50.854955 ], [ 4.360243, 50.854937 ], [ 4.360324, 50.854921 ], [ 4.360366, 50.854914 ], [ 4.360396, 50.854909 ], [ 4.360462, 50.8549 ], [ 4.360572, 50.854886 ], [ 4.360736, 50.854869 ], [ 4.360911, 50.854854 ], [ 4.361092, 50.854841 ], [ 4.361271, 50.85483 ], [ 4.361441, 50.854822 ], [ 4.361595, 50.854817 ], [ 4.361663, 50.854816 ] ] ,
          [ [ 4.324002, 50.845507 ], [ 4.324, 50.84551 ], [ 4.323991, 50.84552 ], [ 4.323974, 50.845546 ], [ 4.323923, 50.845627 ], [ 4.32386, 50.845728 ], [ 4.323815, 50.845795 ], [ 4.323782, 50.845841 ], [ 4.323761, 50.845868 ], [ 4.323741, 50.845891 ], [ 4.323722, 50.845909 ], [ 4.323713, 50.845917 ], [ 4.323663, 50.845954 ], [ 4.323519, 50.846057 ], [ 4.323232, 50.846258 ], [ 4.322818, 50.846546 ], [ 4.322568, 50.846719 ], [ 4.322467, 50.84679 ], [ 4.322443, 50.846807 ] ] ,
          [ [ 4.324205, 50.845739 ], [ 4.324134, 50.84579 ], [ 4.32393, 50.845932 ], [ 4.323515, 50.846219 ], [ 4.322881, 50.846655 ], [ 4.322328, 50.847036 ], [ 4.322141, 50.847165 ], [ 4.322124, 50.847178 ], [ 4.32209, 50.847205 ], [ 4.322057, 50.847235 ], [ 4.322026, 50.847267 ], [ 4.321996, 50.847302 ], [ 4.321967, 50.847339 ], [ 4.32194, 50.847378 ], [ 4.321913, 50.847419 ], [ 4.321889, 50.847461 ], [ 4.321865, 50.847505 ], [ 4.321843, 50.84755 ], [ 4.321822, 50.847597 ], [ 4.321803, 50.847644 ], [ 4.321785, 50.847692 ], [ 4.321769, 50.847741 ], [ 4.321754, 50.84779 ], [ 4.32174, 50.847839 ], [ 4.321729, 50.847889 ], [ 4.321718, 50.847938 ], [ 4.32171, 50.847987 ], [ 4.321703, 50.848036 ], [ 4.321697, 50.848084 ], [ 4.321694, 50.848131 ], [ 4.321692, 50.848177 ], [ 4.321691, 50.848222 ], [ 4.321693, 50.848266 ], [ 4.321696, 50.848308 ], [ 4.321701, 50.848349 ], [ 4.321708, 50.848387 ], [ 4.321716, 50.848424 ], [ 4.321727, 50.848458 ], [ 4.321739, 50.84849 ], [ 4.321746, 50.848505 ] ] ,
          [ [ 4.326057, 50.857815 ], [ 4.326062, 50.857826 ], [ 4.326068, 50.857848 ], [ 4.32607, 50.857871 ], [ 4.326068, 50.857895 ], [ 4.326063, 50.857919 ], [ 4.326056, 50.857943 ], [ 4.326042, 50.85798 ], [ 4.326021, 50.858028 ], [ 4.326007, 50.858064 ], [ 4.325999, 50.858087 ], [ 4.325994, 50.85811 ], [ 4.325992, 50.858132 ], [ 4.325994, 50.858153 ], [ 4.326, 50.858173 ], [ 4.326004, 50.858183 ] ] ,
          [ [ 4.324153, 50.84578 ], [ 4.324144, 50.845786 ], [ 4.324121, 50.845798 ], [ 4.324094, 50.845809 ], [ 4.324063, 50.845821 ], [ 4.324011, 50.845839 ], [ 4.323935, 50.845862 ], [ 4.323855, 50.845886 ], [ 4.323778, 50.845911 ], [ 4.323725, 50.84593 ], [ 4.323693, 50.845944 ], [ 4.323665, 50.845958 ], [ 4.323641, 50.845972 ], [ 4.323631, 50.845979 ] ] ,
          [ [ 4.345834, 50.832927 ], [ 4.345821, 50.832927 ], [ 4.345795, 50.832926 ], [ 4.345768, 50.832922 ], [ 4.345741, 50.832917 ], [ 4.345699, 50.832907 ], [ 4.345642, 50.83289 ], [ 4.345582, 50.832872 ], [ 4.345538, 50.832859 ], [ 4.345507, 50.832852 ], [ 4.345477, 50.832846 ], [ 4.345447, 50.832841 ], [ 4.345417, 50.832838 ], [ 4.345387, 50.832838 ], [ 4.345372, 50.832838 ] ] ,
          [ [ 4.347784, 50.832784 ], [ 4.347771, 50.832784 ], [ 4.347744, 50.832786 ], [ 4.347715, 50.832789 ], [ 4.347684, 50.832794 ], [ 4.347636, 50.832804 ], [ 4.347569, 50.832821 ], [ 4.3475, 50.832839 ], [ 4.347432, 50.832857 ], [ 4.347366, 50.832873 ], [ 4.34732, 50.832881 ], [ 4.347291, 50.832885 ], [ 4.347277, 50.832886 ] ]
        ]
      }
    }
        ]
}
