{
"type": "FeatureCollection",
"creator": "svg2geojson v0.7.0",
"name": "line1-simple-filled",
  "features": [
    {
      "type": "Feature",
      "geometry": {
        "type": "LineString",
        "coordinates":
          [ [ 4.399263, 50.839219 ], [ 4.406262, 50.83775 ], [ 4.406292, 50.837744 ], [ 4.406353, 50.837732 ], [ 4.406417, 50.837722 ], [ 4.406482, 50.837714 ], [ 4.406549, 50.837707 ], [ 4.406615, 50.837703 ], [ 4.40668, 50.837701 ], [ 4.406743, 50.837702 ], [ 4.406773, 50.837704 ], [ 4.407962, 50.837799 ], [ 4.407997, 50.837802 ], [ 4.408064, 50.837809 ], [ 4.408128, 50.837818 ], [ 4.408189, 50.837829 ], [ 4.408247, 50.837841 ], [ 4.408304, 50.837855 ], [ 4.408358, 50.83787 ], [ 4.408412, 50.837886 ], [ 4.408464, 50.837903 ], [ 4.408516, 50.837922 ], [ 4.408594, 50.837952 ], [ 4.408754, 50.838018 ], [ 4.408868, 50.838066 ], [ 4.412286, 50.839481 ], [ 4.412323, 50.839496 ], [ 4.412398, 50.839531 ], [ 4.412475, 50.839569 ], [ 4.412553, 50.83961 ], [ 4.412632, 50.839654 ], [ 4.41271, 50.839699 ], [ 4.412786, 50.839745 ], [ 4.412861, 50.839792 ], [ 4.412969, 50.839861 ], [ 4.413099, 50.839949 ], [ 4.413211, 50.840028 ], [ 4.413298, 50.840092 ], [ 4.41333, 50.840117 ], [ 4.414939, 50.841376 ], [ 4.414972, 50.841401 ], [ 4.41504, 50.841452 ], [ 4.415109, 50.841502 ], [ 4.415179, 50.841551 ], [ 4.415251, 50.8416 ], [ 4.415325, 50.841648 ], [ 4.4154, 50.841695 ], [ 4.415476, 50.841741 ], [ 4.415554, 50.841786 ], [ 4.415634, 50.841831 ], [ 4.415714, 50.841874 ], [ 4.415796, 50.841917 ], [ 4.41588, 50.841958 ], [ 4.415964, 50.841998 ], [ 4.41605, 50.842038 ], [ 4.416137, 50.842076 ], [ 4.416225, 50.842113 ], [ 4.416314, 50.842148 ], [ 4.416404, 50.842182 ], [ 4.416495, 50.842216 ], [ 4.416587, 50.842247 ], [ 4.41668, 50.842277 ], [ 4.416774, 50.842306 ], [ 4.416869, 50.842334 ], [ 4.416965, 50.84236 ], [ 4.417062, 50.842384 ], [ 4.41716, 50.842407 ], [ 4.417258, 50.842428 ], [ 4.417357, 50.842447 ], [ 4.417456, 50.842465 ], [ 4.417557, 50.842481 ], [ 4.417658, 50.842495 ], [ 4.417708, 50.842502 ], [ 4.420149, 50.842799 ], [ 4.420191, 50.842804 ], [ 4.420276, 50.842813 ], [ 4.420403, 50.842825 ], [ 4.420574, 50.842839 ], [ 4.420745, 50.842849 ], [ 4.420917, 50.842858 ], [ 4.421089, 50.842865 ], [ 4.421347, 50.842874 ], [ 4.421519, 50.84288 ], [ 4.423316, 50.842941 ], [ 4.423346, 50.842943 ], [ 4.423406, 50.842946 ], [ 4.423466, 50.842951 ], [ 4.423525, 50.842958 ], [ 4.423584, 50.842967 ], [ 4.423643, 50.842976 ], [ 4.423702, 50.842988 ], [ 4.42376, 50.843 ], [ 4.423817, 50.843014 ], [ 4.423874, 50.84303 ], [ 4.42393, 50.843046 ], [ 4.423986, 50.843064 ], [ 4.424041, 50.843083 ], [ 4.424095, 50.843103 ], [ 4.424149, 50.843124 ], [ 4.424201, 50.843146 ], [ 4.424253, 50.843169 ], [ 4.424304, 50.843193 ], [ 4.424354, 50.843218 ], [ 4.424403, 50.843244 ], [ 4.42445, 50.843271 ], [ 4.424497, 50.843298 ], [ 4.424543, 50.843326 ], [ 4.424587, 50.843355 ], [ 4.42463, 50.843384 ], [ 4.424671, 50.843414 ], [ 4.424712, 50.843445 ], [ 4.424751, 50.843476 ], [ 4.424788, 50.843507 ], [ 4.424824, 50.843539 ], [ 4.424858, 50.843572 ], [ 4.424891, 50.843604 ], [ 4.424907, 50.843621 ], [ 4.427124, 50.845968 ], [ 4.42714, 50.845984 ], [ 4.427174, 50.846016 ], [ 4.42721, 50.846047 ], [ 4.427249, 50.846078 ], [ 4.42729, 50.846108 ], [ 4.427334, 50.846137 ], [ 4.42738, 50.846165 ], [ 4.427428, 50.846193 ], [ 4.427478, 50.84622 ], [ 4.427529, 50.846246 ], [ 4.427583, 50.846272 ], [ 4.427638, 50.846297 ], [ 4.427694, 50.846321 ], [ 4.427751, 50.846344 ], [ 4.42781, 50.846366 ], [ 4.42787, 50.846388 ], [ 4.427931, 50.846409 ], [ 4.427993, 50.846429 ], [ 4.428086, 50.846458 ], [ 4.428213, 50.846494 ], [ 4.42834, 50.846526 ], [ 4.428468, 50.846555 ], [ 4.428595, 50.846581 ], [ 4.428719, 50.846604 ], [ 4.428841, 50.846623 ], [ 4.428901, 50.846632 ], [ 4.438109, 50.847888 ], [ 4.438157, 50.847895 ], [ 4.438254, 50.847904 ], [ 4.438352, 50.847911 ], [ 4.438451, 50.847916 ], [ 4.43855, 50.847917 ], [ 4.438649, 50.847915 ], [ 4.438749, 50.847911 ], [ 4.438848, 50.847904 ], [ 4.438946, 50.847894 ], [ 4.439044, 50.847882 ], [ 4.43914, 50.847867 ], [ 4.439236, 50.84785 ], [ 4.43933, 50.84783 ], [ 4.439423, 50.847808 ], [ 4.439514, 50.847783 ], [ 4.439602, 50.847756 ], [ 4.439646, 50.847742 ], [ 4.44137, 50.847158 ], [ 4.441402, 50.847148 ], [ 4.441467, 50.847127 ], [ 4.441532, 50.847108 ], [ 4.441597, 50.847089 ], [ 4.441663, 50.847071 ], [ 4.44173, 50.847054 ], [ 4.441797, 50.847038 ], [ 4.441865, 50.847023 ], [ 4.441933, 50.847009 ], [ 4.442002, 50.846996 ], [ 4.44207, 50.846984 ], [ 4.44214, 50.846973 ], [ 4.442209, 50.846963 ], [ 4.442279, 50.846954 ], [ 4.442349, 50.846946 ], [ 4.44242, 50.846939 ], [ 4.44249, 50.846933 ], [ 4.442561, 50.846928 ], [ 4.442632, 50.846924 ], [ 4.442703, 50.846921 ], [ 4.442774, 50.846919 ], [ 4.442846, 50.846918 ], [ 4.442917, 50.846918 ], [ 4.442988, 50.846919 ], [ 4.44306, 50.846921 ], [ 4.443131, 50.846925 ], [ 4.443202, 50.846929 ], [ 4.443274, 50.846935 ], [ 4.443345, 50.846941 ], [ 4.443416, 50.846949 ], [ 4.443486, 50.846958 ], [ 4.443557, 50.846968 ], [ 4.443592, 50.846973 ], [ 4.447353, 50.847562 ], [ 4.447377, 50.847566 ], [ 4.447425, 50.847572 ], [ 4.447498, 50.847581 ], [ 4.4476, 50.847589 ], [ 4.447703, 50.847595 ], [ 4.44786, 50.847602 ], [ 4.448014, 50.847607 ], [ 4.448114, 50.847612 ], [ 4.448162, 50.847615 ], [ 4.448255, 50.847622 ], [ 4.448386, 50.847634 ], [ 4.448467, 50.847642 ], [ 4.448545, 50.847651 ], [ 4.448619, 50.84766 ], [ 4.448689, 50.84767 ], [ 4.448756, 50.84768 ], [ 4.448819, 50.847691 ], [ 4.44888, 50.847702 ], [ 4.448937, 50.847714 ], [ 4.448992, 50.847727 ], [ 4.449044, 50.84774 ], [ 4.449095, 50.847754 ], [ 4.449143, 50.847768 ], [ 4.449189, 50.847783 ], [ 4.449234, 50.847799 ], [ 4.449277, 50.847815 ], [ 4.449339, 50.84784 ], [ 4.449419, 50.847876 ], [ 4.449497, 50.847915 ], [ 4.449575, 50.847957 ], [ 4.449653, 50.848001 ], [ 4.449776, 50.848073 ], [ 4.449864, 50.848125 ], [ 4.453177, 50.850062 ], [ 4.453244, 50.850101 ], [ 4.453377, 50.850177 ], [ 4.453479, 50.850233 ], [ 4.453547, 50.850269 ], [ 4.453616, 50.850305 ], [ 4.453686, 50.850339 ], [ 4.453757, 50.850373 ], [ 4.45383, 50.850405 ], [ 4.453905, 50.850437 ], [ 4.453981, 50.850466 ], [ 4.454059, 50.850495 ], [ 4.454139, 50.850522 ], [ 4.454221, 50.850547 ], [ 4.454306, 50.85057 ], [ 4.454394, 50.850592 ], [ 4.454484, 50.850611 ], [ 4.454577, 50.850629 ], [ 4.454674, 50.850644 ], [ 4.454774, 50.850657 ], [ 4.454877, 50.850667 ], [ 4.454984, 50.850675 ], [ 4.455095, 50.850681 ], [ 4.45521, 50.850683 ], [ 4.455329, 50.850683 ], [ 4.455453, 50.85068 ], [ 4.455581, 50.850674 ], [ 4.455714, 50.850665 ], [ 4.455852, 50.850652 ], [ 4.455995, 50.850636 ], [ 4.456144, 50.850617 ], [ 4.45622, 50.850606 ], [ 4.456274, 50.850598 ], [ 4.456378, 50.850579 ], [ 4.456477, 50.850559 ], [ 4.456571, 50.850536 ], [ 4.456661, 50.850511 ], [ 4.456746, 50.850484 ], [ 4.456826, 50.850456 ], [ 4.456903, 50.850425 ], [ 4.456976, 50.850392 ], [ 4.457046, 50.850357 ], [ 4.457113, 50.85032 ], [ 4.457177, 50.850281 ], [ 4.457239, 50.85024 ], [ 4.457298, 50.850197 ], [ 4.457355, 50.850152 ], [ 4.457411, 50.850105 ], [ 4.457465, 50.850057 ], [ 4.457518, 50.850006 ], [ 4.457571, 50.849954 ], [ 4.457622, 50.849899 ], [ 4.457699, 50.849815 ], [ 4.457803, 50.849695 ], [ 4.457963, 50.849502 ], [ 4.458137, 50.849294 ], [ 4.458264, 50.849147 ], [ 4.458331, 50.84907 ], [ 4.459199, 50.848104 ], [ 4.459228, 50.848073 ], [ 4.459287, 50.848012 ], [ 4.459376, 50.847924 ], [ 4.459462, 50.847842 ], [ 4.459514, 50.847791 ], [ 4.459561, 50.847741 ], [ 4.459591, 50.847706 ], [ 4.459609, 50.847684 ], [ 4.459617, 50.847673 ], [ 4.460573, 50.846284 ], [ 4.460608, 50.846234 ], [ 4.460684, 50.846132 ], [ 4.460769, 50.846027 ], [ 4.460859, 50.84592 ], [ 4.460954, 50.845813 ], [ 4.461051, 50.845709 ], [ 4.461149, 50.845608 ], [ 4.461245, 50.845513 ], [ 4.461292, 50.845468 ], [ 4.46239, 50.844441 ], [ 4.46243, 50.844403 ], [ 4.462509, 50.844326 ], [ 4.462586, 50.844249 ], [ 4.462659, 50.844169 ], [ 4.462729, 50.844089 ], [ 4.462795, 50.844007 ], [ 4.462841, 50.843945 ], [ 4.46287, 50.843903 ], [ 4.462897, 50.843861 ], [ 4.462923, 50.843819 ], [ 4.462935, 50.843797 ], [ 4.463536, 50.842727 ], [ 4.463553, 50.842699 ], [ 4.46359, 50.842643 ], [ 4.463631, 50.842587 ], [ 4.463674, 50.842531 ], [ 4.463718, 50.842476 ], [ 4.463761, 50.842421 ], [ 4.463801, 50.842366 ], [ 4.463829, 50.842324 ], [ 4.463845, 50.842297 ], [ 4.463853, 50.842283 ], [ 4.464429, 50.841214 ] ]
      }
    }
  ]
}
