{
"type": "FeatureCollection",
"creator": "svg2geojson v0.7.0",
"name": "line5-simple-filled",
"features": [
    {
      "type": "Feature",
      "geometry": {
        "type": "MultiLineString",
        "coordinates": [
          [ [ 4.319993, 50.84764 ], [ 4.319979, 50.847613 ], [ 4.319952, 50.847559 ], [ 4.319915, 50.847476 ], [ 4.319869, 50.847364 ], [ 4.319826, 50.847251 ], [ 4.319784, 50.847137 ], [ 4.31974, 50.847023 ], [ 4.319706, 50.846939 ], [ 4.319681, 50.846884 ], [ 4.319655, 50.846829 ], [ 4.319627, 50.846775 ], [ 4.319613, 50.846748 ], [ 4.319172, 50.845951 ], [ 4.319123, 50.845861 ], [ 4.319031, 50.845698 ], [ 4.318908, 50.84548 ], [ 4.318794, 50.845276 ], [ 4.318719, 50.845137 ], [ 4.318642, 50.844988 ], [ 4.318562, 50.844822 ], [ 4.318519, 50.844731 ], [ 4.317619, 50.842788 ], [ 4.317608, 50.842765 ], [ 4.317584, 50.84272 ], [ 4.317556, 50.842675 ], [ 4.317526, 50.842631 ], [ 4.317493, 50.842588 ], [ 4.317457, 50.842545 ], [ 4.317419, 50.842503 ], [ 4.317378, 50.842462 ], [ 4.317335, 50.842422 ], [ 4.31729, 50.842383 ], [ 4.317243, 50.842344 ], [ 4.317195, 50.842307 ], [ 4.317144, 50.842271 ], [ 4.317092, 50.842235 ], [ 4.317039, 50.842201 ], [ 4.316985, 50.842168 ], [ 4.316957, 50.842151 ], [ 4.31323, 50.839993 ], [ 4.313068, 50.8399 ], [ 4.31274, 50.83971 ], [ 4.312579, 50.839616 ], [ 4.306626, 50.83614 ], [ 4.306594, 50.836122 ], [ 4.306535, 50.836085 ], [ 4.306479, 50.836048 ], [ 4.306426, 50.836011 ], [ 4.306377, 50.835974 ], [ 4.30633, 50.835936 ], [ 4.306287, 50.835897 ], [ 4.306247, 50.835858 ], [ 4.306209, 50.835818 ], [ 4.306174, 50.835776 ], [ 4.306142, 50.835734 ], [ 4.306112, 50.835691 ], [ 4.306084, 50.835646 ], [ 4.306059, 50.835599 ], [ 4.306035, 50.835552 ], [ 4.306014, 50.835502 ], [ 4.306004, 50.835476 ], [ 4.305627, 50.834485 ], [ 4.305623, 50.834476 ], [ 4.305615, 50.834458 ], [ 4.305605, 50.834441 ], [ 4.305594, 50.834425 ], [ 4.305582, 50.834409 ], [ 4.305568, 50.834393 ], [ 4.305545, 50.83437 ], [ 4.30551, 50.83434 ], [ 4.305471, 50.834312 ], [ 4.305428, 50.834284 ], [ 4.305381, 50.834257 ], [ 4.305306, 50.834217 ], [ 4.305196, 50.834162 ], [ 4.30508, 50.834103 ], [ 4.30499, 50.834056 ], [ 4.304929, 50.834023 ], [ 4.304899, 50.834005 ], [ 4.303319, 50.833074 ], [ 4.303293, 50.833059 ], [ 4.303243, 50.833028 ], [ 4.303194, 50.832996 ], [ 4.303147, 50.832963 ], [ 4.303101, 50.832929 ], [ 4.303056, 50.832895 ], [ 4.303012, 50.83286 ], [ 4.302969, 50.832824 ], [ 4.302928, 50.832788 ], [ 4.302888, 50.832751 ], [ 4.30283, 50.832694 ], [ 4.302756, 50.832617 ], [ 4.302686, 50.832538 ], [ 4.30262, 50.832458 ], [ 4.302558, 50.832376 ], [ 4.302499, 50.832292 ], [ 4.302444, 50.832208 ], [ 4.302391, 50.832123 ], [ 4.302341, 50.832038 ], [ 4.302294, 50.831953 ], [ 4.302249, 50.831867 ], [ 4.302228, 50.831825 ], [ 4.300844, 50.829071 ], [ 4.300835, 50.829055 ], [ 4.300811, 50.829016 ], [ 4.30078, 50.828971 ], [ 4.300742, 50.828921 ], [ 4.300676, 50.828836 ], [ 4.300576, 50.828714 ], [ 4.300419, 50.828525 ], [ 4.30028, 50.828356 ], [ 4.300226, 50.828287 ], [ 4.300199, 50.828249 ], [ 4.300188, 50.828234 ], [ 4.299205, 50.826708 ], [ 4.299155, 50.826629 ], [ 4.299063, 50.826482 ], [ 4.298944, 50.826285 ], [ 4.298813, 50.826064 ], [ 4.298726, 50.825923 ], [ 4.298671, 50.825839 ], [ 4.298615, 50.825761 ], [ 4.298573, 50.825706 ], [ 4.298543, 50.825671 ], [ 4.298513, 50.825638 ], [ 4.298481, 50.825604 ], [ 4.298448, 50.825572 ], [ 4.298413, 50.82554 ], [ 4.298376, 50.825509 ], [ 4.298337, 50.825478 ], [ 4.298296, 50.825447 ], [ 4.298252, 50.825416 ], [ 4.298205, 50.825385 ], [ 4.298156, 50.825354 ], [ 4.298103, 50.825322 ], [ 4.298046, 50.82529 ], [ 4.298016, 50.825273 ], [ 4.29704, 50.824739 ], [ 4.297012, 50.824723 ], [ 4.296956, 50.824691 ], [ 4.296903, 50.824659 ], [ 4.296851, 50.824626 ], [ 4.296801, 50.824592 ], [ 4.296753, 50.824559 ], [ 4.296707, 50.824524 ], [ 4.296662, 50.82449 ], [ 4.296619, 50.824454 ], [ 4.296577, 50.824419 ], [ 4.296537, 50.824383 ], [ 4.296498, 50.824346 ], [ 4.296442, 50.824291 ], [ 4.296371, 50.824215 ], [ 4.296304, 50.824138 ], [ 4.29624, 50.824059 ], [ 4.296179, 50.823979 ], [ 4.29612, 50.823897 ], [ 4.296034, 50.823771 ], [ 4.29592, 50.823598 ], [ 4.295863, 50.823509 ], [ 4.294972, 50.822143 ], [ 4.293668, 50.820141 ], [ 4.291765, 50.817186 ], [ 4.291746, 50.817157 ], [ 4.291694, 50.817086 ], [ 4.291644, 50.817022 ], [ 4.291605, 50.816977 ], [ 4.291562, 50.81693 ], [ 4.291516, 50.816881 ], [ 4.291466, 50.816832 ], [ 4.291412, 50.816782 ], [ 4.291355, 50.816733 ], [ 4.291294, 50.816685 ], [ 4.29123, 50.816639 ], [ 4.291163, 50.816596 ], [ 4.291111, 50.816565 ], [ 4.291075, 50.816545 ], [ 4.291039, 50.816527 ], [ 4.291002, 50.816509 ], [ 4.290983, 50.816501 ], [ 4.289548, 50.815882 ], [ 4.289515, 50.815869 ], [ 4.28945, 50.815844 ], [ 4.289384, 50.815822 ], [ 4.289318, 50.815803 ], [ 4.289251, 50.815787 ], [ 4.289184, 50.815773 ], [ 4.289118, 50.815761 ], [ 4.289052, 50.815752 ], [ 4.288987, 50.815745 ], [ 4.288923, 50.81574 ], [ 4.28886, 50.815736 ], [ 4.288798, 50.815735 ], [ 4.288738, 50.815735 ], [ 4.28868, 50.815737 ], [ 4.288624, 50.815741 ], [ 4.28857, 50.815745 ], [ 4.288544, 50.815748 ], [ 4.284458, 50.816222 ], [ 4.284341, 50.816235 ], [ 4.284056, 50.816264 ], [ 4.283745, 50.816295 ], [ 4.28346, 50.816323 ], [ 4.283343, 50.816336 ], [ 4.281856, 50.816499 ], [ 4.281807, 50.816505 ], [ 4.281711, 50.816519 ], [ 4.281619, 50.816535 ], [ 4.281529, 50.816554 ], [ 4.281443, 50.816575 ], [ 4.281358, 50.816598 ], [ 4.281276, 50.816622 ], [ 4.281196, 50.816647 ], [ 4.281078, 50.816687 ], [ 4.280925, 50.816742 ], [ 4.280774, 50.816796 ], [ 4.280662, 50.816836 ], [ 4.280586, 50.816861 ], [ 4.28051, 50.816885 ], [ 4.280433, 50.816908 ], [ 4.280355, 50.816928 ], [ 4.280275, 50.816947 ], [ 4.280194, 50.816963 ], [ 4.280111, 50.816977 ], [ 4.280025, 50.816987 ], [ 4.279959, 50.816993 ], [ 4.279914, 50.816996 ], [ 4.279869, 50.816998 ], [ 4.279822, 50.816999 ], [ 4.279775, 50.816999 ], [ 4.279727, 50.816998 ], [ 4.279679, 50.816996 ], [ 4.279629, 50.816993 ], [ 4.279578, 50.816989 ], [ 4.279527, 50.816984 ], [ 4.279474, 50.816977 ], [ 4.27942, 50.81697 ], [ 4.279366, 50.816961 ], [ 4.27931, 50.816951 ], [ 4.279253, 50.816939 ], [ 4.279195, 50.816927 ], [ 4.279136, 50.816913 ], [ 4.279075, 50.816897 ], [ 4.279044, 50.816889 ], [ 4.277254, 50.816397 ], [ 4.277168, 50.816374 ], [ 4.276994, 50.816329 ], [ 4.276817, 50.816285 ], [ 4.276637, 50.816243 ], [ 4.276454, 50.816202 ], [ 4.276268, 50.816163 ], [ 4.27608, 50.816125 ], [ 4.275889, 50.816089 ], [ 4.275697, 50.816053 ], [ 4.275502, 50.816019 ], [ 4.275306, 50.815987 ], [ 4.275108, 50.815955 ], [ 4.27491, 50.815925 ], [ 4.274709, 50.815896 ], [ 4.274508, 50.815868 ], [ 4.274307, 50.815841 ], [ 4.274104, 50.815815 ], [ 4.273902, 50.81579 ], [ 4.273598, 50.815754 ], [ 4.273193, 50.81571 ], [ 4.27279, 50.815668 ], [ 4.272391, 50.81563 ], [ 4.271997, 50.815595 ], [ 4.27161, 50.815561 ], [ 4.271231, 50.81553 ], [ 4.271045, 50.815515 ], [ 4.265099, 50.81504 ], [ 4.265039, 50.815035 ], [ 4.26492, 50.815027 ], [ 4.264804, 50.815021 ], [ 4.264691, 50.815015 ], [ 4.26458, 50.815011 ], [ 4.264471, 50.815009 ], [ 4.264366, 50.815007 ], [ 4.264263, 50.815007 ], [ 4.264163, 50.815007 ], [ 4.264067, 50.815008 ], [ 4.263928, 50.815012 ], [ 4.263754, 50.815019 ], [ 4.263594, 50.815029 ], [ 4.263449, 50.81504 ], [ 4.263319, 50.815052 ], [ 4.263206, 50.815064 ], [ 4.26311, 50.815076 ], [ 4.262999, 50.815091 ], [ 4.262917, 50.815104 ], [ 4.262907, 50.815106 ] ],
          [ [ 4.399263, 50.839219 ], [ 4.399271, 50.839218 ], [ 4.399314, 50.839208 ], [ 4.399359, 50.839196 ], [ 4.399416, 50.839178 ], [ 4.399465, 50.83916 ], [ 4.399501, 50.839146 ], [ 4.399538, 50.83913 ], [ 4.399576, 50.839112 ], [ 4.399617, 50.839092 ], [ 4.399658, 50.83907 ], [ 4.3997, 50.839046 ], [ 4.399742, 50.839019 ], [ 4.399786, 50.838989 ], [ 4.399829, 50.838957 ], [ 4.399872, 50.838923 ], [ 4.399915, 50.838885 ], [ 4.399958, 50.838845 ], [ 4.399999, 50.838802 ], [ 4.40004, 50.838755 ], [ 4.40008, 50.838705 ], [ 4.400118, 50.838652 ], [ 4.400154, 50.838596 ], [ 4.400189, 50.838536 ], [ 4.400221, 50.838473 ], [ 4.400251, 50.838405 ], [ 4.400278, 50.838334 ], [ 4.400291, 50.838297 ], [ 4.401995, 50.833133 ], [ 4.402036, 50.833011 ], [ 4.402123, 50.832753 ], [ 4.402268, 50.832335 ], [ 4.402481, 50.831735 ], [ 4.402708, 50.831105 ], [ 4.403058, 50.830147 ], [ 4.403391, 50.829235 ], [ 4.403591, 50.828687 ], [ 4.403681, 50.828439 ], [ 4.405277, 50.824019 ], [ 4.4053, 50.823954 ], [ 4.405344, 50.823823 ], [ 4.405386, 50.82369 ], [ 4.405425, 50.823555 ], [ 4.405461, 50.823418 ], [ 4.405493, 50.82328 ], [ 4.405521, 50.823141 ], [ 4.405545, 50.823002 ], [ 4.405564, 50.822862 ], [ 4.405578, 50.822722 ], [ 4.405585, 50.822618 ], [ 4.405588, 50.822548 ], [ 4.405589, 50.822479 ], [ 4.405589, 50.82241 ], [ 4.405587, 50.822341 ], [ 4.405583, 50.822273 ], [ 4.405578, 50.822205 ], [ 4.405571, 50.822137 ], [ 4.405562, 50.82207 ], [ 4.405552, 50.822003 ], [ 4.405539, 50.821937 ], [ 4.405524, 50.821871 ], [ 4.405516, 50.821838 ], [ 4.405236, 50.820732 ], [ 4.405225, 50.820689 ], [ 4.405199, 50.8206 ], [ 4.405171, 50.820509 ], [ 4.405139, 50.820418 ], [ 4.405104, 50.820326 ], [ 4.405066, 50.820232 ], [ 4.405026, 50.820139 ], [ 4.404984, 50.820045 ], [ 4.40494, 50.819952 ], [ 4.404895, 50.819859 ], [ 4.404847, 50.819767 ], [ 4.404799, 50.819675 ], [ 4.40475, 50.819585 ], [ 4.404699, 50.819497 ], [ 4.404648, 50.81941 ], [ 4.404597, 50.819326 ], [ 4.404572, 50.819284 ], [ 4.403623, 50.817766 ], [ 4.403607, 50.817741 ], [ 4.403578, 50.817691 ], [ 4.403551, 50.817641 ], [ 4.403525, 50.81759 ], [ 4.403502, 50.817539 ], [ 4.40348, 50.817488 ], [ 4.403459, 50.817436 ], [ 4.403441, 50.817384 ], [ 4.403424, 50.817332 ], [ 4.403409, 50.817279 ], [ 4.403396, 50.817227 ], [ 4.403384, 50.817174 ], [ 4.403374, 50.817122 ], [ 4.403366, 50.817069 ], [ 4.40336, 50.817017 ], [ 4.403355, 50.816964 ], [ 4.403352, 50.816912 ], [ 4.40335, 50.81686 ], [ 4.403351, 50.816808 ], [ 4.403353, 50.816756 ], [ 4.403356, 50.816705 ], [ 4.403362, 50.816654 ], [ 4.403369, 50.816603 ], [ 4.403377, 50.816553 ], [ 4.403387, 50.816503 ], [ 4.403399, 50.816453 ], [ 4.403413, 50.816404 ], [ 4.403428, 50.816356 ], [ 4.403444, 50.816308 ], [ 4.403462, 50.816261 ], [ 4.403482, 50.816214 ], [ 4.403504, 50.816168 ], [ 4.403527, 50.816123 ], [ 4.403551, 50.816079 ], [ 4.403577, 50.816035 ], [ 4.403605, 50.815992 ], [ 4.403634, 50.815951 ], [ 4.403665, 50.81591 ], [ 4.403697, 50.81587 ], [ 4.403731, 50.815831 ], [ 4.403766, 50.815793 ], [ 4.403803, 50.815757 ], [ 4.403841, 50.815721 ], [ 4.403881, 50.815687 ], [ 4.403922, 50.815653 ], [ 4.403965, 50.815621 ], [ 4.404009, 50.815591 ], [ 4.404055, 50.815561 ], [ 4.404102, 50.815534 ], [ 4.40415, 50.815507 ], [ 4.4042, 50.815482 ], [ 4.404252, 50.815458 ], [ 4.404305, 50.815436 ], [ 4.404359, 50.815416 ], [ 4.404415, 50.815397 ], [ 4.404472, 50.815379 ], [ 4.40453, 50.815364 ], [ 4.40459, 50.81535 ], [ 4.404651, 50.815338 ], [ 4.404714, 50.815327 ], [ 4.404778, 50.815319 ], [ 4.404843, 50.815312 ], [ 4.40491, 50.815307 ], [ 4.404978, 50.815304 ], [ 4.405012, 50.815304 ], [ 4.405482, 50.815299 ], [ 4.406154, 50.815292 ], [ 4.406587, 50.815285 ], [ 4.406908, 50.815279 ], [ 4.407121, 50.815273 ], [ 4.407334, 50.815266 ], [ 4.407548, 50.815258 ], [ 4.407764, 50.815248 ], [ 4.407981, 50.815237 ], [ 4.4082, 50.815223 ], [ 4.408423, 50.815208 ], [ 4.408536, 50.815199 ], [ 4.410584, 50.815041 ], [ 4.410721, 50.815031 ], [ 4.410999, 50.815013 ], [ 4.411283, 50.814998 ], [ 4.411568, 50.814985 ], [ 4.411853, 50.814974 ], [ 4.412134, 50.814964 ], [ 4.412543, 50.814952 ], [ 4.412804, 50.814945 ], [ 4.416099, 50.814858 ], [ 4.416188, 50.814856 ], [ 4.416362, 50.814848 ], [ 4.416529, 50.814839 ], [ 4.416689, 50.814827 ], [ 4.416843, 50.814812 ], [ 4.416991, 50.814796 ], [ 4.417133, 50.814777 ], [ 4.417269, 50.814757 ], [ 4.417401, 50.814734 ], [ 4.417528, 50.81471 ], [ 4.417651, 50.814684 ], [ 4.417769, 50.814656 ], [ 4.417884, 50.814627 ], [ 4.417996, 50.814596 ], [ 4.418105, 50.814564 ], [ 4.418212, 50.814531 ], [ 4.418316, 50.814497 ], [ 4.418418, 50.814461 ], [ 4.418519, 50.814424 ], [ 4.418619, 50.814387 ], [ 4.418767, 50.814329 ], [ 4.418964, 50.81425 ], [ 4.419162, 50.814168 ], [ 4.419366, 50.814085 ], [ 4.419576, 50.814001 ], [ 4.419741, 50.813938 ], [ 4.419854, 50.813897 ], [ 4.419912, 50.813876 ], [ 4.421732, 50.813228 ], [ 4.421785, 50.813209 ], [ 4.421897, 50.813171 ], [ 4.422014, 50.813133 ], [ 4.422136, 50.813095 ], [ 4.422262, 50.813058 ], [ 4.422391, 50.813021 ], [ 4.422523, 50.812985 ], [ 4.422657, 50.81295 ], [ 4.422792, 50.812916 ], [ 4.422927, 50.812884 ], [ 4.423063, 50.812853 ], [ 4.423197, 50.812824 ], [ 4.42333, 50.812798 ], [ 4.42346, 50.812774 ], [ 4.423587, 50.812752 ], [ 4.42371, 50.812734 ], [ 4.42377, 50.812726 ], [ 4.426413, 50.812381 ], [ 4.426505, 50.812369 ], [ 4.426673, 50.812349 ], [ 4.426823, 50.812334 ], [ 4.426956, 50.812322 ], [ 4.427076, 50.812314 ], [ 4.427183, 50.81231 ], [ 4.42728, 50.812308 ], [ 4.42737, 50.812308 ], [ 4.427455, 50.812311 ], [ 4.427536, 50.812315 ], [ 4.427657, 50.812323 ], [ 4.427829, 50.812335 ], [ 4.427975, 50.812343 ], [ 4.428084, 50.812347 ], [ 4.428144, 50.812349 ], [ 4.430275, 50.812404 ], [ 4.430297, 50.812404 ], [ 4.430343, 50.812404 ], [ 4.430392, 50.812403 ], [ 4.430442, 50.812401 ], [ 4.430522, 50.812395 ], [ 4.430635, 50.812385 ], [ 4.430754, 50.812371 ], [ 4.430877, 50.812353 ], [ 4.431004, 50.812333 ], [ 4.431133, 50.812311 ], [ 4.431263, 50.812287 ], [ 4.431393, 50.812261 ], [ 4.431521, 50.812234 ], [ 4.431647, 50.812207 ], [ 4.431768, 50.812179 ], [ 4.431884, 50.81215 ], [ 4.431993, 50.812122 ], [ 4.432095, 50.812095 ], [ 4.432142, 50.812082 ]]
]}}]
}
