{
"type": "FeatureCollection",
"creator": "svg2geojson v0.7.0",
"name": "line6-simple-dashed",
  "features": [
    {
      "type": "Feature",
      "geometry": {
        "type": "MultiLineString",
        "coordinates": [
          [ [ 4.338513, 50.836646 ], [ 4.338531, 50.836636 ], [ 4.338575, 50.836611 ], [ 4.338629, 50.836576 ], [ 4.338693, 50.836535 ], [ 4.338807, 50.836458 ], [ 4.338989, 50.836332 ], [ 4.33932, 50.8361 ], [ 4.33971, 50.835827 ], [ 4.339996, 50.835628 ], [ 4.340301, 50.835419 ], [ 4.340619, 50.835204 ], [ 4.340865, 50.835041 ], [ 4.341032, 50.834932 ], [ 4.3412, 50.834823 ], [ 4.341369, 50.834716 ], [ 4.341539, 50.83461 ], [ 4.341709, 50.834505 ], [ 4.341879, 50.834403 ], [ 4.342048, 50.834303 ], [ 4.342216, 50.834207 ], [ 4.342382, 50.834114 ], [ 4.342547, 50.834025 ], [ 4.342709, 50.83394 ], [ 4.342789, 50.8339 ], [ 4.344175, 50.833204 ], [ 4.344191, 50.833196 ], [ 4.344225, 50.833181 ], [ 4.34426, 50.833166 ], [ 4.344298, 50.833151 ], [ 4.344358, 50.833129 ], [ 4.344445, 50.833101 ], [ 4.344537, 50.833075 ], [ 4.344634, 50.833051 ], [ 4.344735, 50.833028 ], [ 4.34484, 50.833007 ], [ 4.344947, 50.832987 ], [ 4.345056, 50.83297 ], [ 4.345165, 50.832954 ], [ 4.345275, 50.832941 ], [ 4.345383, 50.832929 ], [ 4.345489, 50.83292 ], [ 4.345593, 50.832913 ], [ 4.345693, 50.832908 ], [ 4.345741, 50.832907 ], [ 4.347149, 50.832873 ], [ 4.347235, 50.832871 ], [ 4.347402, 50.832868 ], [ 4.347563, 50.832867 ], [ 4.34772, 50.832868 ], [ 4.347872, 50.832872 ], [ 4.34802, 50.83288 ], [ 4.348129, 50.832887 ], [ 4.348201, 50.832893 ], [ 4.348271, 50.8329 ], [ 4.348342, 50.832908 ], [ 4.348412, 50.832917 ], [ 4.348481, 50.832928 ], [ 4.34855, 50.832939 ], [ 4.348619, 50.832951 ], [ 4.348687, 50.832965 ], [ 4.348755, 50.83298 ], [ 4.348824, 50.832996 ], [ 4.348892, 50.833014 ], [ 4.34896, 50.833033 ], [ 4.349028, 50.833053 ], [ 4.349097, 50.833075 ], [ 4.349165, 50.833099 ], [ 4.349234, 50.833124 ], [ 4.349304, 50.83315 ], [ 4.349374, 50.833179 ], [ 4.349444, 50.833209 ], [ 4.349479, 50.833224 ], [ 4.3498, 50.833368 ], [ 4.350418, 50.833642 ], [ 4.351007, 50.833901 ], [ 4.35157, 50.834147 ], [ 4.352107, 50.834379 ], [ 4.352623, 50.8346 ], [ 4.353118, 50.83481 ], [ 4.353595, 50.835011 ], [ 4.354281, 50.835299 ], [ 4.355155, 50.835661 ], [ 4.355997, 50.836009 ], [ 4.356825, 50.836353 ], [ 4.357447, 50.836613 ], [ 4.357866, 50.836789 ], [ 4.358293, 50.836971 ], [ 4.358728, 50.837157 ], [ 4.359174, 50.837351 ], [ 4.359633, 50.837552 ], [ 4.360107, 50.837762 ], [ 4.360599, 50.837983 ], [ 4.361111, 50.838216 ], [ 4.361645, 50.838461 ], [ 4.362203, 50.83872 ], [ 4.362788, 50.838994 ], [ 4.363401, 50.839285 ], [ 4.364046, 50.839594 ], [ 4.364723, 50.839922 ], [ 4.365436, 50.840269 ], [ 4.365807, 50.840451 ], [ 4.36582, 50.840458 ], [ 4.365846, 50.840472 ], [ 4.365885, 50.840495 ], [ 4.365934, 50.840528 ], [ 4.365981, 50.840564 ], [ 4.366026, 50.840603 ], [ 4.366068, 50.840644 ], [ 4.366109, 50.840686 ], [ 4.366148, 50.840731 ], [ 4.366184, 50.840776 ], [ 4.366219, 50.840822 ], [ 4.366251, 50.840868 ], [ 4.366282, 50.840914 ], [ 4.366324, 50.840983 ], [ 4.366373, 50.841071 ], [ 4.366395, 50.841113 ], [ 4.369469, 50.847152 ], [ 4.369476, 50.847167 ], [ 4.36949, 50.847198 ], [ 4.369502, 50.847229 ], [ 4.369513, 50.847261 ], [ 4.369522, 50.847293 ], [ 4.36953, 50.847325 ], [ 4.369539, 50.847373 ], [ 4.369547, 50.847439 ], [ 4.36955, 50.847506 ], [ 4.369549, 50.847573 ], [ 4.369544, 50.847641 ], [ 4.369536, 50.847709 ], [ 4.369525, 50.847777 ], [ 4.369511, 50.847845 ], [ 4.369496, 50.847913 ], [ 4.369471, 50.848013 ], [ 4.369435, 50.848143 ], [ 4.369417, 50.848207 ], [ 4.368146, 50.852683 ], [ 4.368141, 50.852699 ], [ 4.368129, 50.852733 ], [ 4.368113, 50.852769 ], [ 4.368095, 50.852805 ], [ 4.368074, 50.852843 ], [ 4.368049, 50.852881 ], [ 4.368023, 50.852921 ], [ 4.367993, 50.85296 ], [ 4.367961, 50.853001 ], [ 4.367927, 50.853042 ], [ 4.36789, 50.853083 ], [ 4.36785, 50.853124 ], [ 4.367809, 50.853166 ], [ 4.367765, 50.853207 ], [ 4.36772, 50.853249 ], [ 4.367672, 50.85329 ], [ 4.367622, 50.85333 ], [ 4.367571, 50.853371 ], [ 4.367518, 50.85341 ], [ 4.367463, 50.853449 ], [ 4.367407, 50.853487 ], [ 4.367349, 50.853525 ], [ 4.367289, 50.853561 ], [ 4.367229, 50.853596 ], [ 4.367167, 50.85363 ], [ 4.367104, 50.853662 ], [ 4.36704, 50.853693 ], [ 4.366974, 50.853722 ], [ 4.366908, 50.853749 ], [ 4.366841, 50.853775 ], [ 4.366774, 50.853799 ], [ 4.366705, 50.85382 ], [ 4.366671, 50.85383 ], [ 4.363893, 50.854612 ], [ 4.363829, 50.854629 ], [ 4.363704, 50.85466 ], [ 4.363582, 50.854687 ], [ 4.363464, 50.85471 ], [ 4.363347, 50.854729 ], [ 4.363233, 50.854744 ], [ 4.363119, 50.854757 ], [ 4.363007, 50.854767 ], [ 4.362896, 50.854775 ], [ 4.362784, 50.85478 ], [ 4.362672, 50.854785 ], [ 4.362559, 50.854788 ], [ 4.362386, 50.854791 ], [ 4.362149, 50.854794 ], [ 4.361963, 50.854798 ], [ 4.361834, 50.854802 ], [ 4.361702, 50.854807 ], [ 4.361564, 50.854813 ], [ 4.361422, 50.854822 ], [ 4.361274, 50.854833 ], [ 4.36112, 50.854848 ], [ 4.360959, 50.854865 ], [ 4.360792, 50.854886 ], [ 4.360616, 50.854911 ], [ 4.360433, 50.85494 ], [ 4.360242, 50.854974 ], [ 4.360042, 50.855013 ], [ 4.359832, 50.855057 ], [ 4.359612, 50.855107 ], [ 4.359383, 50.855163 ], [ 4.359264, 50.855193 ], [ 4.359217, 50.855206 ], [ 4.359062, 50.855249 ], [ 4.358786, 50.855328 ], [ 4.358658, 50.855364 ], [ 4.357207, 50.855787 ], [ 4.357181, 50.855794 ], [ 4.35712, 50.855807 ], [ 4.357012, 50.855828 ], [ 4.356859, 50.855855 ], [ 4.356751, 50.855875 ], [ 4.356691, 50.855889 ], [ 4.356665, 50.855896 ], [ 4.347142, 50.858629 ], [ 4.346942, 50.858686 ], [ 4.346548, 50.858797 ], [ 4.346157, 50.858907 ], [ 4.345764, 50.859018 ], [ 4.345565, 50.859075 ], [ 4.332925, 50.862725 ], [ 4.331212, 50.863217 ] ], [ [ 4.338553, 50.836665 ], [ 4.33726, 50.837371 ], [ 4.337213, 50.837398 ], [ 4.337113, 50.837457 ], [ 4.337007, 50.837523 ], [ 4.336897, 50.837595 ], [ 4.336783, 50.837672 ], [ 4.336665, 50.837754 ], [ 4.336484, 50.837883 ], [ 4.336112, 50.838153 ], [ 4.335746, 50.838421 ], [ 4.33557, 50.838546 ], [ 4.335458, 50.838625 ], [ 4.335403, 50.838663 ], [ 4.33263, 50.840549 ], [ 4.330606, 50.84185 ], [ 4.327568, 50.843557 ], [ 4.327499, 50.843595 ], [ 4.327356, 50.843672 ], [ 4.327207, 50.84375 ], [ 4.327053, 50.843829 ], [ 4.326816, 50.843948 ], [ 4.326492, 50.844109 ], [ 4.326249, 50.844232 ], [ 4.326088, 50.844314 ], [ 4.32593, 50.844397 ], [ 4.325776, 50.844481 ], [ 4.325626, 50.844565 ], [ 4.325483, 50.84465 ], [ 4.325379, 50.844714 ], [ 4.325313, 50.844757 ], [ 4.325248, 50.8448 ], [ 4.325185, 50.844844 ], [ 4.325155, 50.844865 ], [ 4.323939, 50.845742 ], [ 4.3238, 50.845842 ], [ 4.323436, 50.846108 ], [ 4.323123, 50.846334 ], [ 4.322913, 50.846484 ], [ 4.322714, 50.846624 ], [ 4.322577, 50.846718 ], [ 4.322493, 50.846773 ], [ 4.322454, 50.846799 ], [ 4.322432, 50.846813 ], [ 4.322388, 50.846843 ], [ 4.322344, 50.846876 ], [ 4.322299, 50.846911 ], [ 4.322255, 50.846948 ], [ 4.32221, 50.846987 ], [ 4.322165, 50.847028 ], [ 4.322121, 50.847071 ], [ 4.322078, 50.847116 ], [ 4.322036, 50.847163 ], [ 4.321994, 50.847211 ], [ 4.321954, 50.847262 ], [ 4.321915, 50.847314 ], [ 4.321878, 50.847367 ], [ 4.321843, 50.847423 ], [ 4.32181, 50.84748 ], [ 4.321779, 50.847538 ], [ 4.321751, 50.847598 ], [ 4.321725, 50.847659 ], [ 4.321702, 50.847722 ], [ 4.321682, 50.847785 ], [ 4.321665, 50.84785 ], [ 4.321652, 50.847916 ], [ 4.321642, 50.847984 ], [ 4.321636, 50.848052 ], [ 4.321635, 50.848121 ], [ 4.321637, 50.848191 ], [ 4.321643, 50.848262 ], [ 4.321655, 50.848334 ], [ 4.321671, 50.848407 ], [ 4.321692, 50.84848 ], [ 4.321718, 50.848554 ], [ 4.321733, 50.848592 ] ], [ [ 4.321866, 50.849719 ], [ 4.321353, 50.848646 ] ], [ [ 4.321862, 50.84972 ], [ 4.321967, 50.849937 ], [ 4.322175, 50.850373 ], [ 4.322381, 50.850815 ], [ 4.322588, 50.851264 ], [ 4.322901, 50.851951 ], [ 4.323225, 50.852658 ], [ 4.323449, 50.853141 ], [ 4.323564, 50.853386 ], [ 4.323605, 50.853473 ], [ 4.323692, 50.853652 ], [ 4.323784, 50.853839 ], [ 4.323882, 50.854032 ], [ 4.324036, 50.854331 ], [ 4.324252, 50.854741 ], [ 4.324474, 50.855154 ], [ 4.324696, 50.85556 ], [ 4.325013, 50.856133 ], [ 4.325205, 50.856476 ], [ 4.325423, 50.856865 ], [ 4.325739, 50.857432 ], [ 4.325944, 50.857799 ], [ 4.326148, 50.858156 ], [ 4.3263, 50.858419 ], [ 4.326402, 50.858591 ], [ 4.326504, 50.858761 ], [ 4.326607, 50.858929 ], [ 4.32671, 50.859094 ], [ 4.326814, 50.859258 ], [ 4.32692, 50.859419 ], [ 4.327026, 50.859578 ], [ 4.327135, 50.859735 ], [ 4.327244, 50.85989 ], [ 4.327356, 50.860043 ], [ 4.32747, 50.860194 ], [ 4.327586, 50.860342 ], [ 4.327705, 50.860489 ], [ 4.327826, 50.860633 ], [ 4.32795, 50.860776 ], [ 4.328077, 50.860916 ], [ 4.328207, 50.861054 ], [ 4.328341, 50.861191 ], [ 4.328479, 50.861325 ], [ 4.32862, 50.861457 ], [ 4.328765, 50.861587 ], [ 4.328839, 50.861651 ], [ 4.329356, 50.862085 ], [ 4.329426, 50.862141 ], [ 4.32973, 50.862381 ], [ 4.330118, 50.862686 ], [ 4.330422, 50.862926 ], [ 4.330491, 50.862982 ], [ 4.331413, 50.863756 ] ]
        ]
}}]}
