0.0,0.0,1.0,2.0,3.0,4.0,5.0,6.0,7.0,8.0,9.0,10.0,11.0,12.0,13.0,14.0,15.0,16.0,17.0,18.0,19.0,20.0,21.0,22.0,23.0
0.0,4910537.960149971,4913671.384649972,4916439.102649973,4918825.109649977,4921043.93014998,4923201.660899979,4925975.640149977,4930439.469649974,4936438.768399976,4942798.888149978,4949456.375899975,4956239.591399973,4963230.768649968,4970430.5458999695,4977491.043899975,4984271.937399975,4991266.045399978,4998267.386899977,5004946.499899977,5011464.230149979,5017316.98714998,5023321.982399975,5028709.311399973,5033554.588649977
1.0,4910537.960149971,4913671.384649972,4916439.102649973,4918825.109649977,4921043.93014998,4923201.660899979,4925975.640149977,4930439.469649974,4936438.768399976,4942798.888149978,4949456.375899975,4956239.591399973,4963230.768649968,4970430.5458999695,4977491.043899975,4984271.937399975,4991266.045399978,4998267.386899977,5004946.499899977,5011464.230149979,5017316.98714998,5023321.982399975,5028709.311399973,5033554.588649977
2.0,14731613.880449913,14741014.153949916,14749317.30794992,14756475.32894993,14763131.79044994,14769604.982699938,14777926.920449931,14791318.408949923,14809316.305199929,14828396.664449934,14848369.127699926,14868718.77419992,14889692.305949904,14911291.63769991,14932473.131699923,14952815.812199924,14973798.136199933,14994802.16069993,15014839.499699932,15034392.690449936,15051950.96144994,15069965.947199926,15086127.934199918,15100663.765949931
3.0,14731613.880449913,14741014.153949916,14749317.30794992,14756475.32894993,14763131.79044994,14769604.982699938,14777926.920449931,14791318.408949923,14809316.305199929,14828396.664449934,14848369.127699926,14868718.77419992,14889692.305949904,14911291.63769991,14932473.131699923,14952815.812199924,14973798.136199933,14994802.16069993,15014839.499699932,15034392.690449936,15051950.96144994,15069965.947199926,15086127.934199918,15100663.765949931
4.0,2503986.47470002,2505720.241275019,2507325.102625018,2508722.9308000184,2510051.064800018,2511464.205900017,2513375.5624000174,2516001.5989000183,2518724.8931500176,2521535.731900019,2524312.3744000196,2527275.5464000204,2530236.852900019,2533198.8801500183,2536435.678650018,2539611.0489000184,2542767.3509000195,2546053.910150019,2549270.3669000207,2552359.4071500194,2555413.5614000196,2558393.7821500204,2561024.3831500206,2563379.5382500207
5.0,2503986.47470002,2505720.241275019,2507325.102625018,2508722.9308000184,2510051.064800018,2511464.205900017,2513375.5624000174,2516001.5989000183,2518724.8931500176,2521535.731900019,2524312.3744000196,2527275.5464000204,2530236.852900019,2533198.8801500183,2536435.678650018,2539611.0489000184,2542767.3509000195,2546053.910150019,2549270.3669000207,2552359.4071500194,2555413.5614000196,2558393.7821500204,2561024.3831500206,2563379.5382500207
6.0,7511959.42410006,7517160.723825057,7521975.307875054,7526168.792400055,7530153.1944000535,7534392.6177000515,7540126.687200053,7548004.796700055,7556174.679450053,7564607.195700057,7572937.123200059,7581826.639200062,7590710.558700057,7599596.640450055,7609307.0359500535,7618833.146700055,7628302.052700059,7638161.7304500565,7647811.100700062,7657078.221450059,7666240.684200059,7675181.346450061,7683073.149450062,7690138.614750062
7.0,7511959.42410006,7517160.723825057,7521975.307875054,7526168.792400055,7530153.1944000535,7534392.6177000515,7540126.687200053,7548004.796700055,7556174.679450053,7564607.195700057,7572937.123200059,7581826.639200062,7590710.558700057,7599596.640450055,7609307.0359500535,7618833.146700055,7628302.052700059,7638161.7304500565,7647811.100700062,7657078.221450059,7666240.684200059,7675181.346450061,7683073.149450062,7690138.614750062
8.0,18990082.02875004,19000267.01525004,19008993.467250023,19016691.94275002,19023673.94875002,19030410.07400002,19038124.19275004,19050786.49850004,19070877.527250033,19095199.91850003,19121441.20625004,19149041.087250046,19178085.722000062,19208903.047000065,19239560.045500055,19267959.47775006,19295536.672750067,19323183.255750082,19348227.70125009,19371246.40275008,19390756.27725007,19408591.353250094,19425404.952500086,19440537.773000088
9.0,18990082.02875004,19000267.01525004,19008993.467250023,19016691.94275002,19023673.94875002,19030410.07400002,19038124.19275004,19050786.49850004,19070877.527250033,19095199.91850003,19121441.20625004,19149041.087250046,19178085.722000062,19208903.047000065,19239560.045500055,19267959.47775006,19295536.672750067,19323183.255750082,19348227.70125009,19371246.40275008,19390756.27725007,19408591.353250094,19425404.952500086,19440537.773000088
10.0,56970246.08625012,57000801.04575011,57026980.40175007,57050075.828250065,57071021.84625006,57091230.22200006,57114372.578250125,57152359.495500125,57212632.581750095,57285599.755500086,57364323.618750125,57447123.26175014,57534257.16600019,57626709.1410002,57718680.136500165,57803878.433250174,57886610.0182502,57969549.76725025,58044683.10375027,58113739.20825024,58172268.831750214,58225774.05975028,58276214.857500255,58321613.31900026
11.0,56970246.08625012,57000801.04575011,57026980.40175007,57050075.828250065,57071021.84625006,57091230.22200006,57114372.578250125,57152359.495500125,57212632.581750095,57285599.755500086,57364323.618750125,57447123.26175014,57534257.16600019,57626709.1410002,57718680.136500165,57803878.433250174,57886610.0182502,57969549.76725025,58044683.10375027,58113739.20825024,58172268.831750214,58225774.05975028,58276214.857500255,58321613.31900026
12.0,4557182.083600018,4560170.6549750175,4562840.560625017,4565368.475725017,4567689.844375016,4570019.008550014,4573311.565800013,4578242.032350011,4583662.230600012,4588866.038350012,4594295.133350013,4599643.9351000115,4605301.431100011,4611237.155100012,4616960.585100012,4622771.936100013,4628572.995600012,4634677.477850013,4640977.833850014,4646816.222350013,4652199.047850015,4657594.150100015,4662456.451600014,4667033.2886000145
13.0,4557182.083600018,4560170.6549750175,4562840.560625017,4565368.475725017,4567689.844375016,4570019.008550014,4573311.565800013,4578242.032350011,4583662.230600012,4588866.038350012,4594295.133350013,4599643.9351000115,4605301.431100011,4611237.155100012,4616960.585100012,4622771.936100013,4628572.995600012,4634677.477850013,4640977.833850014,4646816.222350013,4652199.047850015,4657594.150100015,4662456.451600014,4667033.2886000145
14.0,13671546.250800055,13680511.964925053,13688521.68187505,13696105.427175049,13703069.533125049,13710057.025650043,13719934.697400039,13734726.097050034,13750986.691800036,13766598.115050036,13782885.400050038,13798931.805300035,13815904.293300033,13833711.465300037,13850881.755300036,13868315.808300037,13885718.986800037,13904032.433550041,13922933.501550041,13940448.667050041,13956597.143550044,13972782.450300045,13987369.354800042,14001099.865800044
15.0,13671546.250800055,13680511.964925053,13688521.68187505,13696105.427175049,13703069.533125049,13710057.025650043,13719934.697400039,13734726.097050034,13750986.691800036,13766598.115050036,13782885.400050038,13798931.805300035,13815904.293300033,13833711.465300037,13850881.755300036,13868315.808300037,13885718.986800037,13904032.433550041,13922933.501550041,13940448.667050041,13956597.143550044,13972782.450300045,13987369.354800042,14001099.865800044
16.0,2604109.597349994,2605518.9050999954,2606693.1533499965,2607870.098349997,2609121.517349999,2610674.2398499986,2612829.6833499987,2615423.585850001,2618701.922850001,2622603.9631000026,2626125.801600002,2629923.5533500034,2633636.5373500045,2637438.8831000025,2641074.923100003,2644620.423100004,2648506.966850004,2652475.844850005,2656270.5726000033,2659880.9548500027,2663233.868350003,2666174.061100002,2669069.7573500015,2671403.252600001
17.0,2604109.597349994,2605518.9050999954,2606693.1533499965,2607870.098349997,2609121.517349999,2610674.2398499986,2612829.6833499987,2615423.585850001,2618701.922850001,2622603.9631000026,2626125.801600002,2629923.5533500034,2633636.5373500045,2637438.8831000025,2641074.923100003,2644620.423100004,2648506.966850004,2652475.844850005,2656270.5726000033,2659880.9548500027,2663233.868350003,2666174.061100002,2669069.7573500015,2671403.252600001
18.0,7812328.792049982,7816556.715299986,7820079.46004999,7823610.2950499905,7827364.552049996,7832022.719549996,7838489.050049996,7846270.757550003,7856105.768550003,7867811.889300007,7878377.404800007,7889770.66005001,7900909.612050014,7912316.649300007,7923224.769300009,7933861.269300012,7945520.9005500125,7957427.534550015,7968811.71780001,7979642.8645500075,7989701.605050009,7998522.183300005,8007209.272050004,8014209.7578000035
19.0,7812328.792049982,7816556.715299986,7820079.46004999,7823610.2950499905,7827364.552049996,7832022.719549996,7838489.050049996,7846270.757550003,7856105.768550003,7867811.889300007,7878377.404800007,7889770.66005001,7900909.612050014,7912316.649300007,7923224.769300009,7933861.269300012,7945520.9005500125,7957427.534550015,7968811.71780001,7979642.8645500075,7989701.605050009,7998522.183300005,8007209.272050004,8014209.7578000035
20.0,3506544.4675,3510985.120749999,3513131.2404999994,3515185.9489999986,3517190.1169999987,3519300.1684999983,3522026.1669999985,3525918.782749999,3530418.896499999,3534665.207,3538694.5469999993,3542366.3042500005,3546260.7985000014,3550130.5145000005,3554091.912749999,3558082.402250001,3562303.0785000026,3566685.1420000014,3571025.4390000016,3575179.9510000004,3579112.1087500006,3583131.1587500023,3586671.6387500013,3590277.5367500004
21.0,3506544.4675,3510985.120749999,3513131.2404999994,3515185.9489999986,3517190.1169999987,3519300.1684999983,3522026.1669999985,3525918.782749999,3530418.896499999,3534665.207,3538694.5469999993,3542366.3042500005,3546260.7985000014,3550130.5145000005,3554091.912749999,3558082.402250001,3562303.0785000026,3566685.1420000014,3571025.4390000016,3575179.9510000004,3579112.1087500006,3583131.1587500023,3586671.6387500013,3590277.5367500004
22.0,10519633.4025,10532955.362249997,10539393.721499998,10545557.846999995,10551570.350999996,10557900.505499994,10566078.500999995,10577756.348249996,10591256.689499997,10603995.621,10616083.640999999,10627098.912750002,10638782.395500004,10650391.543500002,10662275.738249999,10674247.206750004,10686909.235500008,10700055.426000005,10713076.317000005,10725539.853,10737336.326250002,10749393.476250008,10760014.916250004,10770832.610250002
23.0,10519633.4025,10532955.362249997,10539393.721499998,10545557.846999995,10551570.350999996,10557900.505499994,10566078.500999995,10577756.348249996,10591256.689499997,10603995.621,10616083.640999999,10627098.912750002,10638782.395500004,10650391.543500002,10662275.738249999,10674247.206750004,10686909.235500008,10700055.426000005,10713076.317000005,10725539.853,10737336.326250002,10749393.476250008,10760014.916250004,10770832.610250002
24.0,2313993.9094999973,2316674.061749998,2318023.1362499995,2319195.3370000008,2320321.110500002,2321451.4767500036,2323086.937250003,2325532.730500003,2328484.1410000036,2331529.246750005,2334171.7385000046,2336706.951750004,2339280.0642500045,2342136.275000005,2345147.961750005,2347978.2732500043,2350728.4327500057,2353746.590250005,2356872.524750004,2359781.7762500043,2362625.9690000066,2365335.6145000067,2367867.2575000064,2370216.6300000083
25.0,2313993.9094999973,2316674.061749998,2318023.1362499995,2319195.3370000008,2320321.110500002,2321451.4767500036,2323086.937250003,2325532.730500003,2328484.1410000036,2331529.246750005,2334171.7385000046,2336706.951750004,2339280.0642500045,2342136.275000005,2345147.961750005,2347978.2732500043,2350728.4327500057,2353746.590250005,2356872.524750004,2359781.7762500043,2362625.9690000066,2365335.6145000067,2367867.2575000064,2370216.6300000083
26.0,6941981.728499992,6950022.185249994,6954069.408749999,6957586.011000002,6960963.331500005,6964354.430250011,6969260.81175001,6976598.191500008,6985452.423000011,6994587.740250016,7002515.215500014,7010120.855250012,7017840.192750013,7026408.825000015,7035443.885250015,7043934.819750013,7052185.298250018,7061239.770750015,7070617.574250013,7079345.328750012,7087877.90700002,7096006.84350002,7103601.7725000195,7110649.890000025
27.0,6941981.728499992,6950022.185249994,6954069.408749999,6957586.011000002,6960963.331500005,6964354.430250011,6969260.81175001,6976598.191500008,6985452.423000011,6994587.740250016,7002515.215500014,7010120.855250012,7017840.192750013,7026408.825000015,7035443.885250015,7043934.819750013,7052185.298250018,7061239.770750015,7070617.574250013,7079345.328750012,7087877.90700002,7096006.84350002,7103601.7725000195,7110649.890000025
28.0,84822287.31812517,84888346.47112517,84938961.37962519,84983153.4433752,85024068.1841252,85065720.43312523,85118559.80562524,85196292.71187526,85290804.14112523,85391580.10387525,85491119.28012523,85592092.16637526,85695999.48537526,85803278.20387524,85910899.70362523,86014963.11037524,86119289.48137523,86226481.3171252,86334406.08462518,86438947.0191252,86537924.0046252,86635287.1018752,86727522.98037519,86813217.32212518
29.0,84822287.31812517,84888346.47112517,84938961.37962519,84983153.4433752,85024068.1841252,85065720.43312523,85118559.80562524,85196292.71187526,85290804.14112523,85391580.10387525,85491119.28012523,85592092.16637526,85695999.48537526,85803278.20387524,85910899.70362523,86014963.11037524,86119289.48137523,86226481.3171252,86334406.08462518,86438947.0191252,86537924.0046252,86635287.1018752,86727522.98037519,86813217.32212518
30.0,254466861.9543755,254665039.4133755,254816884.13887554,254949460.3301256,255072204.5523756,255197161.29937568,255355679.41687572,255588878.13562578,255872412.4233757,256174740.31162575,256473357.8403757,256776276.49912578,257087998.45612577,257409834.61162573,257732699.1108757,258044889.33112574,258357868.4441257,258679443.9513756,259003218.25387555,259316841.05737558,259613772.0138756,259905861.30562562,260182568.94112557,260439651.96637553
31.0,254466861.9543755,254665039.4133755,254816884.13887554,254949460.3301256,255072204.5523756,255197161.29937568,255355679.41687572,255588878.13562578,255872412.4233757,256174740.31162575,256473357.8403757,256776276.49912578,257087998.45612577,257409834.61162573,257732699.1108757,258044889.33112574,258357868.4441257,258679443.9513756,259003218.25387555,259316841.05737558,259613772.0138756,259905861.30562562,260182568.94112557,260439651.96637553
32.0,2327619.976075017,2329589.9015000165,2331246.9345500167,2332729.2171000177,2334015.782250017,2335287.245125017,2336978.3813750166,2339375.894375016,2341809.703625016,2344236.132625016,2346614.2841250156,2349126.959625015,2351715.984125015,2354480.193125015,2357135.162375015,2359785.0931250164,2362547.567375016,2365369.890625016,2368460.364625015,2371514.1451250142,2374447.3676250153,2377423.9238750148,2380200.288750014,2382756.2668500138
33.0,2327619.976075017,2329589.9015000165,2331246.9345500167,2332729.2171000177,2334015.782250017,2335287.245125017,2336978.3813750166,2339375.894375016,2341809.703625016,2344236.132625016,2346614.2841250156,2349126.959625015,2351715.984125015,2354480.193125015,2357135.162375015,2359785.0931250164,2362547.567375016,2365369.890625016,2368460.364625015,2371514.1451250142,2374447.3676250153,2377423.9238750148,2380200.288750014,2382756.2668500138
34.0,6982859.928225051,6988769.704500049,6993740.8036500495,6998187.651300053,7002047.346750051,7005861.735375051,7010935.14412505,7018127.683125048,7025429.110875048,7032708.397875048,7039842.852375047,7047380.878875045,7055147.952375045,7063440.579375045,7071405.487125046,7079355.279375049,7087642.702125048,7096109.6718750475,7105381.093875045,7114542.435375042,7123342.102875046,7132271.771625044,7140600.866250042,7148268.800550042
35.0,6982859.928225051,6988769.704500049,6993740.8036500495,6998187.651300053,7002047.346750051,7005861.735375051,7010935.14412505,7018127.683125048,7025429.110875048,7032708.397875048,7039842.852375047,7047380.878875045,7055147.952375045,7063440.579375045,7071405.487125046,7079355.279375049,7087642.702125048,7096109.6718750475,7105381.093875045,7114542.435375042,7123342.102875046,7132271.771625044,7140600.866250042,7148268.800550042
36.0,1389536.6247999852,1390276.2176499849,1390888.064049985,1391482.0242999848,1392098.5925749852,1392851.0146499847,1393840.236749985,1395544.411749985,1397767.1232499855,1399769.9667499855,1401780.5274999854,1403439.0389999854,1405282.7424999862,1407196.5139999855,1409119.4894999857,1411070.2799999858,1412951.6472499857,1414795.9017499858,1416729.625749986,1418648.6619999853,1420078.527999985,1421485.9039999854,1422734.0250749858,1423800.4642499862
37.0,1389536.6247999852,1390276.2176499849,1390888.064049985,1391482.0242999848,1392098.5925749852,1392851.0146499847,1393840.236749985,1395544.411749985,1397767.1232499855,1399769.9667499855,1401780.5274999854,1403439.0389999854,1405282.7424999862,1407196.5139999855,1409119.4894999857,1411070.2799999858,1412951.6472499857,1414795.9017499858,1416729.625749986,1418648.6619999853,1420078.527999985,1421485.9039999854,1422734.0250749858,1423800.4642499862
38.0,4168609.8743999554,4170828.6529499544,4172664.192149955,4174446.0728999544,4176295.7777249557,4178553.043949954,4181520.710249955,4186633.235249955,4193301.3697499568,4199309.900249956,4205341.582499957,4210317.116999956,4215848.227499958,4221589.541999957,4227358.468499957,4233210.839999957,4238854.941749957,4244387.705249958,4250188.877249958,4255945.985999956,4260235.583999955,4264457.7119999565,4268202.075224957,4271401.392749959
39.0,4168609.8743999554,4170828.6529499544,4172664.192149955,4174446.0728999544,4176295.7777249557,4178553.043949954,4181520.710249955,4186633.235249955,4193301.3697499568,4199309.900249956,4205341.582499957,4210317.116999956,4215848.227499958,4221589.541999957,4227358.468499957,4233210.839999957,4238854.941749957,4244387.705249958,4250188.877249958,4255945.985999956,4260235.583999955,4264457.7119999565,4268202.075224957,4271401.392749959
40.0,3227268.396999984,3229484.1057499833,3231382.3522499828,3232976.978274983,3234433.556049983,3235955.853299982,3237899.0452999813,3240896.3367999815,3244614.115549981,3248715.1250499813,3252965.482299981,3257088.3770499816,3261820.857799981,3266376.9682999807,3270899.2192999814,3275257.734799981,3279786.9222999816,3284196.1475499803,3288491.81454998,3292479.4732999806,3296309.3105499805,3299979.497549979,3303466.33804998,3306503.386799979
41.0,3227268.396999984,3229484.1057499833,3231382.3522499828,3232976.978274983,3234433.556049983,3235955.853299982,3237899.0452999813,3240896.3367999815,3244614.115549981,3248715.1250499813,3252965.482299981,3257088.3770499816,3261820.857799981,3266376.9682999807,3270899.2192999814,3275257.734799981,3279786.9222999816,3284196.1475499803,3288491.81454998,3292479.4732999806,3296309.3105499805,3299979.497549979,3303466.33804998,3306503.386799979
42.0,9681805.190999951,9688452.31724995,9694147.056749947,9698930.93482495,9703300.668149948,9707867.559899945,9713697.135899944,9722689.010399945,9733842.346649943,9746145.375149943,9758896.446899943,9771265.131149944,9785462.573399942,9799130.904899942,9812697.657899944,9825773.204399943,9839360.766899945,9852588.442649942,9865475.44364994,9877438.419899942,9888927.931649942,9899938.492649937,9910399.01414994,9919510.160399936
43.0,9681805.190999951,9688452.31724995,9694147.056749947,9698930.93482495,9703300.668149948,9707867.559899945,9713697.135899944,9722689.010399945,9733842.346649943,9746145.375149943,9758896.446899943,9771265.131149944,9785462.573399942,9799130.904899942,9812697.657899944,9825773.204399943,9839360.766899945,9852588.442649942,9865475.44364994,9877438.419899942,9888927.931649942,9899938.492649937,9910399.01414994,9919510.160399936
44.0,2989159.4818499936,2990901.7323249937,2992439.492749995,2993966.798674996,2995233.0075249956,2996716.7756499946,2998516.6609249944,3001175.2056749957,3004663.832174995,3008201.156174993,3012245.1454249923,3016082.7031749925,3020094.043674992,3024372.8421749924,3028524.147424994,3032673.7889249935,3036788.826674992,3040906.136924991,3045232.686424991,3049017.2614249904,3052476.4874249906,3055990.9218499907,3059085.5910999915,3061747.8847999913
45.0,2989159.4818499936,2990901.7323249937,2992439.492749995,2993966.798674996,2995233.0075249956,2996716.7756499946,2998516.6609249944,3001175.2056749957,3004663.832174995,3008201.156174993,3012245.1454249923,3016082.7031749925,3020094.043674992,3024372.8421749924,3028524.147424994,3032673.7889249935,3036788.826674992,3040906.136924991,3045232.686424991,3049017.2614249904,3052476.4874249906,3055990.9218499907,3059085.5910999915,3061747.8847999913
46.0,8967478.44554998,8972705.196974982,8977318.478249986,8981900.396024987,8985699.022574987,8990150.326949984,8995549.982774984,9003525.617024988,9013991.496524986,9024603.46852498,9036735.436274977,9048248.109524976,9060282.131024975,9073118.526524978,9085572.442274982,9098021.36677498,9110366.480024977,9122718.410774972,9135698.059274973,9147051.784274971,9157429.462274972,9167972.765549973,9177256.773299973,9185243.654399974
47.0,8967478.44554998,8972705.196974982,8977318.478249986,8981900.396024987,8985699.022574987,8990150.326949984,8995549.982774984,9003525.617024988,9013991.496524986,9024603.46852498,9036735.436274977,9048248.109524976,9060282.131024975,9073118.526524978,9085572.442274982,9098021.36677498,9110366.480024977,9122718.410774972,9135698.059274973,9147051.784274971,9157429.462274972,9167972.765549973,9177256.773299973,9185243.654399974
48.0,2521594.4193750047,2522985.2046250054,2524222.4168750052,2525379.3008750053,2526497.6950750053,2527751.8200750034,2529337.0393250026,2531798.5920750005,2535269.648325001,2539488.620575001,2543151.5915750028,2547048.919825002,2551021.651825002,2555277.7978250016,2559572.5683250003,2563852.187324999,2568081.2778250007,2572480.933575,2576760.8530750005,2580498.5998250023,2583578.1518250015,2586158.303575003,2588558.5458250055,2590945.5678250063
49.0,2521594.4193750047,2522985.2046250054,2524222.4168750052,2525379.3008750053,2526497.6950750053,2527751.8200750034,2529337.0393250026,2531798.5920750005,2535269.648325001,2539488.620575001,2543151.5915750028,2547048.919825002,2551021.651825002,2555277.7978250016,2559572.5683250003,2563852.187324999,2568081.2778250007,2572480.933575,2576760.8530750005,2580498.5998250023,2583578.1518250015,2586158.303575003,2588558.5458250055,2590945.5678250063
50.0,7564783.258125015,7568955.613875017,7572667.250625016,7576137.902625016,7579493.085225016,7583255.46022501,7588011.117975008,7595395.776225002,7605808.944975003,7618465.8617250025,7629454.774725009,7641146.759475006,7653064.955475006,7665833.393475005,7678717.7049750015,7691556.561974997,7704243.833475002,7717442.800725,7730282.559225001,7741495.799475007,7750734.455475004,7758474.910725009,7765675.6374750165,7772836.703475019
51.0,7564783.258125015,7568955.613875017,7572667.250625016,7576137.902625016,7579493.085225016,7583255.46022501,7588011.117975008,7595395.776225002,7605808.944975003,7618465.8617250025,7629454.774725009,7641146.759475006,7653064.955475006,7665833.393475005,7678717.7049750015,7691556.561974997,7704243.833475002,7717442.800725,7730282.559225001,7741495.799475007,7750734.455475004,7758474.910725009,7765675.6374750165,7772836.703475019
52.0,2759858.306900009,2761400.129150009,2762782.766400007,2764119.7696500076,2765390.518900008,2766807.5776500083,2768903.662150009,2772175.4694000096,2776241.373650008,2779800.7899000086,2783015.295150009,2785925.080150009,2788957.141400009,2792159.485400008,2795606.411900007,2799056.232900008,2802508.9004000076,2806285.2484000097,2810300.99965001,2813856.9991500094,2817183.3454000074,2819903.6991500086,2822375.2471500086,2824553.110900008
53.0,2759858.306900009,2761400.129150009,2762782.766400007,2764119.7696500076,2765390.518900008,2766807.5776500083,2768903.662150009,2772175.4694000096,2776241.373650008,2779800.7899000086,2783015.295150009,2785925.080150009,2788957.141400009,2792159.485400008,2795606.411900007,2799056.232900008,2802508.9004000076,2806285.2484000097,2810300.99965001,2813856.9991500094,2817183.3454000074,2819903.6991500086,2822375.2471500086,2824553.110900008
54.0,8279574.920700027,8284200.387450026,8288348.299200021,8292359.308950023,8296171.556700024,8300422.732950024,8306710.986450028,8316526.408200029,8328724.120950024,8339402.369700026,8349045.885450027,8357775.240450027,8366871.424200026,8376478.456200024,8386819.2357000215,8397168.698700024,8407526.701200023,8418855.745200029,8430902.99895003,8441570.997450028,8451550.036200022,8459711.097450025,8467125.741450027,8473659.332700025
55.0,8279574.920700027,8284200.387450026,8288348.299200021,8292359.308950023,8296171.556700024,8300422.732950024,8306710.986450028,8316526.408200029,8328724.120950024,8339402.369700026,8349045.885450027,8357775.240450027,8366871.424200026,8376478.456200024,8386819.2357000215,8397168.698700024,8407526.701200023,8418855.745200029,8430902.99895003,8441570.997450028,8451550.036200022,8459711.097450025,8467125.741450027,8473659.332700025
56.0,5842537.269884999,5846391.465512498,5849663.98664,5852677.81836,5855460.090752503,5858181.1393650025,5861366.676950004,5866415.911350004,5873449.394725006,5880661.811375009,5888168.617075008,5895554.482425007,5903262.436425012,5911085.894400012,5918701.060900012,5926172.8151750155,5933464.142550016,5941135.721925016,5947941.335500016,5954442.836325017,5960523.417287515,5966321.235377516,5971899.085627509,5977015.942052511
57.0,5842537.269884999,5846391.465512498,5849663.98664,5852677.81836,5855460.090752503,5858181.1393650025,5861366.676950004,5866415.911350004,5873449.394725006,5880661.811375009,5888168.617075008,5895554.482425007,5903262.436425012,5911085.894400012,5918701.060900012,5926172.8151750155,5933464.142550016,5941135.721925016,5947941.335500016,5954442.836325017,5960523.417287515,5966321.235377516,5971899.085627509,5977015.942052511
58.0,17527611.809654996,17539174.396537494,17548991.95992,17558033.45508,17566380.272257507,17574543.418095008,17584100.03085001,17599247.734050013,17620348.18417502,17641985.43412503,17664505.851225026,17686663.44727502,17709787.309275035,17733257.683200035,17756103.182700038,17778518.445525046,17800392.42765005,17823407.165775046,17843824.006500047,17863328.50897505,17881570.251862545,17898963.706132546,17915697.256882526,17931047.826157533
59.0,17527611.809654996,17539174.396537494,17548991.95992,17558033.45508,17566380.272257507,17574543.418095008,17584100.03085001,17599247.734050013,17620348.18417502,17641985.43412503,17664505.851225026,17686663.44727502,17709787.309275035,17733257.683200035,17756103.182700038,17778518.445525046,17800392.42765005,17823407.165775046,17843824.006500047,17863328.50897505,17881570.251862545,17898963.706132546,17915697.256882526,17931047.826157533
60.0,2594155.8615999958,2597155.2460999973,2598726.093649999,2600090.808025,2601353.6817999994,2602723.154099998,2604561.8065999974,2607230.277849998,2610553.1873499984,2614168.6895999988,2617674.5478499974,2621257.6308499984,2624837.708849999,2628201.4071,2631587.754349999,2635026.7451000004,2638550.0838500005,2642104.3878500005,2645910.9945999994,2649626.1266,2652786.4251,2655635.9165999987,2658373.3903499986,2660860.8520999965
61.0,2594155.8615999958,2597155.2460999973,2598726.093649999,2600090.808025,2601353.6817999994,2602723.154099998,2604561.8065999974,2607230.277849998,2610553.1873499984,2614168.6895999988,2617674.5478499974,2621257.6308499984,2624837.708849999,2628201.4071,2631587.754349999,2635026.7451000004,2638550.0838500005,2642104.3878500005,2645910.9945999994,2649626.1266,2652786.4251,2655635.9165999987,2658373.3903499986,2660860.8520999965
62.0,7782467.584799987,7791465.738299992,7796178.280949997,7800272.424075,7804061.045399998,7808169.462299994,7813685.419799993,7821690.833549993,7831659.562049995,7842506.068799997,7853023.643549992,7863772.892549995,7874513.126549997,7884604.2213,7894763.263049997,7905080.235300001,7915650.251550002,7926313.163550002,7937732.983799998,7948878.3798,7958359.2753,7966907.749799997,7975120.171049995,7982582.55629999
63.0,7782467.584799987,7791465.738299992,7796178.280949997,7800272.424075,7804061.045399998,7808169.462299994,7813685.419799993,7821690.833549993,7831659.562049995,7842506.068799997,7853023.643549992,7863772.892549995,7874513.126549997,7884604.2213,7894763.263049997,7905080.235300001,7915650.251550002,7926313.163550002,7937732.983799998,7948878.3798,7958359.2753,7966907.749799997,7975120.171049995,7982582.55629999
64.0,1501715.008475,1503006.58105,1503884.8948749998,1504801.1404250003,1505612.9407250008,1506517.6997000007,1507654.2248250004,1509440.324825001,1511450.1233250014,1513233.9480750014,1514929.940825001,1516564.5865750003,1518091.0913250004,1519858.8725750009,1521582.2223250011,1523340.1638250016,1525171.7975750014,1527045.1510750016,1529019.9985750022,1531006.614325002,1532716.5310750015,1534451.6005750014,1536011.0393250016,1537412.4725250017
65.0,1501715.008475,1503006.58105,1503884.8948749998,1504801.1404250003,1505612.9407250008,1506517.6997000007,1507654.2248250004,1509440.324825001,1511450.1233250014,1513233.9480750014,1514929.940825001,1516564.5865750003,1518091.0913250004,1519858.8725750009,1521582.2223250011,1523340.1638250016,1525171.7975750014,1527045.1510750016,1529019.9985750022,1531006.614325002,1532716.5310750015,1534451.6005750014,1536011.0393250016,1537412.4725250017
66.0,4505145.025425,4509019.7431499995,4511654.684625,4514403.421275001,4516838.822175003,4519553.099100002,4522962.674475001,4528320.974475003,4534350.369975004,4539701.844225004,4544789.822475003,4549693.759725001,4554273.273975002,4559576.617725003,4564746.666975004,4570020.491475005,4575515.392725004,4581135.4532250045,4587059.995725007,4593019.842975006,4598149.593225004,4603354.801725004,4608033.117975005,4612237.417575005
67.0,4505145.025425,4509019.7431499995,4511654.684625,4514403.421275001,4516838.822175003,4519553.099100002,4522962.674475001,4528320.974475003,4534350.369975004,4539701.844225004,4544789.822475003,4549693.759725001,4554273.273975002,4559576.617725003,4564746.666975004,4570020.491475005,4575515.392725004,4581135.4532250045,4587059.995725007,4593019.842975006,4598149.593225004,4603354.801725004,4608033.117975005,4612237.417575005
68.0,3009291.447025004,3011806.4205250046,3013617.9000250045,3015337.979275004,3016939.1657750052,3018456.917525005,3020798.4360250067,3024173.3462750064,3027540.448525007,3030741.446025008,3033786.0912750056,3036885.7027750057,3040038.848775006,3043139.777775006,3046380.246775006,3049570.7602750063,3052945.8510250053,3056800.4657750055,3060755.618275005,3064604.2377750063,3068291.714275008,3071945.7587750065,3075377.485025006,3078504.846275007
69.0,3009291.447025004,3011806.4205250046,3013617.9000250045,3015337.979275004,3016939.1657750052,3018456.917525005,3020798.4360250067,3024173.3462750064,3027540.448525007,3030741.446025008,3033786.0912750056,3036885.7027750057,3040038.848775006,3043139.777775006,3046380.246775006,3049570.7602750063,3052945.8510250053,3056800.4657750055,3060755.618275005,3064604.2377750063,3068291.714275008,3071945.7587750065,3075377.485025006,3078504.846275007
70.0,9027874.34107501,9035419.261575013,9040853.700075014,9046013.937825013,9050817.497325016,9055370.752575016,9062395.30807502,9072520.03882502,9082621.34557502,9092224.338075023,9101358.273825016,9110657.108325018,9120116.546325017,9129419.333325017,9139140.740325019,9148712.280825019,9158837.553075016,9170401.397325017,9182266.854825014,9193812.71332502,9204875.142825024,9215837.27632502,9226132.455075018,9235514.53882502
71.0,9027874.34107501,9035419.261575013,9040853.700075014,9046013.937825013,9050817.497325016,9055370.752575016,9062395.30807502,9072520.03882502,9082621.34557502,9092224.338075023,9101358.273825016,9110657.108325018,9120116.546325017,9129419.333325017,9139140.740325019,9148712.280825019,9158837.553075016,9170401.397325017,9182266.854825014,9193812.71332502,9204875.142825024,9215837.27632502,9226132.455075018,9235514.53882502
72.0,2162334.989750008,2163810.3800000097,2165265.1115000104,2166508.5055000093,2167588.569500008,2168710.6497500087,2170073.346500008,2172419.7735000076,2175107.4930000072,2177793.1197500066,2180508.944000007,2183352.038500006,2186232.856250006,2189173.484250006,2192072.429000007,2194839.6650000066,2197562.2290000063,2200537.3005000064,2203537.2395000076,2206455.4162500077,2209145.7950000064,2211679.3980000056,2214018.4215000058,2216134.174250006
73.0,2162334.989750008,2163810.3800000097,2165265.1115000104,2166508.5055000093,2167588.569500008,2168710.6497500087,2170073.346500008,2172419.7735000076,2175107.4930000072,2177793.1197500066,2180508.944000007,2183352.038500006,2186232.856250006,2189173.484250006,2192072.429000007,2194839.6650000066,2197562.2290000063,2200537.3005000064,2203537.2395000076,2206455.4162500077,2209145.7950000064,2211679.3980000056,2214018.4215000058,2216134.174250006
74.0,6487004.969250024,6491431.140000029,6495795.334500032,6499525.516500028,6502765.708500024,6506131.949250026,6510220.039500024,6517259.320500023,6525322.479000022,6533379.35925002,6541526.832000021,6550056.115500018,6558698.568750017,6567520.452750018,6576217.287000021,6584518.99500002,6592686.6870000195,6601611.901500019,6610611.718500023,6619366.248750024,6627437.385000019,6635038.194000017,6642055.264500017,6648402.522750018
75.0,6487004.969250024,6491431.140000029,6495795.334500032,6499525.516500028,6502765.708500024,6506131.949250026,6510220.039500024,6517259.320500023,6525322.479000022,6533379.35925002,6541526.832000021,6550056.115500018,6558698.568750017,6567520.452750018,6576217.287000021,6584518.99500002,6592686.6870000195,6601611.901500019,6610611.718500023,6619366.248750024,6627437.385000019,6635038.194000017,6642055.264500017,6648402.522750018
76.0,11853171.549999978,11861743.595499972,11868359.146249974,11874223.582999974,11879831.404499972,11885508.336249974,11892020.154499972,11901923.495749973,11915835.865749976,11931315.033249976,11947844.54824998,11964809.339499982,11982485.13099998,12000384.743499981,12017917.595249983,12034724.550249977,12051164.01574998,12067045.646999978,12082223.884749973,12096877.55574997,12111442.439999972,12125589.388999972,12138987.893499982,12151433.400749978
77.0,11853171.549999978,11861743.595499972,11868359.146249974,11874223.582999974,11879831.404499972,11885508.336249974,11892020.154499972,11901923.495749973,11915835.865749976,11931315.033249976,11947844.54824998,11964809.339499982,11982485.13099998,12000384.743499981,12017917.595249983,12034724.550249977,12051164.01574998,12067045.646999978,12082223.884749973,12096877.55574997,12111442.439999972,12125589.388999972,12138987.893499982,12151433.400749978
78.0,35559514.64999993,35585230.78649992,35605077.438749924,35622670.74899992,35639494.21349992,35656525.00874992,35676060.46349992,35705770.48724992,35747507.597249925,35793945.09974993,35843533.64474994,35894428.01849995,35947455.39299994,36001154.230499946,36053752.78574995,36104173.65074993,36153492.04724994,36201136.94099993,36246671.65424992,36290632.66724991,36334327.31999992,36376768.16699992,36416963.68049994,36454300.20224993
79.0,35559514.64999993,35585230.78649992,35605077.438749924,35622670.74899992,35639494.21349992,35656525.00874992,35676060.46349992,35705770.48724992,35747507.597249925,35793945.09974993,35843533.64474994,35894428.01849995,35947455.39299994,36001154.230499946,36053752.78574995,36104173.65074993,36153492.04724994,36201136.94099993,36246671.65424992,36290632.66724991,36334327.31999992,36376768.16699992,36416963.68049994,36454300.20224993
80.0,1975228.626299991,1976560.8330499916,1977650.0800499923,1978618.9217999917,1979554.4195499916,1980543.9740499912,1981869.9832999916,1983686.4812999917,1985768.5830499919,1987932.165549992,1990297.350799992,1992711.4510499914,1995076.9342999912,1997537.0182999913,2000235.0737999913,2002841.2667999922,2005672.1095499925,2008303.8635499927,2011049.8315499928,2013560.598799992,2015725.753799992,2017694.1817999918,2019705.9065499909,2021513.8227999902
81.0,1975228.626299991,1976560.8330499916,1977650.0800499923,1978618.9217999917,1979554.4195499916,1980543.9740499912,1981869.9832999916,1983686.4812999917,1985768.5830499919,1987932.165549992,1990297.350799992,1992711.4510499914,1995076.9342999912,1997537.0182999913,2000235.0737999913,2002841.2667999922,2005672.1095499925,2008303.8635499927,2011049.8315499928,2013560.598799992,2015725.753799992,2017694.1817999918,2019705.9065499909,2021513.8227999902
82.0,5925685.878899973,5929682.499149974,5932950.240149977,5935856.765399976,5938663.258649975,5941631.922149974,5945609.949899975,5951059.443899975,5957305.749149975,5963796.496649976,5970892.052399976,5978134.353149975,5985230.8028999735,5992611.054899974,6000705.221399974,6008523.800399977,6017016.328649977,6024911.590649978,6033149.494649978,6040681.796399975,6047177.261399976,6053082.545399975,6059117.719649972,6064541.468399971
83.0,5925685.878899973,5929682.499149974,5932950.240149977,5935856.765399976,5938663.258649975,5941631.922149974,5945609.949899975,5951059.443899975,5957305.749149975,5963796.496649976,5970892.052399976,5978134.353149975,5985230.8028999735,5992611.054899974,6000705.221399974,6008523.800399977,6017016.328649977,6024911.590649978,6033149.494649978,6040681.796399975,6047177.261399976,6053082.545399975,6059117.719649972,6064541.468399971
84.0,1641070.3669174956,1642518.9269174957,1643458.4331674953,1644345.2111674943,1645153.0164174947,1645957.003167495,1647150.5076674952,1648979.4704174944,1650783.0059174951,1652435.682917495,1654027.1669174957,1655647.1716674957,1657277.1446674955,1658991.9831674956,1660814.6841674955,1662659.9441674955,1664483.7214174957,1666496.4236674958,1668543.1579174958,1670504.424917495,1672438.9414174948,1674226.890417495,1676002.782417495,1677675.2346674942
85.0,1641070.3669174956,1642518.9269174957,1643458.4331674953,1644345.2111674943,1645153.0164174947,1645957.003167495,1647150.5076674952,1648979.4704174944,1650783.0059174951,1652435.682917495,1654027.1669174957,1655647.1716674957,1657277.1446674955,1658991.9831674956,1660814.6841674955,1662659.9441674955,1664483.7214174957,1666496.4236674958,1668543.1579174958,1670504.424917495,1672438.9414174948,1674226.890417495,1676002.782417495,1677675.2346674942
86.0,4923211.100752487,4927556.7807524875,4930375.299502486,4933035.633502483,4935459.049252484,4937871.009502484,4941451.523002486,4946938.411252484,4952349.017752485,4957307.048752485,4962081.500752487,4966941.515002487,4971831.434002487,4976975.949502487,4982444.052502487,4987979.832502486,4993451.164252487,4999489.271002487,5005629.473752487,5011513.274752486,5017316.824252484,5022680.671252485,5028008.347252485,5033025.704002483
87.0,4923211.100752487,4927556.7807524875,4930375.299502486,4933035.633502483,4935459.049252484,4937871.009502484,4941451.523002486,4946938.411252484,4952349.017752485,4957307.048752485,4962081.500752487,4966941.515002487,4971831.434002487,4976975.949502487,4982444.052502487,4987979.832502486,4993451.164252487,4999489.271002487,5005629.473752487,5011513.274752486,5017316.824252484,5022680.671252485,5028008.347252485,5033025.704002483
88.0,1879370.889050002,1880404.184100002,1881289.8312250015,1882100.7783500012,1882914.3882500012,1883801.6860500013,1884903.7544500015,1886467.0592000003,1888496.1632000012,1890438.0679500017,1892570.196450002,1894592.0032000018,1896786.4859500013,1899035.385200001,1901221.0482750002,1903313.2490249993,1905529.040524999,1907714.0965249988,1909954.627774999,1912044.017774999,1914156.7930249989,1916138.044849999,1917918.8231499991,1919580.4059249992
89.0,1879370.889050002,1880404.184100002,1881289.8312250015,1882100.7783500012,1882914.3882500012,1883801.6860500013,1884903.7544500015,1886467.0592000003,1888496.1632000012,1890438.0679500017,1892570.196450002,1894592.0032000018,1896786.4859500013,1899035.385200001,1901221.0482750002,1903313.2490249993,1905529.040524999,1907714.0965249988,1909954.627774999,1912044.017774999,1914156.7930249989,1916138.044849999,1917918.8231499991,1919580.4059249992
90.0,5638112.667150006,5641212.552300006,5643869.493675005,5646302.335050004,5648743.164750004,5651405.058150004,5654711.263350004,5659401.177600001,5665488.489600004,5671314.203850005,5677710.589350006,5683776.009600005,5690359.457850004,5697106.155600003,5703663.144825,5709939.747074998,5716587.121574997,5723142.289574997,5729863.8833249975,5736132.0533249965,5742470.379074996,5748414.134549997,5753756.469449997,5758741.217774997
91.0,5638112.667150006,5641212.552300006,5643869.493675005,5646302.335050004,5648743.164750004,5651405.058150004,5654711.263350004,5659401.177600001,5665488.489600004,5671314.203850005,5677710.589350006,5683776.009600005,5690359.457850004,5697106.155600003,5703663.144825,5709939.747074998,5716587.121574997,5723142.289574997,5729863.8833249975,5736132.0533249965,5742470.379074996,5748414.134549997,5753756.469449997,5758741.217774997
92.0,5733231.267044976,5736333.3027699785,5738777.078844979,5740978.1241199775,5742958.431904975,5744914.670764976,5747312.099464976,5751050.097089977,5755755.019889977,5760862.857689977,5765832.983414975,5770938.410464974,5776229.379614976,5781617.265389971,5787457.642189973,5792859.822889978,5798036.4267899785,5803459.955889979,5808592.0080399765,5813211.96906498,5817817.879364982,5822273.523464982,5826581.257964984,5830735.391389984
93.0,5733231.267044976,5736333.3027699785,5738777.078844979,5740978.1241199775,5742958.431904975,5744914.670764976,5747312.099464976,5751050.097089977,5755755.019889977,5760862.857689977,5765832.983414975,5770938.410464974,5776229.379614976,5781617.265389971,5787457.642189973,5792859.822889978,5798036.4267899785,5803459.955889979,5808592.0080399765,5813211.96906498,5817817.879364982,5822273.523464982,5826581.257964984,5830735.391389984
94.0,17199693.80113493,17208999.908309937,17216331.23653494,17222934.37235993,17228875.295714926,17234744.01229493,17241936.29839493,17253150.291269932,17267265.05966993,17282588.57306993,17297498.950244926,17312815.231394924,17328688.13884493,17344851.796169914,17362372.92656992,17378579.468669936,17394109.280369937,17410379.86766994,17425776.02411993,17439635.90719494,17453453.638094947,17466820.570394948,17479743.77389495,17492206.17416995
95.0,17199693.80113493,17208999.908309937,17216331.23653494,17222934.37235993,17228875.295714926,17234744.01229493,17241936.29839493,17253150.291269932,17267265.05966993,17282588.57306993,17297498.950244926,17312815.231394924,17328688.13884493,17344851.796169914,17362372.92656992,17378579.468669936,17394109.280369937,17410379.86766994,17425776.02411993,17439635.90719494,17453453.638094947,17466820.570394948,17479743.77389495,17492206.17416995
96.0,1918639.267725002,1919907.5639750026,1921053.5752250024,1922110.9862250015,1923096.1652250006,1924169.4049750003,1925643.3074750002,1927761.6732250003,1930100.8109750003,1932357.044225,1934673.3032249997,1937074.3799750002,1939644.3602249997,1942219.743225,1944757.7922250007,1947259.4637250002,1949909.9709750002,1952492.9129749998,1955108.9427249995,1957491.939975,1959640.368225001,1961627.957475001,1963652.1742250007,1965533.6427250013
97.0,1918639.267725002,1919907.5639750026,1921053.5752250024,1922110.9862250015,1923096.1652250006,1924169.4049750003,1925643.3074750002,1927761.6732250003,1930100.8109750003,1932357.044225,1934673.3032249997,1937074.3799750002,1939644.3602249997,1942219.743225,1944757.7922250007,1947259.4637250002,1949909.9709750002,1952492.9129749998,1955108.9427249995,1957491.939975,1959640.368225001,1961627.957475001,1963652.1742250007,1965533.6427250013
98.0,5755917.803175006,5759722.691925008,5763160.725675007,5766332.958675005,5769288.495675001,5772508.214925,5776929.922425,5783285.019675001,5790302.432925001,5797071.1326750005,5804019.909674999,5811223.139925,5818933.080674999,5826659.2296750005,5834273.376675002,5841778.391175,5849729.912925,5857478.738924999,5865326.828174999,5872475.819925,5878921.104675003,5884883.872425003,5890956.522675002,5896600.928175004
99.0,5755917.803175006,5759722.691925008,5763160.725675007,5766332.958675005,5769288.495675001,5772508.214925,5776929.922425,5783285.019675001,5790302.432925001,5797071.1326750005,5804019.909674999,5811223.139925,5818933.080674999,5826659.2296750005,5834273.376675002,5841778.391175,5849729.912925,5857478.738924999,5865326.828174999,5872475.819925,5878921.104675003,5884883.872425003,5890956.522675002,5896600.928175004
100.0,6699823.888957493,6704845.813307492,6708486.577307493,6711886.515507494,6715175.692607494,6718707.832107495,6724220.182782493,6731825.979432492,6740499.795307493,6748233.758357493,6755853.4660574915,6763395.679157493,6771260.939182488,6779405.243857489,6787670.9184574885,6795775.7440574905,6803928.466232491,6812507.324807492,6821477.761982494,6830102.063957494,6838199.112432495,6845749.488632494,6852791.541357494,6858991.147432493
101.0,6699823.888957493,6704845.813307492,6708486.577307493,6711886.515507494,6715175.692607494,6718707.832107495,6724220.182782493,6731825.979432492,6740499.795307493,6748233.758357493,6755853.4660574915,6763395.679157493,6771260.939182488,6779405.243857489,6787670.9184574885,6795775.7440574905,6803928.466232491,6812507.324807492,6821477.761982494,6830102.063957494,6838199.112432495,6845749.488632494,6852791.541357494,6858991.147432493
102.0,20099471.66687248,20114537.439922474,20125459.73192248,20135659.546522483,20145527.077822484,20156123.496322483,20172660.548347477,20195477.938297473,20221499.385922477,20244701.275072478,20267560.398172475,20290187.03747248,20313782.817547463,20338215.731572468,20363012.755372465,20387327.23217247,20411785.398697473,20437521.974422477,20464433.285947483,20490306.19187248,20514597.337297484,20537248.465897482,20558374.62407248,20576973.44229748
103.0,20099471.66687248,20114537.439922474,20125459.73192248,20135659.546522483,20145527.077822484,20156123.496322483,20172660.548347477,20195477.938297473,20221499.385922477,20244701.275072478,20267560.398172475,20290187.03747248,20313782.817547463,20338215.731572468,20363012.755372465,20387327.23217247,20411785.398697473,20437521.974422477,20464433.285947483,20490306.19187248,20514597.337297484,20537248.465897482,20558374.62407248,20576973.44229748
104.0,11345414.76625004,11353443.978750044,11360163.804750042,11366021.950500045,11371498.55925005,11376881.586250043,11383515.81325004,11393427.30425005,11405455.844000047,11418586.315500049,11431869.068250049,11445186.468250047,11459063.672500044,11473546.526750047,11487082.665500043,11500864.802750038,11513924.876750035,11527231.35300003,11541018.638500037,11554470.648000043,11567117.440750053,11579744.49625004,11591954.21050004,11603884.731000042
105.0,11345414.76625004,11353443.978750044,11360163.804750042,11366021.950500045,11371498.55925005,11376881.586250043,11383515.81325004,11393427.30425005,11405455.844000047,11418586.315500049,11431869.068250049,11445186.468250047,11459063.672500044,11473546.526750047,11487082.665500043,11500864.802750038,11513924.876750035,11527231.35300003,11541018.638500037,11554470.648000043,11567117.440750053,11579744.49625004,11591954.21050004,11603884.731000042
106.0,34036244.29875012,34060331.936250135,34080491.41425013,34098065.85150014,34114495.67775015,34130644.758750126,34150547.43975012,34180281.912750155,34216367.53200014,34255758.946500145,34295607.20475015,34335559.40475014,34377191.01750013,34420639.580250144,34461247.99650013,34502594.408250116,34541774.630250104,34581694.05900009,34623055.91550011,34663411.944000125,34701352.32225016,34739233.48875012,34775862.63150012,34811654.19300012
107.0,34036244.29875012,34060331.936250135,34080491.41425013,34098065.85150014,34114495.67775015,34130644.758750126,34150547.43975012,34180281.912750155,34216367.53200014,34255758.946500145,34295607.20475015,34335559.40475014,34377191.01750013,34420639.580250144,34461247.99650013,34502594.408250116,34541774.630250104,34581694.05900009,34623055.91550011,34663411.944000125,34701352.32225016,34739233.48875012,34775862.63150012,34811654.19300012
108.0,3753586.04430001,3755962.4085500096,3758054.912200009,3759938.7468250096,3761587.351800009,3763320.552050009,3765806.9025500077,3770091.994300008,3774870.396550008,3779692.980300008,3784327.663800007,3788878.708300007,3793804.1983000073,3798868.4063000055,3804078.953300004,3809083.2583000027,3814166.7950500017,3819598.6098000035,3824973.9590500044,3830008.6843000054,3834662.3433000064,3839232.366800005,3843308.034300006,3846924.6208000076
109.0,3753586.04430001,3755962.4085500096,3758054.912200009,3759938.7468250096,3761587.351800009,3763320.552050009,3765806.9025500077,3770091.994300008,3774870.396550008,3779692.980300008,3784327.663800007,3788878.708300007,3793804.1983000073,3798868.4063000055,3804078.953300004,3809083.2583000027,3814166.7950500017,3819598.6098000035,3824973.9590500044,3830008.6843000054,3834662.3433000064,3839232.366800005,3843308.034300006,3846924.6208000076
110.0,11260758.13290003,11267887.22565003,11274164.736600026,11279816.240475029,11284762.055400027,11289961.656150026,11297420.707650023,11310275.982900023,11324611.189650025,11339078.940900024,11352982.991400022,11366636.12490002,11381412.594900021,11396605.218900017,11412236.859900013,11427249.774900008,11442500.385150004,11458795.82940001,11474921.877150014,11490026.052900016,11503987.029900018,11517697.100400016,11529924.102900017,11540773.862400023
111.0,11260758.13290003,11267887.22565003,11274164.736600026,11279816.240475029,11284762.055400027,11289961.656150026,11297420.707650023,11310275.982900023,11324611.189650025,11339078.940900024,11352982.991400022,11366636.12490002,11381412.594900021,11396605.218900017,11412236.859900013,11427249.774900008,11442500.385150004,11458795.82940001,11474921.877150014,11490026.052900016,11503987.029900018,11517697.100400016,11529924.102900017,11540773.862400023
112.0,2463368.7127999864,2464689.8987999847,2465954.674799985,2467076.433299986,2468122.3165499866,2469198.062799987,2470425.908799987,2472584.356799986,2474696.9860499855,2476821.883299984,2478846.3872999847,2480854.341549984,2482992.1485499833,2485075.7485499824,2487357.0675499816,2489482.295799981,2491689.62729998,2493879.0777999787,2496114.4875499774,2498446.1787999766,2500663.4685499766,2502888.839799978,2504987.7322999774,2506941.139549977
113.0,2463368.7127999864,2464689.8987999847,2465954.674799985,2467076.433299986,2468122.3165499866,2469198.062799987,2470425.908799987,2472584.356799986,2474696.9860499855,2476821.883299984,2478846.3872999847,2480854.341549984,2482992.1485499833,2485075.7485499824,2487357.0675499816,2489482.295799981,2491689.62729998,2493879.0777999787,2496114.4875499774,2498446.1787999766,2500663.4685499766,2502888.839799978,2504987.7322999774,2506941.139549977
114.0,7390106.138399959,7394069.696399954,7397864.024399955,7401229.299899958,7404366.94964996,7407594.188399961,7411277.72639996,7417753.070399959,7424090.958149957,7430465.649899952,7436539.161899954,7442563.024649953,7448976.44564995,7455227.245649947,7462071.202649945,7468446.887399943,7475068.88189994,7481637.233399936,7488343.462649932,7495338.53639993,7501990.40564993,7508666.5193999335,7514963.196899932,7520823.418649931
115.0,7390106.138399959,7394069.696399954,7397864.024399955,7401229.299899958,7404366.94964996,7407594.188399961,7411277.72639996,7417753.070399959,7424090.958149957,7430465.649899952,7436539.161899954,7442563.024649953,7448976.44564995,7455227.245649947,7462071.202649945,7468446.887399943,7475068.88189994,7481637.233399936,7488343.462649932,7495338.53639993,7501990.40564993,7508666.5193999335,7514963.196899932,7520823.418649931
116.0,3622450.5922499797,3625104.59524998,3627377.5774999796,3629438.049999979,3631362.1677499786,3633361.8094999795,3635853.46674998,3639541.2309999797,3643436.5477499813,3647293.873749981,3651323.737749982,3655289.776249982,3659410.787999982,3663649.2439999823,3667853.8349999823,3671968.6099999826,3676438.392499984,3681144.429999984,3685962.2449999847,3690877.287499985,3695330.754999985,3699406.2922499836,3703389.293499983,3707137.5577499834
117.0,3622450.5922499797,3625104.59524998,3627377.5774999796,3629438.049999979,3631362.1677499786,3633361.8094999795,3635853.46674998,3639541.2309999797,3643436.5477499813,3647293.873749981,3651323.737749982,3655289.776249982,3659410.787999982,3663649.2439999823,3667853.8349999823,3671968.6099999826,3676438.392499984,3681144.429999984,3685962.2449999847,3690877.287499985,3695330.754999985,3699406.2922499836,3703389.293499983,3707137.5577499834
118.0,10867351.776749939,10875313.78574994,10882132.732499938,10888314.149999937,10894086.503249936,10900085.428499939,10907560.40024994,10918623.692999939,10930309.643249944,10941881.621249944,10953971.213249946,10965869.328749945,10978232.363999946,10990947.731999947,11003561.504999947,11015905.829999948,11029315.177499952,11043433.28999995,11057886.734999955,11072631.862499956,11085992.264999956,11098218.876749951,11110167.880499948,11121412.67324995
119.0,10867351.776749939,10875313.78574994,10882132.732499938,10888314.149999937,10894086.503249936,10900085.428499939,10907560.40024994,10918623.692999939,10930309.643249944,10941881.621249944,10953971.213249946,10965869.328749945,10978232.363999946,10990947.731999947,11003561.504999947,11015905.829999948,11029315.177499952,11043433.28999995,11057886.734999955,11072631.862499956,11085992.264999956,11098218.876749951,11110167.880499948,11121412.67324995
120.0,3191998.079565557,3194038.8134155567,3195856.489365557,3197415.2326405575,3198847.5850655576,3200279.4572905586,3202010.266765556,3204637.242521805,3208195.6339538046,3211883.989009056,3215600.6859340556,3219283.9306090567,3223102.3534590565,3227151.6349965567,3231252.4533465556,3235118.069016556,3239061.2119540563,3242998.3516740557,3246820.7516358057,3250466.528440805,3254025.6209383034,3257110.6669750526,3260218.5106053012,3263788.871355303
121.0,3191998.079565557,3194038.8134155567,3195856.489365557,3197415.2326405575,3198847.5850655576,3200279.4572905586,3202010.266765556,3204637.242521805,3208195.6339538046,3211883.989009056,3215600.6859340556,3219283.9306090567,3223102.3534590565,3227151.6349965567,3231252.4533465556,3235118.069016556,3239061.2119540563,3242998.3516740557,3246820.7516358057,3250466.528440805,3254025.6209383034,3257110.6669750526,3260218.5106053012,3263788.871355303
122.0,9575994.238696672,9582116.44024667,9587569.468096672,9592245.697921673,9596542.755196672,9600838.371871676,9606030.800296668,9613911.727565415,9624586.901861414,9635651.967027167,9646802.057802167,9657851.79182717,9669307.06037717,9681454.904989671,9693757.360039666,9705354.207049668,9717183.635862168,9728995.055022167,9740462.254907418,9751399.585322415,9762076.86281491,9771332.000925157,9780655.531815903,9791366.61406591
123.0,9575994.238696672,9582116.44024667,9587569.468096672,9592245.697921673,9596542.755196672,9600838.371871676,9606030.800296668,9613911.727565415,9624586.901861414,9635651.967027167,9646802.057802167,9657851.79182717,9669307.06037717,9681454.904989671,9693757.360039666,9705354.207049668,9717183.635862168,9728995.055022167,9740462.254907418,9751399.585322415,9762076.86281491,9771332.000925157,9780655.531815903,9791366.61406591
124.0,93651168.24167466,93721887.95267466,93773876.82492463,93820732.05992466,93863969.06292462,93908651.7861746,93965754.63742459,94051969.95967463,94158991.12317467,94269482.62292467,94379792.7849247,94488951.7934247,94602806.1259247,94719333.98042472,94836470.12167473,94949764.04842477,95065007.81142479,95183198.79017484,95300884.34117477,95412580.72392477,95516621.04242477,95616787.93017475,95710709.74517474,95797210.02667476
125.0,93651168.24167466,93721887.95267466,93773876.82492463,93820732.05992466,93863969.06292462,93908651.7861746,93965754.63742459,94051969.95967463,94158991.12317467,94269482.62292467,94379792.7849247,94488951.7934247,94602806.1259247,94719333.98042472,94836470.12167473,94949764.04842477,95065007.81142479,95183198.79017484,95300884.34117477,95412580.72392477,95516621.04242477,95616787.93017475,95710709.74517474,95797210.02667476
126.0,280953504.725024,281165663.858024,281321630.4747739,281462196.179774,281591907.1887739,281725955.3585238,281897263.91227376,282155909.8790239,282476973.369524,282808447.868774,283139378.3547741,283466855.38027406,283808418.3777741,284158001.94127417,284509410.3650242,284849292.1452743,285195023.4342744,285549596.3705245,285902653.0235243,286237742.1717743,286549863.1272743,286850363.79052424,287132129.2355242,287391630.0800243
127.0,280953504.725024,281165663.858024,281321630.4747739,281462196.179774,281591907.1887739,281725955.3585238,281897263.91227376,282155909.8790239,282476973.369524,282808447.868774,283139378.3547741,283466855.38027406,283808418.3777741,284158001.94127417,284509410.3650242,284849292.1452743,285195023.4342744,285549596.3705245,285902653.0235243,286237742.1717743,286549863.1272743,286850363.79052424,287132129.2355242,287391630.0800243
128.0,6732091.9105000105,6737596.798000012,6742477.731500015,6746716.07675002,6750483.07425002,6754642.412000017,6759300.640750018,6765718.718750019,6773630.409750019,6781445.297750021,6789543.4982500225,6797561.851750019,6806094.579250021,6814907.605500023,6823385.124250025,6831753.804000026,6840403.908500026,6849310.455000022,6858235.971250023,6866682.54725002,6875261.796000019,6883741.045000018,6891662.78825002,6899410.057750021
129.0,6732091.9105000105,6737596.798000012,6742477.731500015,6746716.07675002,6750483.07425002,6754642.412000017,6759300.640750018,6765718.718750019,6773630.409750019,6781445.297750021,6789543.4982500225,6797561.851750019,6806094.579250021,6814907.605500023,6823385.124250025,6831753.804000026,6840403.908500026,6849310.455000022,6858235.971250023,6866682.54725002,6875261.796000019,6883741.045000018,6891662.78825002,6899410.057750021
130.0,20196275.73150003,20212790.394000035,20227433.194500044,20240148.23025006,20251449.22275006,20263927.236000054,20277901.922250055,20297156.156250056,20320891.22925006,20344335.893250063,20368630.494750068,20392685.555250056,20418283.73775006,20444722.816500068,20470155.372750074,20495261.412000075,20521211.725500077,20547931.36500007,20574707.913750067,20600047.64175006,20625785.388000056,20651223.135000054,20674988.364750057,20698230.173250064
131.0,20196275.73150003,20212790.394000035,20227433.194500044,20240148.23025006,20251449.22275006,20263927.236000054,20277901.922250055,20297156.156250056,20320891.22925006,20344335.893250063,20368630.494750068,20392685.555250056,20418283.73775006,20444722.816500068,20470155.372750074,20495261.412000075,20521211.725500077,20547931.36500007,20574707.913750067,20600047.64175006,20625785.388000056,20651223.135000054,20674988.364750057,20698230.173250064
132.0,1115429.6712499915,1116013.1457499915,1116596.8581249914,1117164.8561749915,1117685.9385749917,1118210.6853249916,1118807.872199992,1119731.9709749923,1120901.1034749912,1122179.8546499915,1123510.2940499915,1124875.4132999917,1126250.6615749917,1127706.570149992,1129126.1851499917,1130371.9374749921,1131632.449074992,1132853.173849992,1134142.6123249915,1135346.8996249908,1136387.3019999918,1137301.2687999913,1138107.1876999915,1138896.2824249917
133.0,1115429.6712499915,1116013.1457499915,1116596.8581249914,1117164.8561749915,1117685.9385749917,1118210.6853249916,1118807.872199992,1119731.9709749923,1120901.1034749912,1122179.8546499915,1123510.2940499915,1124875.4132999917,1126250.6615749917,1127706.570149992,1129126.1851499917,1130371.9374749921,1131632.449074992,1132853.173849992,1134142.6123249915,1135346.8996249908,1136387.3019999918,1137301.2687999913,1138107.1876999915,1138896.2824249917
134.0,3346289.013749975,3348039.4372499743,3349790.5743749742,3351494.5685249744,3353057.815724975,3354632.0559749748,3356423.616599976,3359195.912924977,3362703.3104249733,3366539.5639499743,3370530.882149975,3374626.2398999752,3378751.984724975,3383119.710449976,3387378.5554499747,3391115.8124249764,3394897.347224976,3398559.521549976,3402427.8369749747,3406040.6988749723,3409161.9059999753,3411903.806399974,3414321.5630999748,3416688.847274975
135.0,3346289.013749975,3348039.4372499743,3349790.5743749742,3351494.5685249744,3353057.815724975,3354632.0559749748,3356423.616599976,3359195.912924977,3362703.3104249733,3366539.5639499743,3370530.882149975,3374626.2398999752,3378751.984724975,3383119.710449976,3387378.5554499747,3391115.8124249764,3394897.347224976,3398559.521549976,3402427.8369749747,3406040.6988749723,3409161.9059999753,3411903.806399974,3414321.5630999748,3416688.847274975
136.0,2666201.4115000046,2669977.6665000054,2671904.3015000056,2673614.2440000046,2675303.9785000053,2676991.0782500044,2679259.5622500055,2682544.489250005,2686405.303000006,2689710.892250005,2692652.1107500046,2695987.1760000046,2699100.6537500042,2702298.7157500056,2705434.108250005,2708476.7565000053,2711614.043250006,2714897.0827500075,2718377.2295000073,2721866.934500008,2725473.745750008,2728959.767000009,2732264.58800001,2735104.9520000108
137.0,2666201.4115000046,2669977.6665000054,2671904.3015000056,2673614.2440000046,2675303.9785000053,2676991.0782500044,2679259.5622500055,2682544.489250005,2686405.303000006,2689710.892250005,2692652.1107500046,2695987.1760000046,2699100.6537500042,2702298.7157500056,2705434.108250005,2708476.7565000053,2711614.043250006,2714897.0827500075,2718377.2295000073,2721866.934500008,2725473.745750008,2728959.767000009,2732264.58800001,2735104.9520000108
138.0,7998604.234500013,8009932.999500016,8015712.904500017,8020842.732000014,8025911.935500016,8030973.234750014,8037778.686750017,8047633.467750016,8059215.909000018,8069132.6767500155,8077956.332250014,8087961.528000014,8097301.961250013,8106896.147250017,8116302.3247500155,8125430.269500015,8134842.129750019,8144691.2482500225,8155131.6885000225,8165600.803500024,8176421.237250024,8186879.301000027,8196793.764000029,8205314.856000032
139.0,7998604.234500013,8009932.999500016,8015712.904500017,8020842.732000014,8025911.935500016,8030973.234750014,8037778.686750017,8047633.467750016,8059215.909000018,8069132.6767500155,8077956.332250014,8087961.528000014,8097301.961250013,8106896.147250017,8116302.3247500155,8125430.269500015,8134842.129750019,8144691.2482500225,8155131.6885000225,8165600.803500024,8176421.237250024,8186879.301000027,8196793.764000029,8205314.856000032
140.0,1776234.3710000117,1776863.224925012,1777418.936750012,1777953.8431500117,1778471.8655750111,1779022.1345000109,1779792.335125011,1781108.3548750114,1782605.1036250119,1784257.2208750122,1786086.827375012,1787802.2333750115,1789624.9506250117,1791466.8998750122,1793339.1506250117,1795132.9408750115,1796856.818125011,1798521.7633750122,1800045.3316250127,1801387.6021250125,1802614.0403750124,1803660.5730750125,1804580.1428750134,1805457.817900014
141.0,1776234.3710000117,1776863.224925012,1777418.936750012,1777953.8431500117,1778471.8655750111,1779022.1345000109,1779792.335125011,1781108.3548750114,1782605.1036250119,1784257.2208750122,1786086.827375012,1787802.2333750115,1789624.9506250117,1791466.8998750122,1793339.1506250117,1795132.9408750115,1796856.818125011,1798521.7633750122,1800045.3316250127,1801387.6021250125,1802614.0403750124,1803660.5730750125,1804580.1428750134,1805457.817900014
142.0,5328703.113000035,5330589.674775036,5332256.810250036,5333861.529450035,5335415.596725034,5337066.403500033,5339377.005375033,5343325.064625034,5347815.310875036,5352771.662625037,5358260.482125036,5363406.700125035,5368874.851875035,5374400.699625037,5380017.451875035,5385398.8226250345,5390570.454375032,5395565.290125037,5400135.994875038,5404162.806375038,5407842.121125037,5410981.719225038,5413740.42862504,5416373.453700042
143.0,5328703.113000035,5330589.674775036,5332256.810250036,5333861.529450035,5335415.596725034,5337066.403500033,5339377.005375033,5343325.064625034,5347815.310875036,5352771.662625037,5358260.482125036,5363406.700125035,5368874.851875035,5374400.699625037,5380017.451875035,5385398.8226250345,5390570.454375032,5395565.290125037,5400135.994875038,5404162.806375038,5407842.121125037,5410981.719225038,5413740.42862504,5416373.453700042
144.0,10823202.832499966,10829321.491999973,10834459.482999979,10838952.282749964,10843222.24849996,10847571.571249949,10852856.069999954,10861235.98749996,10873038.672999958,10886362.037499955,10900576.63399996,10914678.546749959,10929251.437499952,10944608.064999951,10960125.926249947,10974660.876249949,10989264.016249945,11003624.909249946,11017166.173749939,11029079.36299993,11040250.45299993,11050283.744999927,11059673.033999935,11068556.64374994
145.0,10823202.832499966,10829321.491999973,10834459.482999979,10838952.282749964,10843222.24849996,10847571.571249949,10852856.069999954,10861235.98749996,10873038.672999958,10886362.037499955,10900576.63399996,10914678.546749959,10929251.437499952,10944608.064999951,10960125.926249947,10974660.876249949,10989264.016249945,11003624.909249946,11017166.173749939,11029079.36299993,11040250.45299993,11050283.744999927,11059673.033999935,11068556.64374994
146.0,32469608.497499898,32487964.475999918,32503378.448999934,32516856.84824989,32529666.74549988,32542714.71374985,32558568.20999986,32583707.96249988,32619116.018999875,32659086.112499863,32701729.901999883,32744035.64024988,32787754.312499855,32833824.19499985,32880377.778749842,32923982.628749847,32967792.048749834,33010874.72774984,33051498.521249816,33087238.088999785,33120751.358999792,33150851.23499978,33179019.101999804,33205669.93124982
147.0,32469608.497499898,32487964.475999918,32503378.448999934,32516856.84824989,32529666.74549988,32542714.71374985,32558568.20999986,32583707.96249988,32619116.018999875,32659086.112499863,32701729.901999883,32744035.64024988,32787754.312499855,32833824.19499985,32880377.778749842,32923982.628749847,32967792.048749834,33010874.72774984,33051498.521249816,33087238.088999785,33120751.358999792,33150851.23499978,33179019.101999804,33205669.93124982
148.0,2354424.6385000027,2355972.1792500024,2357363.063750002,2358636.049250002,2359837.8780000014,2361007.121750002,2362621.386500001,2365112.01125,2367638.303500002,2370100.748500002,2372616.0292500015,2374878.5280000013,2377344.5487500024,2380123.5390000013,2382915.366750001,2385897.5797500005,2388694.9159999997,2391661.7880000006,2394699.258750001,2397736.7187500023,2400649.9745000023,2403652.911500002,2406330.0857500006,2408799.8157500005
149.0,2354424.6385000027,2355972.1792500024,2357363.063750002,2358636.049250002,2359837.8780000014,2361007.121750002,2362621.386500001,2365112.01125,2367638.303500002,2370100.748500002,2372616.0292500015,2374878.5280000013,2377344.5487500024,2380123.5390000013,2382915.366750001,2385897.5797500005,2388694.9159999997,2391661.7880000006,2394699.258750001,2397736.7187500023,2400649.9745000023,2403652.911500002,2406330.0857500006,2408799.8157500005
150.0,7063273.915500008,7067916.537750008,7072089.191250006,7075908.147750006,7079513.634000004,7083021.365250005,7087864.159500003,7095336.0337499995,7102914.910500005,7110302.245500006,7117848.087750005,7124635.584000004,7132033.646250008,7140370.617000004,7148746.100250003,7157692.7392500015,7166084.748,7174985.364000002,7184097.776250003,7193210.156250007,7201949.923500007,7210958.734500006,7218990.257250002,7226399.447250001
151.0,7063273.915500008,7067916.537750008,7072089.191250006,7075908.147750006,7079513.634000004,7083021.365250005,7087864.159500003,7095336.0337499995,7102914.910500005,7110302.245500006,7117848.087750005,7124635.584000004,7132033.646250008,7140370.617000004,7148746.100250003,7157692.7392500015,7166084.748,7174985.364000002,7184097.776250003,7193210.156250007,7201949.923500007,7210958.734500006,7218990.257250002,7226399.447250001
152.0,8324725.995232519,8329764.713732519,8334143.237732519,8338046.61448252,8341871.8672325155,8345573.611982517,8349828.084232519,8356220.631982517,8365292.761432516,8375553.086432516,8386659.542932514,8398142.007432513,8409622.981682515,8421607.79939252,8433429.335642535,8445224.095892534,8456406.706642535,8467425.523892533,8478007.53998753,8487812.505332535,8496890.248792524,8505400.073887525,8513223.69788752,8520759.265137522
153.0,8324725.995232519,8329764.713732519,8334143.237732519,8338046.61448252,8341871.8672325155,8345573.611982517,8349828.084232519,8356220.631982517,8365292.761432516,8375553.086432516,8386659.542932514,8398142.007432513,8409622.981682515,8421607.79939252,8433429.335642535,8445224.095892534,8456406.706642535,8467425.523892533,8478007.53998753,8487812.505332535,8496890.248792524,8505400.073887525,8513223.69788752,8520759.265137522
154.0,24974177.985697556,24989294.14119756,25002429.71319756,25014139.84344756,25025615.601697545,25036720.83594755,25049484.252697557,25068661.895947553,25095878.28429755,25126659.259297546,25159978.628797542,25194426.02229754,25228868.945047542,25264823.398177557,25300288.006927606,25335672.2876776,25369220.119927604,25402276.5716776,25434022.61996259,25463437.515997604,25490670.746377572,25516200.221662574,25539671.09366256,25562277.795412563
155.0,24974177.985697556,24989294.14119756,25002429.71319756,25014139.84344756,25025615.601697545,25036720.83594755,25049484.252697557,25068661.895947553,25095878.28429755,25126659.259297546,25159978.628797542,25194426.02229754,25228868.945047542,25264823.398177557,25300288.006927606,25335672.2876776,25369220.119927604,25402276.5716776,25434022.61996259,25463437.515997604,25490670.746377572,25516200.221662574,25539671.09366256,25562277.795412563
156.0,5978350.0735,5982893.987249998,5986367.702499997,5989400.327249996,5992122.134249994,5994915.3322499925,5998825.756249993,6004513.103749992,6012306.37424999,6020605.951499991,6028945.614749992,6036973.43674999,6045333.990999987,6053912.156749989,6062497.12124999,6070734.006249989,6078962.279999993,6087403.811249991,6096219.683499994,6104265.599249989,6111462.701249989,6118947.3769999845,6125761.321499984,6131821.654499984
157.0,5978350.0735,5982893.987249998,5986367.702499997,5989400.327249996,5992122.134249994,5994915.3322499925,5998825.756249993,6004513.103749992,6012306.37424999,6020605.951499991,6028945.614749992,6036973.43674999,6045333.990999987,6053912.156749989,6062497.12124999,6070734.006249989,6078962.279999993,6087403.811249991,6096219.683499994,6104265.599249989,6111462.701249989,6118947.3769999845,6125761.321499984,6131821.654499984
158.0,17935050.2205,17948681.961749993,17959103.10749999,17968200.98174999,17976366.40274998,17984745.99674998,17996477.26874998,18013539.31124998,18036919.12274997,18061817.854499973,18086836.84424998,18110920.31024997,18136001.97299996,18161736.470249966,18187491.36374997,18212202.018749967,18236886.839999977,18262211.433749974,18288659.050499983,18312796.797749966,18334388.103749968,18356842.130999953,18377283.96449995,18395464.963499952
159.0,17935050.2205,17948681.961749993,17959103.10749999,17968200.98174999,17976366.40274998,17984745.99674998,17996477.26874998,18013539.31124998,18036919.12274997,18061817.854499973,18086836.84424998,18110920.31024997,18136001.97299996,18161736.470249966,18187491.36374997,18212202.018749967,18236886.839999977,18262211.433749974,18288659.050499983,18312796.797749966,18334388.103749968,18356842.130999953,18377283.96449995,18395464.963499952
160.0,3213288.992625014,3215134.042875015,3216765.704375016,3218223.3808750142,3219685.3638750133,3221146.657125014,3222846.303375014,3225692.975375013,3229276.6613750122,3233104.162625012,3236698.594625013,3240384.4876250126,3244382.1698750127,3248048.412625014,3251692.821375013,3255174.224875013,3258881.1758750123,3262355.438375014,3265837.743875014,3269088.532375015,3272199.326125014,3275167.1336250147,3277945.202875014,3280422.120125014
161.0,3213288.992625014,3215134.042875015,3216765.704375016,3218223.3808750142,3219685.3638750133,3221146.657125014,3222846.303375014,3225692.975375013,3229276.6613750122,3233104.162625012,3236698.594625013,3240384.4876250126,3244382.1698750127,3248048.412625014,3251692.821375013,3255174.224875013,3258881.1758750123,3262355.438375014,3265837.743875014,3269088.532375015,3272199.326125014,3275167.1336250147,3277945.202875014,3280422.120125014
162.0,9639866.977875043,9645402.128625046,9650297.113125049,9654670.142625043,9659056.09162504,9663439.97137504,9668538.910125043,9677078.926125038,9687829.984125037,9699312.487875037,9710095.783875039,9721153.462875038,9733146.509625038,9744145.23787504,9755078.464125039,9765522.67462504,9776643.527625037,9787066.31512504,9797513.231625043,9807265.597125044,9816597.978375042,9825501.400875043,9833835.608625041,9841266.360375041
163.0,9639866.977875043,9645402.128625046,9650297.113125049,9654670.142625043,9659056.09162504,9663439.97137504,9668538.910125043,9677078.926125038,9687829.984125037,9699312.487875037,9710095.783875039,9721153.462875038,9733146.509625038,9744145.23787504,9755078.464125039,9765522.67462504,9776643.527625037,9787066.31512504,9797513.231625043,9807265.597125044,9816597.978375042,9825501.400875043,9833835.608625041,9841266.360375041
164.0,3024932.85237496,3027398.3983749603,3029568.458124961,3031393.0648749606,3033194.567124962,3035166.3583749617,3037439.1531249634,3040354.1036249646,3043415.7298749667,3046613.027374969,3049713.0188749693,3052767.6681249687,3055896.6433749693,3059312.1178749683,3062645.3048749682,3066254.8851249656,3069895.5036249654,3073892.2196249664,3078027.835374966,3082096.4923749645,3086124.097624962,3090164.1178749613,3093993.51612496,3097696.86887496
165.0,3024932.85237496,3027398.3983749603,3029568.458124961,3031393.0648749606,3033194.567124962,3035166.3583749617,3037439.1531249634,3040354.1036249646,3043415.7298749667,3046613.027374969,3049713.0188749693,3052767.6681249687,3055896.6433749693,3059312.1178749683,3062645.3048749682,3066254.8851249656,3069895.5036249654,3073892.2196249664,3078027.835374966,3082096.4923749645,3086124.097624962,3090164.1178749613,3093993.51612496,3097696.86887496
166.0,9074798.557124881,9082195.195124881,9088705.374374881,9094179.194624882,9099583.701374885,9105499.075124886,9112317.45937489,9121062.310874894,9130247.1896249,9139839.082124908,9149139.056624908,9158303.004374906,9167689.930124909,9177936.353624905,9187935.914624905,9198764.655374896,9209686.510874897,9221676.6588749,9234083.506124897,9246289.477124894,9258372.292874888,9270492.353624884,9281980.54837488,9293090.60662488
167.0,9074798.557124881,9082195.195124881,9088705.374374881,9094179.194624882,9099583.701374885,9105499.075124886,9112317.45937489,9121062.310874894,9130247.1896249,9139839.082124908,9149139.056624908,9158303.004374906,9167689.930124909,9177936.353624905,9187935.914624905,9198764.655374896,9209686.510874897,9221676.6588749,9234083.506124897,9246289.477124894,9258372.292874888,9270492.353624884,9281980.54837488,9293090.60662488
168.0,102156030.49594988,102219338.9774499,102273190.12644993,102321477.58519992,102366733.85594991,102413512.29369992,102471551.2009499,102560089.5114499,102676299.93944992,102800769.97394991,102929174.4871999,103058416.5379499,103193088.2174499,103332514.6399499,103471273.67694989,103604987.47544989,103739233.8794499,103875096.42844991,104006724.47344992,104129477.23769991,104243612.36219989,104349845.37744987,104449335.00069988,104543146.16919987
169.0,102156030.49594988,102219338.9774499,102273190.12644993,102321477.58519992,102366733.85594991,102413512.29369992,102471551.2009499,102560089.5114499,102676299.93944992,102800769.97394991,102929174.4871999,103058416.5379499,103193088.2174499,103332514.6399499,103471273.67694989,103604987.47544989,103739233.8794499,103875096.42844991,104006724.47344992,104129477.23769991,104243612.36219989,104349845.37744987,104449335.00069988,104543146.16919987
170.0,306468091.48784965,306658016.9323497,306819570.37934977,306964432.75559974,307100201.56784976,307240536.88109976,307414653.6028497,307680268.5343497,308028899.8183498,308402309.9218497,308787523.4615997,309175249.6138497,309579264.6523497,309997543.9198497,310413821.0308497,310814962.42634964,311217701.6383497,311625289.2853497,312020173.4203497,312388431.7130997,312730837.08659965,313049536.1323496,313348005.00209963,313629438.5075996
171.0,306468091.48784965,306658016.9323497,306819570.37934977,306964432.75559974,307100201.56784976,307240536.88109976,307414653.6028497,307680268.5343497,308028899.8183498,308402309.9218497,308787523.4615997,309175249.6138497,309579264.6523497,309997543.9198497,310413821.0308497,310814962.42634964,311217701.6383497,311625289.2853497,312020173.4203497,312388431.7130997,312730837.08659965,313049536.1323496,313348005.00209963,313629438.5075996
172.0,11147459.84474991,11156806.144749913,11164459.628499916,11171074.510999914,11177015.425499912,11182891.929999914,11189899.528749911,11199899.128749916,11212385.83124991,11226346.018749911,11239881.86874991,11253439.758749906,11267111.933499902,11281751.345999902,11296085.174749898,11309633.63224989,11323483.147249892,11337375.10224989,11351909.024749886,11366284.202249879,11380704.212249886,11395069.829749884,11408882.457249885,11422166.712249877
173.0,11147459.84474991,11156806.144749913,11164459.628499916,11171074.510999914,11177015.425499912,11182891.929999914,11189899.528749911,11199899.128749916,11212385.83124991,11226346.018749911,11239881.86874991,11253439.758749906,11267111.933499902,11281751.345999902,11296085.174749898,11309633.63224989,11323483.147249892,11337375.10224989,11351909.024749886,11366284.202249879,11380704.212249886,11395069.829749884,11408882.457249885,11422166.712249877
174.0,33442379.53424973,33470418.43424974,33493378.885499746,33513223.532999743,33531046.276499737,33548675.789999742,33569698.58624973,33599697.38624975,33637157.49374973,33679038.05624974,33719645.60624973,33760319.27624972,33801335.80049971,33845254.037999704,33888255.524249695,33928900.89674967,33970449.44174968,34012125.30674967,34055727.074249655,34098852.60674964,34142112.636749655,34185209.489249654,34226647.371749654,34266500.13674963
175.0,33442379.53424973,33470418.43424974,33493378.885499746,33513223.532999743,33531046.276499737,33548675.789999742,33569698.58624973,33599697.38624975,33637157.49374973,33679038.05624974,33719645.60624973,33760319.27624972,33801335.80049971,33845254.037999704,33888255.524249695,33928900.89674967,33970449.44174968,34012125.30674967,34055727.074249655,34098852.60674964,34142112.636749655,34185209.489249654,34226647.371749654,34266500.13674963
176.0,3596722.8451249963,3598733.7206249963,3600400.060624997,3601994.0213749963,3603446.189874997,3604970.523624998,3606717.1146249995,3609432.4508749987,3612898.9868749976,3616339.1663749963,3619895.5456249965,3623275.7858749973,3627014.5453749956,3630657.702124997,3634138.6253749966,3637362.3038749956,3640567.9591249973,3643945.0698749986,3647408.376624999,3650598.422624997,3653449.6623749975,3656347.8651249977,3659394.323374998,3661906.8763749963
177.0,3596722.8451249963,3598733.7206249963,3600400.060624997,3601994.0213749963,3603446.189874997,3604970.523624998,3606717.1146249995,3609432.4508749987,3612898.9868749976,3616339.1663749963,3619895.5456249965,3623275.7858749973,3627014.5453749956,3630657.702124997,3634138.6253749966,3637362.3038749956,3640567.9591249973,3643945.0698749986,3647408.376624999,3650598.422624997,3653449.6623749975,3656347.8651249977,3659394.323374998,3661906.8763749963
178.0,10790168.535374988,10796201.161874989,10801200.18187499,10805982.064124988,10810338.56962499,10814911.570874995,10820151.343874998,10828297.352624996,10838696.960624993,10849017.499124989,10859686.636874989,10869827.357624993,10881043.636124987,10891973.10637499,10902415.87612499,10912086.911624987,10921703.877374992,10931835.209624996,10942225.129874997,10951795.26787499,10960348.987124993,10969043.595374994,10978182.970124993,10985720.629124988
179.0,10790168.535374988,10796201.161874989,10801200.18187499,10805982.064124988,10810338.56962499,10814911.570874995,10820151.343874998,10828297.352624996,10838696.960624993,10849017.499124989,10859686.636874989,10869827.357624993,10881043.636124987,10891973.10637499,10902415.87612499,10912086.911624987,10921703.877374992,10931835.209624996,10942225.129874997,10951795.26787499,10960348.987124993,10969043.595374994,10978182.970124993,10985720.629124988
180.0,2747823.4028249895,2749982.3135999893,2751267.3427499896,2752301.0399749903,2753291.2086499897,2754371.501274991,2755876.9832749898,2758121.670024989,2761028.7335249884,2764153.086024987,2767100.3397749877,2770217.7980249873,2773303.122024988,2776462.7182749864,2779928.294274987,2783172.3080249857,2786528.7612749864,2790038.363274987,2793321.6255249865,2796191.290274985,2798677.019774985,2800910.5880249836,2803167.903199985,2805045.1775499857
181.0,2747823.4028249895,2749982.3135999893,2751267.3427499896,2752301.0399749903,2753291.2086499897,2754371.501274991,2755876.9832749898,2758121.670024989,2761028.7335249884,2764153.086024987,2767100.3397749877,2770217.7980249873,2773303.122024988,2776462.7182749864,2779928.294274987,2783172.3080249857,2786528.7612749864,2790038.363274987,2793321.6255249865,2796191.290274985,2798677.019774985,2800910.5880249836,2803167.903199985,2805045.1775499857
182.0,8243470.208474969,8249946.940799968,8253802.028249969,8256903.119924971,8259873.6259499695,8263114.503824973,8267630.949824969,8274365.0100749675,8283086.200574965,8292459.258074962,8301301.019324963,8310653.394074962,8319909.3660749635,8329388.154824959,8339784.882824961,8349516.924074957,8359586.28382496,8370115.089824961,8379964.87657496,8388573.870824955,8396031.059324956,8402731.764074951,8409503.709599955,8415135.532649957
183.0,8243470.208474969,8249946.940799968,8253802.028249969,8256903.119924971,8259873.6259499695,8263114.503824973,8267630.949824969,8274365.0100749675,8283086.200574965,8292459.258074962,8301301.019324963,8310653.394074962,8319909.3660749635,8329388.154824959,8339784.882824961,8349516.924074957,8359586.28382496,8370115.089824961,8379964.87657496,8388573.870824955,8396031.059324956,8402731.764074951,8409503.709599955,8415135.532649957
184.0,112241424.7325004,112319642.0475004,112383779.94250041,112440754.47500044,112494012.51500043,112548649.87500045,112616640.63000046,112716971.26000045,112843625.42250045,112981485.98750044,113121537.27500044,113263430.54250042,113410447.23000042,113563211.98500042,113714966.38250042,113861655.75500044,114008475.88750045,114156158.91250046,114301833.56750046,114441070.84250045,114572018.53750044,114698415.37250043,114816917.75750044,114927845.32250042
185.0,112241424.7325004,112319642.0475004,112383779.94250041,112440754.47500044,112494012.51500043,112548649.87500045,112616640.63000046,112716971.26000045,112843625.42250045,112981485.98750044,113121537.27500044,113263430.54250042,113410447.23000042,113563211.98500042,113714966.38250042,113861655.75500044,114008475.88750045,114156158.91250046,114301833.56750046,114441070.84250045,114572018.53750044,114698415.37250043,114816917.75750044,114927845.32250042
186.0,336724274.1975012,336958926.14250124,337151339.82750124,337322263.4250013,337482037.54500127,337645949.6250013,337849921.89000136,338150913.78000134,338530876.26750135,338944457.96250135,339364611.8250013,339790291.62750125,340231341.69000125,340689635.95500124,341144899.1475013,341584967.2650013,342025427.66250134,342468476.7375014,342905500.70250136,343323212.52750134,343716055.6125013,344095246.1175013,344450753.27250135,344783535.9675013
187.0,336724274.1975012,336958926.14250124,337151339.82750124,337322263.4250013,337482037.54500127,337645949.6250013,337849921.89000136,338150913.78000134,338530876.26750135,338944457.96250135,339364611.8250013,339790291.62750125,340231341.69000125,340689635.95500124,341144899.1475013,341584967.2650013,342025427.66250134,342468476.7375014,342905500.70250136,343323212.52750134,343716055.6125013,344095246.1175013,344450753.27250135,344783535.9675013
188.0,2726782.1544999997,2728687.2832499994,2730368.381999999,2731902.402999998,2733354.772749997,2734881.936249998,2736696.3374999994,2739130.9842499997,2741813.7492499994,2744930.710249999,2748062.120999999,2751050.111499999,2754148.0214999984,2757369.782999998,2760554.527749998,2763541.6599999983,2766645.764249998,2769811.184249998,2773213.2264999975,2776582.2807499976,2780007.9137499975,2783660.570249998,2786849.7847499973,2789708.4967499995
189.0,2726782.1544999997,2728687.2832499994,2730368.381999999,2731902.402999998,2733354.772749997,2734881.936249998,2736696.3374999994,2739130.9842499997,2741813.7492499994,2744930.710249999,2748062.120999999,2751050.111499999,2754148.0214999984,2757369.782999998,2760554.527749998,2763541.6599999983,2766645.764249998,2769811.184249998,2773213.2264999975,2776582.2807499976,2780007.9137499975,2783660.570249998,2786849.7847499973,2789708.4967499995
190.0,8180346.463499999,8186061.849749998,8191105.145999996,8195707.208999994,8200064.318249991,8204645.808749994,8210089.012499998,8217392.952749999,8225441.247749998,8234792.130749997,8244186.362999996,8253150.334499998,8262444.064499995,8272109.348999994,8281663.583249994,8290624.979999995,8299937.292749994,8309433.552749994,8319639.679499993,8329746.842249993,8340023.7412499925,8350981.710749994,8360549.3542499915,8369125.490249999
191.0,8180346.463499999,8186061.849749998,8191105.145999996,8195707.208999994,8200064.318249991,8204645.808749994,8210089.012499998,8217392.952749999,8225441.247749998,8234792.130749997,8244186.362999996,8253150.334499998,8262444.064499995,8272109.348999994,8281663.583249994,8290624.979999995,8299937.292749994,8309433.552749994,8319639.679499993,8329746.842249993,8340023.7412499925,8350981.710749994,8360549.3542499915,8369125.490249999
192.0,751712.2217749988,752152.087474999,752480.8967999989,752799.2666499986,753100.9686999986,753449.3122249986,753935.9461249987,754734.509124999,755667.710524999,756655.0375249991,757553.5281249994,758435.0937749994,759332.7732749996,760207.5208249999,761063.9025999997,761987.6293499997,762914.9593499994,763946.0390999992,765094.0943499993,766289.9585999992,767083.5866749991,767727.6755999991,768341.1375999991,768894.4262249989
193.0,751712.2217749988,752152.087474999,752480.8967999989,752799.2666499986,753100.9686999986,753449.3122249986,753935.9461249987,754734.509124999,755667.710524999,756655.0375249991,757553.5281249994,758435.0937749994,759332.7732749996,760207.5208249999,761063.9025999997,761987.6293499997,762914.9593499994,763946.0390999992,765094.0943499993,766289.9585999992,767083.5866749991,767727.6755999991,768341.1375999991,768894.4262249989
194.0,2255136.665324996,2256456.262424997,2257442.690399997,2258397.7999499957,2259302.9060999956,2260347.936674996,2261807.838374996,2264203.5273749973,2267003.1315749967,2269965.1125749974,2272660.584374998,2275305.281324998,2277998.3198249987,2280622.5624749996,2283191.707799999,2285962.8880499993,2288744.8780499985,2291838.1172999977,2295282.283049998,2298869.8757999977,2301250.7600249974,2303183.0267999973,2305023.4127999973,2306683.2786749965
195.0,2255136.665324996,2256456.262424997,2257442.690399997,2258397.7999499957,2259302.9060999956,2260347.936674996,2261807.838374996,2264203.5273749973,2267003.1315749967,2269965.1125749974,2272660.584374998,2275305.281324998,2277998.3198249987,2280622.5624749996,2283191.707799999,2285962.8880499993,2288744.8780499985,2291838.1172999977,2295282.283049998,2298869.8757999977,2301250.7600249974,2303183.0267999973,2305023.4127999973,2306683.2786749965
196.0,1488525.5909500062,1489464.0127000064,1490293.4062500058,1490977.8104750053,1491616.3473000051,1492278.7048250053,1493162.5254500054,1494708.1662000054,1496778.4809500054,1498821.3329500055,1500669.1674500057,1502589.7049500053,1504531.417200005,1506645.3134500051,1508756.416700005,1510811.7807000051,1512853.6707000048,1515068.2952000045,1517122.5724500043,1519016.1319500043,1520711.4807000046,1522420.9819500037,1523962.8382000036,1525493.0559500032
197.0,1488525.5909500062,1489464.0127000064,1490293.4062500058,1490977.8104750053,1491616.3473000051,1492278.7048250053,1493162.5254500054,1494708.1662000054,1496778.4809500054,1498821.3329500055,1500669.1674500057,1502589.7049500053,1504531.417200005,1506645.3134500051,1508756.416700005,1510811.7807000051,1512853.6707000048,1515068.2952000045,1517122.5724500043,1519016.1319500043,1520711.4807000046,1522420.9819500037,1523962.8382000036,1525493.0559500032
198.0,4465576.772850018,4468392.038100019,4470880.218750018,4472933.431425016,4474849.041900015,4476836.114475016,4479487.5763500165,4484124.498600016,4490335.442850016,4496463.998850017,4502007.502350017,4507769.114850016,4513594.251600015,4519935.940350016,4526269.250100015,4532435.342100015,4538561.012100015,4545204.885600014,4551367.717350013,4557048.395850013,4562134.442100014,4567262.945850011,4571888.514600011,4576479.16785001
199.0,4465576.772850018,4468392.038100019,4470880.218750018,4472933.431425016,4474849.041900015,4476836.114475016,4479487.5763500165,4484124.498600016,4490335.442850016,4496463.998850017,4502007.502350017,4507769.114850016,4513594.251600015,4519935.940350016,4526269.250100015,4532435.342100015,4538561.012100015,4545204.885600014,4551367.717350013,4557048.395850013,4562134.442100014,4567262.945850011,4571888.514600011,4576479.16785001
200.0,2496137.37284748,2497645.861497481,2498945.6309474795,2499948.875497479,2500746.1319474783,2501617.4249724783,2502773.663247478,2504973.976247478,2507506.3129974785,2510450.297997479,2513670.826247478,2517141.649997479,2520724.613747478,2524581.209997478,2528461.1382474797,2532277.386747481,2536235.9442474805,2540362.2847474823,2544227.8044974813,2548062.725747481,2551653.914747482,2555248.5581974825,2558525.511022483,2561756.047697484
201.0,2496137.37284748,2497645.861497481,2498945.6309474795,2499948.875497479,2500746.1319474783,2501617.4249724783,2502773.663247478,2504973.976247478,2507506.3129974785,2510450.297997479,2513670.826247478,2517141.649997479,2520724.613747478,2524581.209997478,2528461.1382474797,2532277.386747481,2536235.9442474805,2540362.2847474823,2544227.8044974813,2548062.725747481,2551653.914747482,2555248.5581974825,2558525.511022483,2561756.047697484
202.0,7488412.118542439,7492937.584492443,7496836.892842438,7499846.626492437,7502238.395842435,7504852.274917435,7508320.989742435,7514921.928742433,7522518.938992435,7531350.893992437,7541012.478742434,7551424.949992437,7562173.841242434,7573743.629992434,7585383.414742439,7596832.160242442,7608707.832742441,7621086.854242447,7632683.413492444,7644188.177242443,7654961.7442424465,7665745.6745924475,7675576.533067449,7685268.143092452
203.0,7488412.118542439,7492937.584492443,7496836.892842438,7499846.626492437,7502238.395842435,7504852.274917435,7508320.989742435,7514921.928742433,7522518.938992435,7531350.893992437,7541012.478742434,7551424.949992437,7562173.841242434,7573743.629992434,7585383.414742439,7596832.160242442,7608707.832742441,7621086.854242447,7632683.413492444,7644188.177242443,7654961.7442424465,7665745.6745924475,7675576.533067449,7685268.143092452
204.0,2634567.152999989,2636554.047249989,2638195.4959999905,2639669.7779999897,2641038.7724999897,2642422.75674999,2644238.180249989,2646778.05449999,2649577.732499989,2652224.8122499906,2654714.0294999923,2657271.968999993,2659767.0187499933,2662427.1847499926,2665162.249999993,2668029.7654999923,2670926.9972499907,2674179.2654999914,2677602.2709999913,2681003.998499993,2684410.9107499933,2687699.2917499943,2690783.102249993,2693780.1272499925
205.0,2634567.152999989,2636554.047249989,2638195.4959999905,2639669.7779999897,2641038.7724999897,2642422.75674999,2644238.180249989,2646778.05449999,2649577.732499989,2652224.8122499906,2654714.0294999923,2657271.968999993,2659767.0187499933,2662427.1847499926,2665162.249999993,2668029.7654999923,2670926.9972499907,2674179.2654999914,2677602.2709999913,2681003.998499993,2684410.9107499933,2687699.2917499943,2690783.102249993,2693780.1272499925
206.0,7903701.458999967,7909662.141749967,7914586.487999972,7919009.333999969,7923116.317499969,7927268.27024997,7932714.540749967,7940334.16349997,7948733.197499968,7956674.436749972,7964142.088499976,7971815.906999979,7979301.05624998,7987281.554249978,7995486.7499999795,8004089.296499977,8012780.991749972,8022537.796499974,8032806.812999974,8043011.995499978,8053232.73224998,8063097.875249983,8072349.306749979,8081340.381749977
207.0,7903701.458999967,7909662.141749967,7914586.487999972,7919009.333999969,7923116.317499969,7927268.27024997,7932714.540749967,7940334.16349997,7948733.197499968,7956674.436749972,7964142.088499976,7971815.906999979,7979301.05624998,7987281.554249978,7995486.7499999795,8004089.296499977,8012780.991749972,8022537.796499974,8032806.812999974,8043011.995499978,8053232.73224998,8063097.875249983,8072349.306749979,8081340.381749977
