0.0,0.0,1.0,2.0,3.0,4.0,5.0,6.0,7.0,8.0,9.0,10.0,11.0,12.0,13.0,14.0,15.0,16.0,17.0,18.0,19.0,20.0,21.0,22.0,23.0
0.0,1441766.3140000054,1444680.451500005,1447057.6545000055,1449164.4137500061,1451179.0045000068,1453138.823750006,1455646.8992500063,1459923.115250006,1465664.8520000058,1472631.412750006,1479242.7047500059,1485986.7815000068,1493188.0720000074,1500549.344750007,1507384.9880000062,1514297.9980000067,1520932.9980000062,1527348.4905000061,1533818.8205000048,1540017.802250005,1545755.7905000057,1551460.7515000047,1557120.9572500042,1562254.8235000034
1.0,1441766.3140000054,1444680.451500005,1447057.6545000055,1449164.4137500061,1451179.0045000068,1453138.823750006,1455646.8992500063,1459923.115250006,1465664.8520000058,1472631.412750006,1479242.7047500059,1485986.7815000068,1493188.0720000074,1500549.344750007,1507384.9880000062,1514297.9980000067,1520932.9980000062,1527348.4905000061,1533818.8205000048,1540017.802250005,1545755.7905000057,1551460.7515000047,1557120.9572500042,1562254.8235000034
2.0,4325298.942000017,4334041.354500015,4341172.963500016,4347493.241250019,4353537.01350002,4359416.471250018,4366940.697750019,4379769.345750018,4396994.556000018,4417894.238250018,4437728.114250017,4457960.34450002,4479564.216000022,4501648.034250021,4522154.964000018,4542893.9940000195,4562798.994000019,4582045.471500019,4601456.461500014,4620053.406750015,4637267.371500017,4654382.254500014,4671362.871750012,4686764.47050001
3.0,4325298.942000017,4334041.354500015,4341172.963500016,4347493.241250019,4353537.01350002,4359416.471250018,4366940.697750019,4379769.345750018,4396994.556000018,4417894.238250018,4437728.114250017,4457960.34450002,4479564.216000022,4501648.034250021,4522154.964000018,4542893.9940000195,4562798.994000019,4582045.471500019,4601456.461500014,4620053.406750015,4637267.371500017,4654382.254500014,4671362.871750012,4686764.47050001
4.0,745445.8264999986,747083.2630499987,748577.8874749987,750092.209699999,751365.5927999992,752815.9461249993,754581.825649999,757000.6071499989,759914.3696499987,762502.2706499987,765315.6311499989,768186.3241499991,771099.2956499989,774182.7186499989,777338.1113999989,780881.7951499989,784334.867899999,787741.9356499993,791130.6168999994,794242.5321499993,797297.6518999995,800197.0903499996,803041.0638749998,805546.0418750002
5.0,745445.8264999986,747083.2630499987,748577.8874749987,750092.209699999,751365.5927999992,752815.9461249993,754581.825649999,757000.6071499989,759914.3696499987,762502.2706499987,765315.6311499989,768186.3241499991,771099.2956499989,774182.7186499989,777338.1113999989,780881.7951499989,784334.867899999,787741.9356499993,791130.6168999994,794242.5321499993,797297.6518999995,800197.0903499996,803041.0638749998,805546.0418750002
6.0,2236337.4794999957,2241249.789149996,2245733.662424996,2250276.6290999968,2254096.7783999974,2258447.838374998,2263745.476949997,2271001.821449997,2279743.108949996,2287506.8119499963,2295946.8934499966,2304558.9724499974,2313297.886949997,2322548.155949997,2332014.3341999967,2342645.3854499967,2353004.603699997,2363225.806949998,2373391.8506999984,2382727.5964499977,2391892.9556999984,2400591.2710499987,2409123.191624999,2416638.125625001
7.0,2236337.4794999957,2241249.789149996,2245733.662424996,2250276.6290999968,2254096.7783999974,2258447.838374998,2263745.476949997,2271001.821449997,2279743.108949996,2287506.8119499963,2295946.8934499966,2304558.9724499974,2313297.886949997,2322548.155949997,2332014.3341999967,2342645.3854499967,2353004.603699997,2363225.806949998,2373391.8506999984,2382727.5964499977,2391892.9556999984,2400591.2710499987,2409123.191624999,2416638.125625001
8.0,5463820.03225001,5475117.7785000065,5484716.245000006,5493201.582000007,5500748.306750006,5508332.616500005,5517175.004000005,5531878.318250003,5555721.075750002,5584455.438249999,5615030.305749999,5647288.188250001,5681088.178250003,5717440.808249999,5753760.080749998,5786476.770749995,5817923.360749995,5849344.715749994,5878460.598249993,5904733.493249992,5927734.578249995,5948640.460749992,5968697.01824999,5987809.91824999
9.0,5463820.03225001,5475117.7785000065,5484716.245000006,5493201.582000007,5500748.306750006,5508332.616500005,5517175.004000005,5531878.318250003,5555721.075750002,5584455.438249999,5615030.305749999,5647288.188250001,5681088.178250003,5717440.808249999,5753760.080749998,5786476.770749995,5817923.360749995,5849344.715749994,5878460.598249993,5904733.493249992,5927734.578249995,5948640.460749992,5968697.01824999,5987809.91824999
10.0,16391460.096750032,16425353.33550002,16454148.735000018,16479604.746000022,16502244.920250017,16524997.849500015,16551525.012000017,16595634.954750009,16667163.227250006,16753366.314749997,16845090.91725,16941864.56475,17043264.534750007,17152322.424749997,17261280.242249995,17359430.312249985,17453770.082249984,17548034.14724998,17635381.79474998,17714200.479749978,17783203.734749984,17845921.382249977,17906091.054749973,17963429.75474997
11.0,16391460.096750032,16425353.33550002,16454148.735000018,16479604.746000022,16502244.920250017,16524997.849500015,16551525.012000017,16595634.954750009,16667163.227250006,16753366.314749997,16845090.91725,16941864.56475,17043264.534750007,17152322.424749997,17261280.242249995,17359430.312249985,17453770.082249984,17548034.14724998,17635381.79474998,17714200.479749978,17783203.734749984,17845921.382249977,17906091.054749973,17963429.75474997
12.0,1321695.2193000028,1324610.1793750029,1327214.425975003,1329524.0095750028,1331629.6302750031,1333874.9421750035,1336995.8502500034,1342099.5715000033,1347110.2220000033,1351999.2887500036,1357777.432000004,1362957.569250004,1368742.6992500043,1374608.726750004,1380134.1655000038,1385670.2100000032,1392021.6792500033,1398217.686000003,1404375.2012500027,1410388.6830000028,1416062.5212500035,1421221.5480000025,1426119.7602500024,1430931.9215500024
13.0,1321695.2193000028,1324610.1793750029,1327214.425975003,1329524.0095750028,1331629.6302750031,1333874.9421750035,1336995.8502500034,1342099.5715000033,1347110.2220000033,1351999.2887500036,1357777.432000004,1362957.569250004,1368742.6992500043,1374608.726750004,1380134.1655000038,1385670.2100000032,1392021.6792500033,1398217.686000003,1404375.2012500027,1410388.6830000028,1416062.5212500035,1421221.5480000025,1426119.7602500024,1430931.9215500024
14.0,3965085.6579000084,3973830.5381250083,3981643.277925009,3988572.0287250085,3994888.8908250094,4001624.82652501,4010987.55075001,4026298.71450001,4041330.66600001,4055997.8662500107,4073332.296000012,4088872.7077500117,4106228.0977500128,4123826.1802500123,4140402.4965000115,4157010.6300000097,4176065.03775001,4194653.0580000095,4213125.603750008,4231166.049000008,4248187.56375001,4263664.644000008,4278359.280750007,4292795.764650008
15.0,3965085.6579000084,3973830.5381250083,3981643.277925009,3988572.0287250085,3994888.8908250094,4001624.82652501,4010987.55075001,4026298.71450001,4041330.66600001,4055997.8662500107,4073332.296000012,4088872.7077500117,4106228.0977500128,4123826.1802500123,4140402.4965000115,4157010.6300000097,4176065.03775001,4194653.0580000095,4213125.603750008,4231166.049000008,4248187.56375001,4263664.644000008,4278359.280750007,4292795.764650008
16.0,748908.2718999941,750238.4503999946,751637.9157499948,752839.6362249948,754108.3114749952,755618.2294749949,757670.2429749948,760648.2129749948,763887.4467249952,767339.9482249952,770962.2477249956,774524.1534749956,777909.1227249952,781445.6352249957,784989.6884749957,789027.491974996,793347.539224996,797567.4782249961,802103.7337249959,806046.5529749962,809439.884974996,812283.482224996,814869.9744749963,817158.5544749962
17.0,748908.2718999941,750238.4503999946,751637.9157499948,752839.6362249948,754108.3114749952,755618.2294749949,757670.2429749948,760648.2129749948,763887.4467249952,767339.9482249952,770962.2477249956,774524.1534749956,777909.1227249952,781445.6352249957,784989.6884749957,789027.491974996,793347.539224996,797567.4782249961,802103.7337249959,806046.5529749962,809439.884974996,812283.482224996,814869.9744749963,817158.5544749962
18.0,2246724.8156999825,2250715.3511999836,2254913.747249984,2258518.9086749842,2262324.9344249857,2266854.688424985,2273010.7289249846,2281944.6389249843,2291662.3401749856,2302019.8446749854,2312886.743174987,2323572.4604249867,2333727.368174986,2344336.905674987,2354969.065424987,2367082.4759249883,2380042.6176749878,2392702.4346749885,2406311.2011749875,2418139.6589249885,2428319.654924988,2436850.4466749877,2444609.923424989,2451475.6634249883
19.0,2246724.8156999825,2250715.3511999836,2254913.747249984,2258518.9086749842,2262324.9344249857,2266854.688424985,2273010.7289249846,2281944.6389249843,2291662.3401749856,2302019.8446749854,2312886.743174987,2323572.4604249867,2333727.368174986,2344336.905674987,2354969.065424987,2367082.4759249883,2380042.6176749878,2392702.4346749885,2406311.2011749875,2418139.6589249885,2428319.654924988,2436850.4466749877,2444609.923424989,2451475.6634249883
20.0,1048121.7614999986,1050366.3402499987,1052364.9482499985,1054222.2459999986,1056015.5034999994,1057913.8764999993,1060707.473999999,1064626.1757499997,1068852.3395000002,1072870.45175,1076904.8215000003,1081085.6927500002,1085110.7637500006,1089703.8612499998,1094220.8777499998,1098710.28025,1103104.9087500004,1107588.6622500012,1112247.6847500007,1116647.9692500015,1120642.676250001,1124542.3882500012,1127981.2372500012,1131442.408500001
21.0,1048121.7614999986,1050366.3402499987,1052364.9482499985,1054222.2459999986,1056015.5034999994,1057913.8764999993,1060707.473999999,1064626.1757499997,1068852.3395000002,1072870.45175,1076904.8215000003,1081085.6927500002,1085110.7637500006,1089703.8612499998,1094220.8777499998,1098710.28025,1103104.9087500004,1107588.6622500012,1112247.6847500007,1116647.9692500015,1120642.676250001,1124542.3882500012,1127981.2372500012,1131442.408500001
22.0,3144365.284499996,3151099.0207499964,3157094.8447499955,3162666.737999996,3168046.510499998,3173741.629499998,3182122.421999997,3193878.5272499993,3206557.0185000007,3218611.35525,3230714.4645000007,3243257.0782500003,3255332.2912500016,3269111.5837499993,3282662.633249999,3296130.8407500004,3309314.726250001,3322765.986750004,3336743.054250002,3349943.9077500044,3361928.028750003,3373627.1647500037,3383943.7117500035,3394327.2255000034
23.0,3144365.284499996,3151099.0207499964,3157094.8447499955,3162666.737999996,3168046.510499998,3173741.629499998,3182122.421999997,3193878.5272499993,3206557.0185000007,3218611.35525,3230714.4645000007,3243257.0782500003,3255332.2912500016,3269111.5837499993,3282662.633249999,3296130.8407500004,3309314.726250001,3322765.986750004,3336743.054250002,3349943.9077500044,3361928.028750003,3373627.1647500037,3383943.7117500035,3394327.2255000034
24.0,682718.1467500007,684095.4822500002,685314.1825000005,686372.9925000005,687348.5375000007,688477.1965000009,690193.3577500003,692798.6465000005,695576.4370000003,698602.9285,701588.74425,704348.2637499999,707209.1845000001,709994.0614999998,713014.0322499999,715969.0947499997,719064.7282499995,722283.7412499993,725581.3839999997,728779.6475000002,731997.7480000003,734962.8152500005,737365.15325,739608.0997500002
25.0,682718.1467500007,684095.4822500002,685314.1825000005,686372.9925000005,687348.5375000007,688477.1965000009,690193.3577500003,692798.6465000005,695576.4370000003,698602.9285,701588.74425,704348.2637499999,707209.1845000001,709994.0614999998,713014.0322499999,715969.0947499997,719064.7282499995,722283.7412499993,725581.3839999997,728779.6475000002,731997.7480000003,734962.8152500005,737365.15325,739608.0997500002
26.0,2048154.4402500018,2052286.4467500006,2055942.5475000013,2059118.9775000014,2062045.6125000021,2065431.5895000026,2070580.0732500008,2078395.9395000015,2086729.3110000007,2095808.7855000002,2104766.23275,2113044.79125,2121627.5535000004,2129982.1844999995,2139042.0967499996,2147907.284249999,2157194.184749998,2166851.223749998,2176744.1519999993,2186338.942500001,2195993.244000001,2204888.4457500014,2212095.45975,2218824.2992500006
27.0,2048154.4402500018,2052286.4467500006,2055942.5475000013,2059118.9775000014,2062045.6125000021,2065431.5895000026,2070580.0732500008,2078395.9395000015,2086729.3110000007,2095808.7855000002,2104766.23275,2113044.79125,2121627.5535000004,2129982.1844999995,2139042.0967499996,2147907.284249999,2157194.184749998,2166851.223749998,2176744.1519999993,2186338.942500001,2195993.244000001,2204888.4457500014,2212095.45975,2218824.2992500006
28.0,25678056.838325065,25740079.518825065,25793423.096325062,25840034.810575068,25882529.88382507,25925870.777575072,25980803.899325076,26065824.599825073,26175509.36382507,26286931.478825077,26398419.01282508,26512170.327825088,26627837.17482509,26750053.567825098,26869102.0528251,26985598.698825102,27101990.295075104,27219386.937075105,27338262.249825105,27449565.461575106,27557636.680075105,27662204.8590751,27759938.664575096,27850677.49482509
29.0,25678056.838325065,25740079.518825065,25793423.096325062,25840034.810575068,25882529.88382507,25925870.777575072,25980803.899325076,26065824.599825073,26175509.36382507,26286931.478825077,26398419.01282508,26512170.327825088,26627837.17482509,26750053.567825098,26869102.0528251,26985598.698825102,27101990.295075104,27219386.937075105,27338262.249825105,27449565.461575106,27557636.680075105,27662204.8590751,27759938.664575096,27850677.49482509
30.0,77034170.51497519,77220238.55647519,77380269.28897518,77520104.4317252,77647589.65147522,77777612.33272521,77942411.69797523,78197473.79947522,78526528.09147522,78860794.43647523,79195257.03847525,79536510.98347527,79883511.52447528,80250160.7034753,80607306.15847531,80956796.0964753,81305970.88522531,81658160.81122531,82014786.74947532,82348696.38472532,82672910.04022531,82986614.5772253,83279815.99372528,83552032.48447527
31.0,77034170.51497519,77220238.55647519,77380269.28897518,77520104.4317252,77647589.65147522,77777612.33272521,77942411.69797523,78197473.79947522,78526528.09147522,78860794.43647523,79195257.03847525,79536510.98347527,79883511.52447528,80250160.7034753,80607306.15847531,80956796.0964753,81305970.88522531,81658160.81122531,82014786.74947532,82348696.38472532,82672910.04022531,82986614.5772253,83279815.99372528,83552032.48447527
32.0,711279.169274999,712991.697674999,714493.9511249993,715759.0801249993,716954.6043749991,718211.1501749991,719892.0224249989,722189.589674999,724844.8286749987,727355.0519249984,729732.2014249985,732044.9704249983,734440.8664249986,737142.5756749983,739989.4346749984,743115.5914249984,745887.5621749983,748843.5476749983,751860.8399249982,754945.9469249981,758358.3784249979,761581.3221749978,764457.6231749977,767180.1541749976
33.0,711279.169274999,712991.697674999,714493.9511249993,715759.0801249993,716954.6043749991,718211.1501749991,719892.0224249989,722189.589674999,724844.8286749987,727355.0519249984,729732.2014249985,732044.9704249983,734440.8664249986,737142.5756749983,739989.4346749984,743115.5914249984,745887.5621749983,748843.5476749983,751860.8399249982,754945.9469249981,758358.3784249979,761581.3221749978,764457.6231749977,767180.1541749976
34.0,2133837.507824997,2138975.093024997,2143481.853374998,2147277.2403749977,2150863.813124997,2154633.4505249974,2159676.067274997,2166568.769024997,2174534.4860249963,2182065.155774995,2189196.6042749956,2196134.9112749947,2203322.5992749957,2211427.727024995,2219968.3040249953,2229346.774274995,2237662.686524995,2246530.643024995,2255582.519774995,2264837.8407749943,2275075.1352749937,2284743.966524993,2293372.869524993,2301540.462524993
35.0,2133837.507824997,2138975.093024997,2143481.853374998,2147277.2403749977,2150863.813124997,2154633.4505249974,2159676.067274997,2166568.769024997,2174534.4860249963,2182065.155774995,2189196.6042749956,2196134.9112749947,2203322.5992749957,2211427.727024995,2219968.3040249953,2229346.774274995,2237662.686524995,2246530.643024995,2255582.519774995,2264837.8407749943,2275075.1352749937,2284743.966524993,2293372.869524993,2301540.462524993
36.0,424775.3557500002,425446.75030000013,426042.04600000015,426594.4525500001,427140.29922500014,427790.57197500014,428904.7674000001,430576.9839,432759.96690000006,434379.10390000005,435986.60115000024,437661.9504000001,439425.81215000007,441348.6868999999,443154.27964999975,444950.8426999997,446968.7664499997,448957.00244999956,451210.56719999976,452891.41419999965,454442.4414499997,455684.8913749998,456812.34549999965,457836.6422999996
37.0,424775.3557500002,425446.75030000013,426042.04600000015,426594.4525500001,427140.29922500014,427790.57197500014,428904.7674000001,430576.9839,432759.96690000006,434379.10390000005,435986.60115000024,437661.9504000001,439425.81215000007,441348.6868999999,443154.27964999975,444950.8426999997,446968.7664499997,448957.00244999956,451210.56719999976,452891.41419999965,454442.4414499997,455684.8913749998,456812.34549999965,457836.6422999996
38.0,1274326.0672500008,1276340.2509000003,1278126.1380000005,1279783.3576500004,1281420.8976750004,1283371.7159250004,1286714.3022000003,1291730.9517,1298279.9007,1303137.3117000002,1307959.8034500007,1312985.8512000004,1318277.4364500002,1324046.0606999998,1329462.8389499993,1334852.528099999,1340906.299349999,1346871.0073499987,1353631.7015999993,1358674.242599999,1363327.324349999,1367054.6741249994,1370437.036499999,1373509.926899999
39.0,1274326.0672500008,1276340.2509000003,1278126.1380000005,1279783.3576500004,1281420.8976750004,1283371.7159250004,1286714.3022000003,1291730.9517,1298279.9007,1303137.3117000002,1307959.8034500007,1312985.8512000004,1318277.4364500002,1324046.0606999998,1329462.8389499993,1334852.528099999,1340906.299349999,1346871.0073499987,1353631.7015999993,1358674.242599999,1363327.324349999,1367054.6741249994,1370437.036499999,1373509.926899999
40.0,943823.088474998,945997.3152249979,947663.9347249977,949205.6262249978,950628.6147249978,952109.2262249978,954122.5602249978,957251.0684749979,960990.1869749979,965031.4519749981,969167.3147249979,973342.8647249982,977379.2682249981,981649.3999749979,985922.2512249976,990332.6069749979,994436.3229749979,998523.0754749982,1002615.5209749981,1006572.2254749981,1010027.1242249985,1013706.0472249986,1016928.2477249986,1019848.0109749985
41.0,943823.088474998,945997.3152249979,947663.9347249977,949205.6262249978,950628.6147249978,952109.2262249978,954122.5602249978,957251.0684749979,960990.1869749979,965031.4519749981,969167.3147249979,973342.8647249982,977379.2682249981,981649.3999749979,985922.2512249976,990332.6069749979,994436.3229749979,998523.0754749982,1002615.5209749981,1006572.2254749981,1010027.1242249985,1013706.0472249986,1016928.2477249986,1019848.0109749985
42.0,2831469.265424994,2837991.945674994,2842991.804174993,2847616.8786749933,2851885.844174993,2856327.678674993,2862367.6806749934,2871753.2054249938,2882970.560924994,2895094.355924994,2907501.944174994,2920028.5941749946,2932137.804674994,2944948.1999249933,2957766.753674993,2970997.8209249936,2983308.9689249936,2995569.226424995,3007846.562924994,3019716.676424994,3030081.3726749956,3041118.141674996,3050784.7431749958,3059544.0329249953
43.0,2831469.265424994,2837991.945674994,2842991.804174993,2847616.8786749933,2851885.844174993,2856327.678674993,2862367.6806749934,2871753.2054249938,2882970.560924994,2895094.355924994,2907501.944174994,2920028.5941749946,2932137.804674994,2944948.1999249933,2957766.753674993,2970997.8209249936,2983308.9689249936,2995569.226424995,3007846.562924994,3019716.676424994,3030081.3726749956,3041118.141674996,3050784.7431749958,3059544.0329249953
44.0,883890.0916250034,885738.7493000036,887570.9981000037,889281.9781500036,890848.3953500034,892424.0034750035,894397.5773000035,897585.8661500034,901302.3221500035,904838.9114000039,908858.3884000039,912945.7874000036,917031.3691500038,921458.0014000034,925633.8534000035,930105.1389000035,934686.1011500037,938995.1301500039,943359.7054000042,947155.7956500044,950766.2491500039,954241.9581500036,957649.3239000036,960495.0954500034
45.0,883890.0916250034,885738.7493000036,887570.9981000037,889281.9781500036,890848.3953500034,892424.0034750035,894397.5773000035,897585.8661500034,901302.3221500035,904838.9114000039,908858.3884000039,912945.7874000036,917031.3691500038,921458.0014000034,925633.8534000035,930105.1389000035,934686.1011500037,938995.1301500039,943359.7054000042,947155.7956500044,950766.2491500039,954241.9581500036,957649.3239000036,960495.0954500034
46.0,2651670.2748750104,2657216.247900011,2662712.994300011,2667845.934450011,2672545.18605001,2677272.0104250107,2683192.7319000103,2692757.59845001,2703906.9664500104,2714516.734200012,2726575.165200012,2738837.362200011,2751094.107450011,2764374.0042000106,2776901.5602000104,2790315.4167000107,2804058.303450011,2816985.390450012,2830079.1162000126,2841467.386950013,2852298.747450012,2862725.8744500107,2872947.971700011,2881485.28635001
47.0,2651670.2748750104,2657216.247900011,2662712.994300011,2667845.934450011,2672545.18605001,2677272.0104250107,2683192.7319000103,2692757.59845001,2703906.9664500104,2714516.734200012,2726575.165200012,2738837.362200011,2751094.107450011,2764374.0042000106,2776901.5602000104,2790315.4167000107,2804058.303450011,2816985.390450012,2830079.1162000126,2841467.386950013,2852298.747450012,2862725.8744500107,2872947.971700011,2881485.28635001
48.0,714607.2743750022,715997.8333750023,717224.1433750022,718447.3246250026,719606.8788750028,720840.5491250023,722800.4553750026,725385.2576250026,728674.8853750033,732234.4733750034,735799.1723750036,739342.6101250038,742998.962625004,746968.3383750042,750932.8806250042,754516.7466250042,758256.5083750043,762448.0386250045,766458.8096250041,769996.3896250041,772876.3663750045,775603.6791250049,778272.5468750052,780496.5001250046
49.0,714607.2743750022,715997.8333750023,717224.1433750022,718447.3246250026,719606.8788750028,720840.5491250023,722800.4553750026,725385.2576250026,728674.8853750033,732234.4733750034,735799.1723750036,739342.6101250038,742998.962625004,746968.3383750042,750932.8806250042,754516.7466250042,758256.5083750043,762448.0386250045,766458.8096250041,769996.3896250041,772876.3663750045,775603.6791250049,778272.5468750052,780496.5001250046
50.0,2143821.8231250066,2147993.500125007,2151672.4301250065,2155341.9738750076,2158820.6366250087,2162521.647375007,2168401.3661250076,2176155.772875008,2186024.65612501,2196703.4201250104,2207397.5171250105,2218027.8303750115,2228996.887875012,2240905.015125013,2252798.641875013,2263550.2398750125,2274769.5251250127,2287344.115875013,2299376.4288750123,2309989.1688750125,2318629.0991250137,2326811.0373750147,2334817.640625016,2341489.500375014
51.0,2143821.8231250066,2147993.500125007,2151672.4301250065,2155341.9738750076,2158820.6366250087,2162521.647375007,2168401.3661250076,2176155.772875008,2186024.65612501,2196703.4201250104,2207397.5171250105,2218027.8303750115,2228996.887875012,2240905.015125013,2252798.641875013,2263550.2398750125,2274769.5251250127,2287344.115875013,2299376.4288750123,2309989.1688750125,2318629.0991250137,2326811.0373750147,2334817.640625016,2341489.500375014
52.0,829759.4287249997,831269.8892249996,832784.976725,834090.4634750002,835286.0292250003,836640.7739750001,838806.5924750003,842690.5309750002,847676.7184750005,851554.4894750006,855170.0009750009,858352.6587250009,861714.6892250014,864973.6689750017,868340.8679750017,871672.440475002,875230.3774750022,879141.0444750026,883155.0237250028,886980.3297250024,890587.1729750022,893895.1689750021,896647.2729750024,899216.5677250021
53.0,829759.4287249997,831269.8892249996,832784.976725,834090.4634750002,835286.0292250003,836640.7739750001,838806.5924750003,842690.5309750002,847676.7184750005,851554.4894750006,855170.0009750009,858352.6587250009,861714.6892250014,864973.6689750017,868340.8679750017,871672.440475002,875230.3774750022,879141.0444750026,883155.0237250028,886980.3297250024,890587.1729750022,893895.1689750021,896647.2729750024,899216.5677250021
54.0,2489278.286174999,2493809.6676749988,2498354.930175,2502271.390425001,2505858.087675001,2509922.3219250003,2516419.777425001,2528071.592925001,2543030.1554250014,2554663.468425002,2565510.002925003,2575057.9761750028,2585144.0676750042,2594921.006925005,2605022.603925005,2615017.3214250063,2625691.1324250065,2637423.1334250076,2649465.071175008,2660940.989175007,2671761.5189250065,2681685.5069250064,2689941.8189250072,2697649.7031750064
55.0,2489278.286174999,2493809.6676749988,2498354.930175,2502271.390425001,2505858.087675001,2509922.3219250003,2516419.777425001,2528071.592925001,2543030.1554250014,2554663.468425002,2565510.002925003,2575057.9761750028,2585144.0676750042,2594921.006925005,2605022.603925005,2615017.3214250063,2625691.1324250065,2637423.1334250076,2649465.071175008,2660940.989175007,2671761.5189250065,2681685.5069250064,2689941.8189250072,2697649.7031750064
56.0,2013249.362499999,2017130.3139999998,2020456.6894999999,2023488.7167499997,2026363.1707499991,2029239.6904999982,2033097.8737499977,2038991.4724999974,2046807.5764999976,2055131.9237499975,2063669.0884999973,2071807.9669999972,2080302.8929999962,2089037.9164999954,2097543.2439999953,2105943.071249996,2114125.491999993,2122312.877499992,2129998.3039999916,2137130.9317499916,2143844.82849999,2150282.241749989,2156000.38674999,2161251.084249991
57.0,2013249.362499999,2017130.3139999998,2020456.6894999999,2023488.7167499997,2026363.1707499991,2029239.6904999982,2033097.8737499977,2038991.4724999974,2046807.5764999976,2055131.9237499975,2063669.0884999973,2071807.9669999972,2080302.8929999962,2089037.9164999954,2097543.2439999953,2105943.071249996,2114125.491999993,2122312.877499992,2129998.3039999916,2137130.9317499916,2143844.82849999,2150282.241749989,2156000.38674999,2161251.084249991
58.0,6039748.087499998,6051390.942,6061370.068499999,6070466.150249999,6079089.512249997,6087719.071499994,6099293.621249993,6116974.417499992,6140422.729499993,6165395.771249993,6191007.265499992,6215423.900999991,6240908.678999988,6267113.749499986,6292629.731999986,6317829.213749988,6342376.475999979,6366938.632499976,6389994.911999974,6411392.795249974,6431534.485499971,6450846.725249967,6468001.160249969,6483753.252749973
59.0,6039748.087499998,6051390.942,6061370.068499999,6070466.150249999,6079089.512249997,6087719.071499994,6099293.621249993,6116974.417499992,6140422.729499993,6165395.771249993,6191007.265499992,6215423.900999991,6240908.678999988,6267113.749499986,6292629.731999986,6317829.213749988,6342376.475999979,6366938.632499976,6389994.911999974,6411392.795249974,6431534.485499971,6450846.725249967,6468001.160249969,6483753.252749973
60.0,771077.8247999997,772791.6420499997,774792.2377999997,776276.1575499997,777718.8762999997,778990.5755499994,780642.0285499997,783267.3767999993,786633.1767999997,790082.3665499998,793646.8805499997,796878.9067999995,800036.4487999993,803688.5757999995,807375.5940499995,811123.0725499999,814653.0015500004,818133.7208000001,822014.3783000001,825308.3150500002,828451.7285499998,831330.0842999999,834214.8678000002,836762.9003
61.0,771077.8247999997,772791.6420499997,774792.2377999997,776276.1575499997,777718.8762999997,778990.5755499994,780642.0285499997,783267.3767999993,786633.1767999997,790082.3665499998,793646.8805499997,796878.9067999995,800036.4487999993,803688.5757999995,807375.5940499995,811123.0725499999,814653.0015500004,818133.7208000001,822014.3783000001,825308.3150500002,828451.7285499998,831330.0842999999,834214.8678000002,836762.9003
62.0,2313233.4743999992,2318374.926149999,2324376.713399999,2328828.472649999,2333156.628899999,2336971.726649998,2341926.085649999,2349802.130399998,2359899.530399999,2370247.0996499993,2380940.6416499987,2390636.7203999986,2400109.346399998,2411065.7273999983,2422126.7821499985,2433369.21765,2443959.0046500014,2454401.1624000003,2466043.1349000004,2475924.9451500005,2485355.1856499994,2493990.2528999997,2502644.603400001,2510288.7009
63.0,2313233.4743999992,2318374.926149999,2324376.713399999,2328828.472649999,2333156.628899999,2336971.726649998,2341926.085649999,2349802.130399998,2359899.530399999,2370247.0996499993,2380940.6416499987,2390636.7203999986,2400109.346399998,2411065.7273999983,2422126.7821499985,2433369.21765,2443959.0046500014,2454401.1624000003,2466043.1349000004,2475924.9451500005,2485355.1856499994,2493990.2528999997,2502644.603400001,2510288.7009
64.0,452338.34095000045,453278.0797500004,454146.86620000046,454963.58905000053,455741.9750250006,456654.9500250005,457828.8862750002,459545.11102500034,461459.97827500023,463127.20402500045,464720.5110250004,466411.34852500045,468188.28627500037,469975.0837750004,471724.6427750005,473426.70252500044,475342.21977500047,477337.0225250005,479491.8937750005,481586.6150250006,483424.58152500057,485178.9362750006,486700.38027500035,488135.8657750005
65.0,452338.34095000045,453278.0797500004,454146.86620000046,454963.58905000053,455741.9750250006,456654.9500250005,457828.8862750002,459545.11102500034,461459.97827500023,463127.20402500045,464720.5110250004,466411.34852500045,468188.28627500037,469975.0837750004,471724.6427750005,473426.70252500044,475342.21977500047,477337.0225250005,479491.8937750005,481586.6150250006,483424.58152500057,485178.9362750006,486700.38027500035,488135.8657750005
66.0,1357015.0228500012,1359834.239250001,1362440.5986000013,1364890.7671500016,1367225.9250750018,1369964.8500750014,1373486.6588250005,1378635.333075001,1384379.9348250008,1389381.6120750015,1394161.5330750013,1399234.0455750013,1404564.8588250012,1409925.2513250012,1415173.9283250014,1420280.1075750012,1426026.6593250013,1432011.0675750016,1438475.6813250016,1444759.8450750017,1450273.7445750018,1455536.8088250018,1460101.140825001,1464407.5973250014
67.0,1357015.0228500012,1359834.239250001,1362440.5986000013,1364890.7671500016,1367225.9250750018,1369964.8500750014,1373486.6588250005,1378635.333075001,1384379.9348250008,1389381.6120750015,1394161.5330750013,1399234.0455750013,1404564.8588250012,1409925.2513250012,1415173.9283250014,1420280.1075750012,1426026.6593250013,1432011.0675750016,1438475.6813250016,1444759.8450750017,1450273.7445750018,1455536.8088250018,1460101.140825001,1464407.5973250014
68.0,913307.2445000006,915294.4107500007,917094.9767500007,918619.5037500006,920104.9455000004,921835.9602500001,924150.4255000004,927904.0365000007,931789.8895000005,935246.7165000004,938636.2962500001,942034.71775,945470.7319999997,949423.0747499999,952966.1994999998,956821.3074999998,960916.1014999994,964939.5689999998,969288.8615000001,973319.076,977367.3045000001,981328.7262500003,984833.0600000004,988008.6017500003
69.0,913307.2445000006,915294.4107500007,917094.9767500007,918619.5037500006,920104.9455000004,921835.9602500001,924150.4255000004,927904.0365000007,931789.8895000005,935246.7165000004,938636.2962500001,942034.71775,945470.7319999997,949423.0747499999,952966.1994999998,956821.3074999998,960916.1014999994,964939.5689999998,969288.8615000001,973319.076,977367.3045000001,981328.7262500003,984833.0600000004,988008.6017500003
70.0,2739921.733500002,2745883.232250002,2751284.930250002,2755858.511250002,2760314.836500001,2765507.8807500005,2772451.276500001,2783712.109500002,2795369.6685000015,2805740.149500001,2815908.8887500004,2826104.15325,2836412.195999999,2848269.22425,2858898.5984999994,2870463.9224999994,2882748.304499998,2894818.7069999995,2907866.5845000003,2919957.228,2932101.9135000003,2943986.178750001,2954499.180000001,2964025.8052500007
71.0,2739921.733500002,2745883.232250002,2751284.930250002,2755858.511250002,2760314.836500001,2765507.8807500005,2772451.276500001,2783712.109500002,2795369.6685000015,2805740.149500001,2815908.8887500004,2826104.15325,2836412.195999999,2848269.22425,2858898.5984999994,2870463.9224999994,2882748.304499998,2894818.7069999995,2907866.5845000003,2919957.228,2932101.9135000003,2943986.178750001,2954499.180000001,2964025.8052500007
72.0,612214.8775000003,613486.3320000005,614529.6577500002,615452.057,616472.75425,617425.4994999999,618806.27,621168.5229999998,624004.8864999998,626784.5614999997,629378.1207500001,631996.8319999998,635050.5379999998,637957.7625,640635.3572500001,643292.6470000001,646165.7752500001,649008.9155000001,651980.05225,654933.4982499996,657599.4377499997,660086.8214999996,662580.9962499996,664539.1182499995
73.0,612214.8775000003,613486.3320000005,614529.6577500002,615452.057,616472.75425,617425.4994999999,618806.27,621168.5229999998,624004.8864999998,626784.5614999997,629378.1207500001,631996.8319999998,635050.5379999998,637957.7625,640635.3572500001,643292.6470000001,646165.7752500001,649008.9155000001,651980.05225,654933.4982499996,657599.4377499997,660086.8214999996,662580.9962499996,664539.1182499995
74.0,1836644.6325000008,1840458.9960000017,1843588.9732500007,1846356.171,1849418.26275,1852276.4984999998,1856418.81,1863505.5689999994,1872014.6594999994,1880353.684499999,1888134.3622500002,1895990.4959999993,1905151.6139999996,1913873.2874999999,1921906.0717500004,1929877.9410000003,1938497.3257500003,1947026.7465000004,1955940.1567499998,1964800.4947499987,1972798.3132499992,1980260.4644999988,1987742.9887499989,1993617.3547499985
75.0,1836644.6325000008,1840458.9960000017,1843588.9732500007,1846356.171,1849418.26275,1852276.4984999998,1856418.81,1863505.5689999994,1872014.6594999994,1880353.684499999,1888134.3622500002,1895990.4959999993,1905151.6139999996,1913873.2874999999,1921906.0717500004,1929877.9410000003,1938497.3257500003,1947026.7465000004,1955940.1567499998,1964800.4947499987,1972798.3132499992,1980260.4644999988,1987742.9887499989,1993617.3547499985
76.0,3415378.190250005,3423320.3732500053,3429997.709250005,3435767.6685000043,3441056.587750006,3446187.2980000065,3452414.394750004,3462273.0705000064,3477953.3115000078,3494956.575250008,3513412.6340000103,3531880.432500011,3551742.0575000094,3571598.5075000096,3591196.2375000087,3609367.04250001,3628198.361250013,3645489.4987500114,3661759.927250012,3677591.3042500108,3692383.7707500095,3706189.04725001,3719390.20775001,3731689.435750009
77.0,3415378.190250005,3423320.3732500053,3429997.709250005,3435767.6685000043,3441056.587750006,3446187.2980000065,3452414.394750004,3462273.0705000064,3477953.3115000078,3494956.575250008,3513412.6340000103,3531880.432500011,3551742.0575000094,3571598.5075000096,3591196.2375000087,3609367.04250001,3628198.361250013,3645489.4987500114,3661759.927250012,3677591.3042500108,3692383.7707500095,3706189.04725001,3719390.20775001,3731689.435750009
78.0,10246134.570750015,10269961.119750015,10289993.127750015,10307303.005500013,10323169.763250018,10338561.89400002,10357243.184250012,10386819.211500019,10433859.934500024,10484869.725750025,10540237.90200003,10595641.297500033,10655226.17250003,10714795.522500029,10773588.712500026,10828101.127500031,10884595.08375004,10936468.496250033,10985279.781750035,11032773.912750032,11077151.31225003,11118567.14175003,11158170.62325003,11195068.307250027
79.0,10246134.570750015,10269961.119750015,10289993.127750015,10307303.005500013,10323169.763250018,10338561.89400002,10357243.184250012,10386819.211500019,10433859.934500024,10484869.725750025,10540237.90200003,10595641.297500033,10655226.17250003,10714795.522500029,10773588.712500026,10828101.127500031,10884595.08375004,10936468.496250033,10985279.781750035,11032773.912750032,11077151.31225003,11118567.14175003,11158170.62325003,11195068.307250027
80.0,600081.2094999986,601613.1089999988,602827.8587499993,603954.7194999993,604908.5192499993,605914.434249999,607311.8759999985,609142.7504999985,611714.1594999984,614371.1934999987,616963.4749999987,619542.1372499989,622475.8099999987,625282.0442499986,628517.4432499985,631453.1649999984,634237.3757499985,637284.1587499985,640239.2984999988,643198.888749999,645678.5914999988,648241.6822499991,650563.7174999991,652683.773749999
81.0,600081.2094999986,601613.1089999988,602827.8587499993,603954.7194999993,604908.5192499993,605914.434249999,607311.8759999985,609142.7504999985,611714.1594999984,614371.1934999987,616963.4749999987,619542.1372499989,622475.8099999987,625282.0442499986,628517.4432499985,631453.1649999984,634237.3757499985,637284.1587499985,640239.2984999988,643198.888749999,645678.5914999988,648241.6822499991,650563.7174999991,652683.773749999
82.0,1800243.628499996,1804839.3269999963,1808483.576249998,1811864.158499998,1814725.5577499978,1817743.302749997,1821935.6279999956,1827428.2514999954,1835142.4784999953,1843113.580499996,1850890.424999996,1858626.4117499967,1867427.429999996,1875846.132749996,1885552.3297499954,1894359.4949999952,1902712.1272499955,1911852.4762499956,1920717.8954999964,1929596.666249997,1937035.7744999966,1944725.0467499974,1951691.1524999973,1958051.321249997
83.0,1800243.628499996,1804839.3269999963,1808483.576249998,1811864.158499998,1814725.5577499978,1817743.302749997,1821935.6279999956,1827428.2514999954,1835142.4784999953,1843113.580499996,1850890.424999996,1858626.4117499967,1867427.429999996,1875846.132749996,1885552.3297499954,1894359.4949999952,1902712.1272499955,1911852.4762499956,1920717.8954999964,1929596.666249997,1937035.7744999966,1944725.0467499974,1951691.1524999973,1958051.321249997
84.0,536718.2625000012,537938.3345000012,538958.7215000013,539846.606500002,540736.3865000021,541660.7132500026,543069.4857500023,545222.4622500025,547410.6650000027,549459.6797500027,551440.8752500027,553505.9712500027,555658.4745000029,557858.3490000035,559934.9597500038,562150.0690000041,564516.723750004,566979.3720000043,569469.6642500045,571869.2387500046,574289.1872500044,576712.5480000046,578689.3630000048,580587.355500005
85.0,536718.2625000012,537938.3345000012,538958.7215000013,539846.606500002,540736.3865000021,541660.7132500026,543069.4857500023,545222.4622500025,547410.6650000027,549459.6797500027,551440.8752500027,553505.9712500027,555658.4745000029,557858.3490000035,559934.9597500038,562150.0690000041,564516.723750004,566979.3720000043,569469.6642500045,571869.2387500046,574289.1872500044,576712.5480000046,578689.3630000048,580587.355500005
86.0,1610154.7875000038,1613815.0035000034,1616876.1645000037,1619539.8195000058,1622209.1595000064,1624982.1397500078,1629208.457250007,1635667.3867500075,1642231.995000008,1648379.039250008,1654322.625750008,1660517.9137500082,1666975.4235000089,1673575.0470000105,1679804.8792500114,1686450.2070000123,1693550.1712500118,1700938.116000013,1708408.9927500132,1715607.7162500136,1722867.5617500131,1730137.6440000138,1736068.0890000144,1741762.0665000149
87.0,1610154.7875000038,1613815.0035000034,1616876.1645000037,1619539.8195000058,1622209.1595000064,1624982.1397500078,1629208.457250007,1635667.3867500075,1642231.995000008,1648379.039250008,1654322.625750008,1660517.9137500082,1666975.4235000089,1673575.0470000105,1679804.8792500114,1686450.2070000123,1693550.1712500118,1700938.116000013,1708408.9927500132,1715607.7162500136,1722867.5617500131,1730137.6440000138,1736068.0890000144,1741762.0665000149
88.0,619662.9112499972,620949.5097499974,622153.2439999977,623173.1312499981,624123.7994999979,625214.8742499978,626619.4804999979,628992.854999998,631817.4967499982,634537.215499998,637170.4134999982,639739.703249998,642646.945499998,645497.436249998,649467.0257499976,652550.1399999978,655442.4752499982,658314.3637499983,661478.0137499978,664501.6164999976,667255.5009999975,669876.4499999969,672159.9162499967,674280.0982499967
89.0,619662.9112499972,620949.5097499974,622153.2439999977,623173.1312499981,624123.7994999979,625214.8742499978,626619.4804999979,628992.854999998,631817.4967499982,634537.215499998,637170.4134999982,639739.703249998,642646.945499998,645497.436249998,649467.0257499976,652550.1399999978,655442.4752499982,658314.3637499983,661478.0137499978,664501.6164999976,667255.5009999975,669876.4499999969,672159.9162499967,674280.0982499967
90.0,1858988.7337499917,1862848.5292499922,1866459.7319999933,1869519.3937499942,1872371.3984999936,1875644.6227499933,1879858.4414999937,1886978.564999994,1895452.4902499947,1903611.6464999937,1911511.2404999945,1919219.1097499942,1927940.8364999942,1936492.3087499943,1948401.0772499926,1957650.4199999934,1966327.4257499943,1974943.091249995,1984434.0412499935,1993504.8494999926,2001766.5029999926,2009629.3499999908,2016479.7487499902,2022840.29474999
91.0,1858988.7337499917,1862848.5292499922,1866459.7319999933,1869519.3937499942,1872371.3984999936,1875644.6227499933,1879858.4414999937,1886978.564999994,1895452.4902499947,1903611.6464999937,1911511.2404999945,1919219.1097499942,1927940.8364999942,1936492.3087499943,1948401.0772499926,1957650.4199999934,1966327.4257499943,1974943.091249995,1984434.0412499935,1993504.8494999926,2001766.5029999926,2009629.3499999908,2016479.7487499902,2022840.29474999
92.0,1899943.2013999932,1904929.7463999942,1909370.9233999937,1912745.3341499937,1915958.4756499939,1919021.6056499935,1923074.2591499938,1929382.317149994,1937820.1916499936,1946655.901649994,1955459.4216499934,1964574.3728999933,1973922.230399993,1983681.3773999927,1992992.6013999926,2002325.2603999923,2011694.2838999932,2020840.5363999938,2030465.5413999932,2038744.0213999934,2046638.9538999936,2054056.7763999938,2061541.2916499944,2068158.800649995
93.0,1899943.2013999932,1904929.7463999942,1909370.9233999937,1912745.3341499937,1915958.4756499939,1919021.6056499935,1923074.2591499938,1929382.317149994,1937820.1916499936,1946655.901649994,1955459.4216499934,1964574.3728999933,1973922.230399993,1983681.3773999927,1992992.6013999926,2002325.2603999923,2011694.2838999932,2020840.5363999938,2030465.5413999932,2038744.0213999934,2046638.9538999936,2054056.7763999938,2061541.2916499944,2068158.800649995
94.0,5699829.604199979,5714789.239199983,5728112.770199981,5738236.002449981,5747875.426949982,5757064.81694998,5769222.777449981,5788146.951449982,5813460.574949981,5839967.704949982,5866378.26494998,5893723.11869998,5921766.691199979,5951044.132199978,5978977.804199978,6006975.781199977,6035082.85169998,6062521.609199981,6091396.62419998,6116232.06419998,6139916.861699981,6162170.329199981,6184623.874949983,6204476.401949985
95.0,5699829.604199979,5714789.239199983,5728112.770199981,5738236.002449981,5747875.426949982,5757064.81694998,5769222.777449981,5788146.951449982,5813460.574949981,5839967.704949982,5866378.26494998,5893723.11869998,5921766.691199979,5951044.132199978,5978977.804199978,6006975.781199977,6035082.85169998,6062521.609199981,6091396.62419998,6116232.06419998,6139916.861699981,6162170.329199981,6184623.874949983,6204476.401949985
96.0,544847.4857499986,546096.7027499987,547161.4282499987,548133.2894999988,549078.5214999988,550079.0089999986,551655.9027499987,553878.3084999986,556281.6672499984,558646.7032499985,561129.4717499986,563521.2744999984,566105.6879999986,568820.9867499986,571397.9874999985,573883.0019999989,576604.498249999,579204.898249999,581858.055249999,584476.0487499989,586655.1312499987,588722.5672499986,590496.1637499987,592124.7157499989
97.0,544847.4857499986,546096.7027499987,547161.4282499987,548133.2894999988,549078.5214999988,550079.0089999986,551655.9027499987,553878.3084999986,556281.6672499984,558646.7032499985,561129.4717499986,563521.2744999984,566105.6879999986,568820.9867499986,571397.9874999985,573883.0019999989,576604.498249999,579204.898249999,581858.055249999,584476.0487499989,586655.1312499987,588722.5672499986,590496.1637499987,592124.7157499989
98.0,1634542.4572499958,1638290.1082499959,1641484.2847499961,1644399.8684999964,1647235.5644999961,1650237.0269999956,1654967.7082499962,1661634.925499996,1668845.0017499952,1675940.1097499956,1683388.415249996,1690563.8234999953,1698317.0639999956,1706462.9602499958,1714193.9624999957,1721649.0059999968,1729813.494749997,1737614.694749997,1745574.1657499971,1753428.1462499967,1759965.393749996,1766167.7017499958,1771488.491249996,1776374.1472499967
99.0,1634542.4572499958,1638290.1082499959,1641484.2847499961,1644399.8684999964,1647235.5644999961,1650237.0269999956,1654967.7082499962,1661634.925499996,1668845.0017499952,1675940.1097499956,1683388.415249996,1690563.8234999953,1698317.0639999956,1706462.9602499958,1714193.9624999957,1721649.0059999968,1729813.494749997,1737614.694749997,1745574.1657499971,1753428.1462499967,1759965.393749996,1766167.7017499958,1771488.491249996,1776374.1472499967
100.0,1993410.4133250006,1997567.3396500007,2001443.467330001,2004722.0147550013,2007839.353830001,2011275.2676800012,2016394.7568550012,2024410.6255300012,2033735.9816050013,2041811.9620300012,2049618.478155001,2057952.6837800015,2066364.3752050013,2074800.4313050015,2083289.1736800014,2091641.830430001,2100410.7414050023,2109665.8119550026,2119804.180655002,2129594.821130003,2138383.7062050016,2146068.050130001,2153033.72903,2159253.99423
101.0,1993410.4133250006,1997567.3396500007,2001443.467330001,2004722.0147550013,2007839.353830001,2011275.2676800012,2016394.7568550012,2024410.6255300012,2033735.9816050013,2041811.9620300012,2049618.478155001,2057952.6837800015,2066364.3752050013,2074800.4313050015,2083289.1736800014,2091641.830430001,2100410.7414050023,2109665.8119550026,2119804.180655002,2129594.821130003,2138383.7062050016,2146068.050130001,2153033.72903,2159253.99423
102.0,5980231.239975002,5992702.018950002,6004330.401990003,6014166.044265004,6023518.061490003,6033825.803040003,6049184.270565003,6073231.876590004,6101207.944815004,6125435.886090004,6148855.434465003,6173858.051340004,6199093.125615004,6224401.2939150045,6249867.521040004,6274925.491290003,6301232.224215006,6328997.435865007,6359412.541965006,6388784.463390009,6415151.118615005,6438204.150390003,6459101.18709,6477761.982689999
103.0,5980231.239975002,5992702.018950002,6004330.401990003,6014166.044265004,6023518.061490003,6033825.803040003,6049184.270565003,6073231.876590004,6101207.944815004,6125435.886090004,6148855.434465003,6173858.051340004,6199093.125615004,6224401.2939150045,6249867.521040004,6274925.491290003,6301232.224215006,6328997.435865007,6359412.541965006,6388784.463390009,6415151.118615005,6438204.150390003,6459101.18709,6477761.982689999
104.0,3470320.687750016,3479748.832750016,3487809.3002500166,3495077.0152500183,3501437.3927500187,3507574.7115000198,3515138.2977500195,3527087.7677500187,3542604.1352500184,3558325.6252500173,3573399.460250018,3589850.827750018,3606550.1377500165,3623824.9602500177,3640241.5052500176,3655436.760250018,3670579.1702500186,3685800.0677500167,3700837.4852500195,3715470.41775002,3731125.2402500203,3746275.5027500214,3760622.572750024,3773384.487750025
105.0,3470320.687750016,3479748.832750016,3487809.3002500166,3495077.0152500183,3501437.3927500187,3507574.7115000198,3515138.2977500195,3527087.7677500187,3542604.1352500184,3558325.6252500173,3573399.460250018,3589850.827750018,3606550.1377500165,3623824.9602500177,3640241.5052500176,3655436.760250018,3670579.1702500186,3685800.0677500167,3700837.4852500195,3715470.41775002,3731125.2402500203,3746275.5027500214,3760622.572750024,3773384.487750025
106.0,10410962.063250048,10439246.498250049,10463427.90075005,10485231.045750055,10504312.178250056,10522724.13450006,10545414.89325006,10581263.303250056,10627812.405750055,10674976.875750052,10720198.380750054,10769552.483250054,10819650.41325005,10871474.880750053,10920724.515750052,10966310.280750055,11011737.510750055,11057400.20325005,11102512.45575006,11146411.25325006,11193375.72075006,11238826.508250065,11281867.718250072,11320153.463250075
107.0,10410962.063250048,10439246.498250049,10463427.90075005,10485231.045750055,10504312.178250056,10522724.13450006,10545414.89325006,10581263.303250056,10627812.405750055,10674976.875750052,10720198.380750054,10769552.483250054,10819650.41325005,10871474.880750053,10920724.515750052,10966310.280750055,11011737.510750055,11057400.20325005,11102512.45575006,11146411.25325006,11193375.72075006,11238826.508250065,11281867.718250072,11320153.463250075
108.0,1101898.5876500031,1104408.1736500028,1106312.193800004,1108156.480950004,1109737.4241000037,1111312.9856750034,1113608.9211750035,1117644.0424250045,1122692.0354250043,1127423.214425004,1131948.3181750036,1136689.136425004,1141391.692675004,1146481.6946750043,1151352.307425005,1156313.9346750046,1161231.036425004,1166341.1834250046,1171557.2989250042,1176590.7606750038,1181229.9599250038,1185773.9129250033,1189920.1871750033,1193459.6889250027
109.0,1101898.5876500031,1104408.1736500028,1106312.193800004,1108156.480950004,1109737.4241000037,1111312.9856750034,1113608.9211750035,1117644.0424250045,1122692.0354250043,1127423.214425004,1131948.3181750036,1136689.136425004,1141391.692675004,1146481.6946750043,1151352.307425005,1156313.9346750046,1161231.036425004,1166341.1834250046,1171557.2989250042,1176590.7606750038,1181229.9599250038,1185773.9129250033,1189920.1871750033,1193459.6889250027
110.0,3305695.7629500097,3313224.520950008,3318936.5814000117,3324469.442850012,3329212.272300011,3333938.95702501,3340826.7635250106,3352932.1272750134,3368076.1062750127,3382269.6432750123,3395844.9545250107,3410067.409275012,3424175.0780250123,3439445.0840250133,3454056.9222750147,3468941.804025014,3483693.1092750123,3499023.550275014,3514671.896775013,3529772.2820250113,3543689.8797750114,3557321.73877501,3569760.56152501,3580379.066775008
111.0,3305695.7629500097,3313224.520950008,3318936.5814000117,3324469.442850012,3329212.272300011,3333938.95702501,3340826.7635250106,3352932.1272750134,3368076.1062750127,3382269.6432750123,3395844.9545250107,3410067.409275012,3424175.0780250123,3439445.0840250133,3454056.9222750147,3468941.804025014,3483693.1092750123,3499023.550275014,3514671.896775013,3529772.2820250113,3543689.8797750114,3557321.73877501,3569760.56152501,3580379.066775008
112.0,1163732.8274999976,1166458.7987499968,1168704.0224999958,1170703.7334999957,1172543.4522499954,1174531.528249996,1176949.8097499972,1180859.0352499967,1185940.878749996,1191163.0609999967,1195510.1219999974,1199363.7762499969,1203243.8582499968,1207229.656249996,1210609.0712499956,1213664.5779999965,1216432.1954999962,1219313.1084999964,1222281.776249996,1225512.3854999952,1228503.394249995,1231582.3074999952,1234262.0647499957,1236532.2202499951
113.0,1163732.8274999976,1166458.7987499968,1168704.0224999958,1170703.7334999957,1172543.4522499954,1174531.528249996,1176949.8097499972,1180859.0352499967,1185940.878749996,1191163.0609999967,1195510.1219999974,1199363.7762499969,1203243.8582499968,1207229.656249996,1210609.0712499956,1213664.5779999965,1216432.1954999962,1219313.1084999964,1222281.776249996,1225512.3854999952,1228503.394249995,1231582.3074999952,1234262.0647499957,1236532.2202499951
114.0,3491198.4824999925,3499376.3962499904,3506112.0674999873,3512111.200499987,3517630.3567499863,3523594.5847499883,3530849.4292499917,3542577.10574999,3557822.636249988,3573489.18299999,3586530.365999992,3598091.3287499906,3609731.5747499904,3621688.968749988,3631827.213749987,3640993.7339999895,3649296.5864999886,3657939.325499989,3666845.3287499878,3676537.1564999856,3685510.182749985,3694746.9224999854,3702786.194249987,3709596.6607499854
115.0,3491198.4824999925,3499376.3962499904,3506112.0674999873,3512111.200499987,3517630.3567499863,3523594.5847499883,3530849.4292499917,3542577.10574999,3557822.636249988,3573489.18299999,3586530.365999992,3598091.3287499906,3609731.5747499904,3621688.968749988,3631827.213749987,3640993.7339999895,3649296.5864999886,3657939.325499989,3666845.3287499878,3676537.1564999856,3685510.182749985,3694746.9224999854,3702786.194249987,3709596.6607499854
116.0,1044845.4587499994,1047255.0667499995,1049282.2284999993,1051038.9077500007,1052684.0897500007,1054540.3062500008,1056700.854750001,1060408.7000000002,1064493.1515,1068534.837,1072658.489,1076372.9294999994,1080718.2779999995,1085147.4,1089667.8149999995,1093962.0437499993,1098285.3887499988,1103262.9687499988,1108128.5812499982,1113329.666249998,1117956.1162499974,1122667.7029999974,1126617.5222499967,1130207.392499996
117.0,1044845.4587499994,1047255.0667499995,1049282.2284999993,1051038.9077500007,1052684.0897500007,1054540.3062500008,1056700.854750001,1060408.7000000002,1064493.1515,1068534.837,1072658.489,1076372.9294999994,1080718.2779999995,1085147.4,1089667.8149999995,1093962.0437499993,1098285.3887499988,1103262.9687499988,1108128.5812499982,1113329.666249998,1117956.1162499974,1122667.7029999974,1126617.5222499967,1130207.392499996
118.0,3134536.3762499983,3141765.200249999,3147846.685499998,3153116.723250002,3158052.269250002,3163620.9187500025,3170102.5642500035,3181226.1000000006,3193479.4545,3205604.511,3217975.467,3229118.788499998,3242154.8339999984,3255442.1999999997,3269003.4449999984,3281886.1312499978,3294856.166249996,3309788.9062499963,3324385.743749995,3339988.9987499937,3353868.3487499924,3368003.1089999923,3379852.56674999,3390622.177499988
119.0,3134536.3762499983,3141765.200249999,3147846.685499998,3153116.723250002,3158052.269250002,3163620.9187500025,3170102.5642500035,3181226.1000000006,3193479.4545,3205604.511,3217975.467,3229118.788499998,3242154.8339999984,3255442.1999999997,3269003.4449999984,3281886.1312499978,3294856.166249996,3309788.9062499963,3324385.743749995,3339988.9987499937,3353868.3487499924,3368003.1089999923,3379852.56674999,3390622.177499988
120.0,1099567.6051999985,1101861.4286999977,1103915.4746999973,1105670.038949998,1107324.3431999984,1109075.3629499974,1111038.2941999969,1113841.4846999967,1117644.1289499963,1121426.667449997,1125105.6104499986,1128703.3646999982,1132599.4664499976,1137235.1151499965,1141884.1688999967,1145727.417099997,1149779.3375999979,1154297.745149997,1158950.3568999977,1163266.2195999974,1167218.1789749963,1170896.7608249965,1174534.0209999967,1177808.8000999962
121.0,1099567.6051999985,1101861.4286999977,1103915.4746999973,1105670.038949998,1107324.3431999984,1109075.3629499974,1111038.2941999969,1113841.4846999967,1117644.1289499963,1121426.667449997,1125105.6104499986,1128703.3646999982,1132599.4664499976,1137235.1151499965,1141884.1688999967,1145727.417099997,1149779.3375999979,1154297.745149997,1158950.3568999977,1163266.2195999974,1167218.1789749963,1170896.7608249965,1174534.0209999967,1177808.8000999962
122.0,3298702.8155999957,3305584.286099993,3311746.424099992,3317010.1168499943,3321973.0295999954,3327226.0888499925,3333114.882599991,3341524.45409999,3352932.386849989,3364280.0023499914,3375316.831349996,3386110.0940999947,3397798.399349993,3411705.3454499897,3425652.50669999,3437182.251299991,3449338.0127999936,3462893.235449991,3476851.070699993,3489798.658799992,3501654.536924989,3512690.2824749895,3523602.06299999,3533426.4002999887
123.0,3298702.8155999957,3305584.286099993,3311746.424099992,3317010.1168499943,3321973.0295999954,3327226.0888499925,3333114.882599991,3341524.45409999,3352932.386849989,3364280.0023499914,3375316.831349996,3386110.0940999947,3397798.399349993,3411705.3454499897,3425652.50669999,3437182.251299991,3449338.0127999936,3462893.235449991,3476851.070699993,3489798.658799992,3501654.536924989,3512690.2824749895,3523602.06299999,3533426.4002999887
124.0,29044901.787125032,29108580.79937503,29165001.08212505,29213836.218625043,29260097.696875043,29307269.127575047,29368059.865325056,29465787.38707506,29590942.65407507,29721167.177075062,29855057.722575065,29987805.46932507,30121894.042575076,30267529.34132508,30408389.181325074,30544309.979325067,30681143.026325073,30820800.421075072,30959877.586325064,31087788.969325062,31207870.546325058,31322071.99207506,31429019.877825066,31527432.581075057
125.0,29044901.787125032,29108580.79937503,29165001.08212505,29213836.218625043,29260097.696875043,29307269.127575047,29368059.865325056,29465787.38707506,29590942.65407507,29721167.177075062,29855057.722575065,29987805.46932507,30121894.042575076,30267529.34132508,30408389.181325074,30544309.979325067,30681143.026325073,30820800.421075072,30959877.586325064,31087788.969325062,31207870.546325058,31322071.99207506,31429019.877825066,31527432.581075057
126.0,87134705.3613751,87325742.3981251,87495003.24637514,87641508.65587513,87780293.09062514,87921807.38272515,88104179.59597516,88397362.16122517,88772827.96222521,89163501.53122519,89565173.16772519,89963416.40797521,90365682.12772523,90802588.02397524,91225167.54397522,91632929.9379752,92043429.07897522,92462401.26322521,92879632.7589752,93263366.90797518,93623611.63897517,93966215.97622518,94287059.6334752,94582297.74322517
127.0,87134705.3613751,87325742.3981251,87495003.24637514,87641508.65587513,87780293.09062514,87921807.38272515,88104179.59597516,88397362.16122517,88772827.96222521,89163501.53122519,89565173.16772519,89963416.40797521,90365682.12772523,90802588.02397524,91225167.54397522,91632929.9379752,92043429.07897522,92462401.26322521,92879632.7589752,93263366.90797518,93623611.63897517,93966215.97622518,94287059.6334752,94582297.74322517
128.0,2012873.0760000013,2018001.2057500016,2022363.940250002,2026068.6592500028,2029727.4595000024,2033282.7135000022,2037290.1470000024,2043301.4340000022,2050951.452750003,2060039.455250003,2071245.7125000034,2081427.050250004,2089641.1232500037,2101623.323250004,2110659.7617500057,2118986.017250005,2127859.762750004,2139431.2737500058,2148732.187000006,2157303.4537500064,2165234.1092500063,2173593.0975000057,2181570.8615000066,2189160.5732500064
129.0,2012873.0760000013,2018001.2057500016,2022363.940250002,2026068.6592500028,2029727.4595000024,2033282.7135000022,2037290.1470000024,2043301.4340000022,2050951.452750003,2060039.455250003,2071245.7125000034,2081427.050250004,2089641.1232500037,2101623.323250004,2110659.7617500057,2118986.017250005,2127859.762750004,2139431.2737500058,2148732.187000006,2157303.4537500064,2165234.1092500063,2173593.0975000057,2181570.8615000066,2189160.5732500064
130.0,6038619.228000004,6054003.617250005,6067091.8207500065,6078205.977750009,6089182.378500007,6099848.140500006,6111870.441000007,6129904.302000007,6152854.358250009,6180118.365750009,6213737.13750001,6244281.150750012,6268923.369750011,6304869.969750012,6331979.285250017,6356958.0517500155,6383579.288250012,6418293.821250018,6446196.561000017,6471910.361250019,6495702.327750019,6520779.292500017,6544712.58450002,6567481.719750019
131.0,6038619.228000004,6054003.617250005,6067091.8207500065,6078205.977750009,6089182.378500007,6099848.140500006,6111870.441000007,6129904.302000007,6152854.358250009,6180118.365750009,6213737.13750001,6244281.150750012,6268923.369750011,6304869.969750012,6331979.285250017,6356958.0517500155,6383579.288250012,6418293.821250018,6446196.561000017,6471910.361250019,6495702.327750019,6520779.292500017,6544712.58450002,6567481.719750019
132.0,380477.88360000035,381226.8308000002,381897.86142500007,382551.404775,383239.8897749999,383907.2659749998,384704.0171749998,386050.34342499985,387687.38892499986,389329.472175,391235.26492499997,392945.20192499994,394720.3149249997,396648.60617499956,398491.41017499944,400106.14942499937,401903.02742499934,403479.30992499966,405143.40392499976,406616.8581749998,408060.3571749999,409242.60745,410475.81244999997,411476.26444999984
133.0,380477.88360000035,381226.8308000002,381897.86142500007,382551.404775,383239.8897749999,383907.2659749998,384704.0171749998,386050.34342499985,387687.38892499986,389329.472175,391235.26492499997,392945.20192499994,394720.3149249997,396648.60617499956,398491.41017499944,400106.14942499937,401903.02742499934,403479.30992499966,405143.40392499976,406616.8581749998,408060.3571749999,409242.60745,410475.81244999997,411476.26444999984
134.0,1141433.650800001,1143680.4924000008,1145693.5842750003,1147654.214325,1149719.6693249997,1151721.7979249994,1154112.0515249996,1158151.0302749996,1163062.1667749996,1167988.416525,1173705.7947749998,1178835.6057749998,1184160.9447749993,1189945.8185249986,1195474.2305249984,1200318.448274998,1205709.082274998,1210437.929774999,1215430.2117749993,1219850.5745249996,1224181.0715249996,1227727.82235,1231427.4373499998,1234428.7933499995
135.0,1141433.650800001,1143680.4924000008,1145693.5842750003,1147654.214325,1149719.6693249997,1151721.7979249994,1154112.0515249996,1158151.0302749996,1163062.1667749996,1167988.416525,1173705.7947749998,1178835.6057749998,1184160.9447749993,1189945.8185249986,1195474.2305249984,1200318.448274998,1205709.082274998,1210437.929774999,1215430.2117749993,1219850.5745249996,1224181.0715249996,1227727.82235,1231427.4373499998,1234428.7933499995
136.0,780356.8172499972,782112.9469999974,783693.8779999972,785063.9524999973,786391.4244999974,787804.8732499972,789819.0752499972,793273.718999997,797295.4712499968,800540.6644999968,803605.2787499971,806783.9542499972,809878.7352499971,812903.2374999971,816136.2154999973,819464.3617499975,822490.2117499971,825651.5624999973,829302.6384999972,832636.8057499971,836256.5262499972,839791.6217499974,842870.0254999972,845485.1244999974
137.0,780356.8172499972,782112.9469999974,783693.8779999972,785063.9524999973,786391.4244999974,787804.8732499972,789819.0752499972,793273.718999997,797295.4712499968,800540.6644999968,803605.2787499971,806783.9542499972,809878.7352499971,812903.2374999971,816136.2154999973,819464.3617499975,822490.2117499971,825651.5624999973,829302.6384999972,832636.8057499971,836256.5262499972,839791.6217499974,842870.0254999972,845485.1244999974
138.0,2341070.4517499916,2346338.840999992,2351081.6339999917,2355191.857499992,2359174.273499992,2363414.619749991,2369457.225749992,2379821.1569999913,2391886.4137499905,2401621.9934999906,2410815.8362499913,2420351.8627499915,2429636.2057499913,2438709.7124999915,2448408.646499992,2458393.0852499926,2467470.6352499914,2476954.687499992,2487907.9154999917,2497910.4172499916,2508769.5787499915,2519374.8652499923,2528610.0764999916,2536455.3734999923
139.0,2341070.4517499916,2346338.840999992,2351081.6339999917,2355191.857499992,2359174.273499992,2363414.619749991,2369457.225749992,2379821.1569999913,2391886.4137499905,2401621.9934999906,2410815.8362499913,2420351.8627499915,2429636.2057499913,2438709.7124999915,2448408.646499992,2458393.0852499926,2467470.6352499914,2476954.687499992,2487907.9154999917,2497910.4172499916,2508769.5787499915,2519374.8652499923,2528610.0764999916,2536455.3734999923
140.0,731077.1215250005,732459.2407750008,733602.3695250006,734628.5915250002,735617.1850000002,736814.3190000004,738340.0665000003,741383.31025,745150.5475000001,749275.0237500002,753725.8654999998,758114.2479999996,762758.3944999992,767287.3294999991,772058.7754999988,776400.1627499986,780695.2734999988,784737.8742499988,788704.6422499988,792058.8942499987,794946.1547499988,797485.0917499991,799761.6287499988,801639.473999999
141.0,731077.1215250005,732459.2407750008,733602.3695250006,734628.5915250002,735617.1850000002,736814.3190000004,738340.0665000003,741383.31025,745150.5475000001,749275.0237500002,753725.8654999998,758114.2479999996,762758.3944999992,767287.3294999991,772058.7754999988,776400.1627499986,780695.2734999988,784737.8742499988,788704.6422499988,792058.8942499987,794946.1547499988,797485.0917499991,799761.6287499988,801639.473999999
142.0,2193231.3645750014,2197377.7223250023,2200807.108575002,2203885.7745750006,2206851.5550000006,2210442.9570000013,2215020.199500001,2224149.93075,2235451.6425,2247825.0712500005,2261177.5964999995,2274342.7439999986,2288275.1834999975,2301861.988499997,2316176.3264999967,2329200.4882499957,2342085.8204999967,2354213.6227499964,2366113.9267499964,2376176.682749996,2384838.4642499965,2392455.275249997,2399284.8862499963,2404918.421999997
143.0,2193231.3645750014,2197377.7223250023,2200807.108575002,2203885.7745750006,2206851.5550000006,2210442.9570000013,2215020.199500001,2224149.93075,2235451.6425,2247825.0712500005,2261177.5964999995,2274342.7439999986,2288275.1834999975,2301861.988499997,2316176.3264999967,2329200.4882499957,2342085.8204999967,2354213.6227499964,2366113.9267499964,2376176.682749996,2384838.4642499965,2392455.275249997,2399284.8862499963,2404918.421999997
144.0,3291388.8135000123,3297819.698750013,3303503.121250014,3308408.3035000116,3313026.253250013,3317777.7072500126,3323554.9180000126,3333344.9297500136,3347761.329750015,3365265.0772500155,3383573.7697500153,3402573.2522500167,3422400.302250018,3443669.184750017,3464060.1297500147,3483835.4072500165,3503269.367250018,3521728.234750018,3539215.5722500174,3554291.527250017,3568098.019750016,3580521.422250015,3592226.9497500155,3603264.672250017
145.0,3291388.8135000123,3297819.698750013,3303503.121250014,3308408.3035000116,3313026.253250013,3317777.7072500126,3323554.9180000126,3333344.9297500136,3347761.329750015,3365265.0772500155,3383573.7697500153,3402573.2522500167,3422400.302250018,3443669.184750017,3464060.1297500147,3483835.4072500165,3503269.367250018,3521728.234750018,3539215.5722500174,3554291.527250017,3568098.019750016,3580521.422250015,3592226.9497500155,3603264.672250017
146.0,9874166.440500036,9893459.096250039,9910509.36375004,9925224.910500035,9939078.759750038,9953333.121750038,9970664.754000038,10000034.78925004,10043283.989250045,10095795.231750047,10150721.309250046,10207719.756750051,10267200.906750053,10331007.55425005,10392180.389250044,10451506.221750049,10509808.101750053,10565184.704250054,10617646.716750052,10662874.58175005,10704294.059250047,10741564.266750045,10776680.849250047,10809794.01675005
147.0,9874166.440500036,9893459.096250039,9910509.36375004,9925224.910500035,9939078.759750038,9953333.121750038,9970664.754000038,10000034.78925004,10043283.989250045,10095795.231750047,10150721.309250046,10207719.756750051,10267200.906750053,10331007.55425005,10392180.389250044,10451506.221750049,10509808.101750053,10565184.704250054,10617646.716750052,10662874.58175005,10704294.059250047,10741564.266750045,10776680.849250047,10809794.01675005
148.0,693788.3192499997,695296.2389999997,696601.1437499996,697821.9427499996,698936.9969999994,700126.341499999,701678.6517499991,704193.8547499991,706782.2274999992,709116.4539999993,711726.8634999996,714007.9944999996,716829.6359999996,719588.5340000001,722113.8412500004,724614.5405000004,727445.9982500002,730737.57975,734199.8475,737274.3605000001,740406.5639999998,743232.585,745999.3335,749053.9827499997
149.0,693788.3192499997,695296.2389999997,696601.1437499996,697821.9427499996,698936.9969999994,700126.341499999,701678.6517499991,704193.8547499991,706782.2274999992,709116.4539999993,711726.8634999996,714007.9944999996,716829.6359999996,719588.5340000001,722113.8412500004,724614.5405000004,727445.9982500002,730737.57975,734199.8475,737274.3605000001,740406.5639999998,743232.585,745999.3335,749053.9827499997
150.0,2081364.9577499991,2085888.7169999992,2089803.4312499987,2093465.8282499989,2096810.990999998,2100379.024499997,2105035.9552499973,2112581.5642499975,2120346.682499998,2127349.361999998,2135180.590499999,2142023.9834999987,2150488.907999999,2158765.6020000004,2166341.523750001,2173843.6215000013,2182337.9947500005,2192212.73925,2202599.5425,2211823.0815000003,2221219.6919999993,2229697.755,2237998.0005,2247161.9482499994
151.0,2081364.9577499991,2085888.7169999992,2089803.4312499987,2093465.8282499989,2096810.990999998,2100379.024499997,2105035.9552499973,2112581.5642499975,2120346.682499998,2127349.361999998,2135180.590499999,2142023.9834999987,2150488.907999999,2158765.6020000004,2166341.523750001,2173843.6215000013,2182337.9947500005,2192212.73925,2202599.5425,2211823.0815000003,2221219.6919999993,2229697.755,2237998.0005,2247161.9482499994
152.0,2519067.217500001,2524366.1242500017,2528788.925250003,2532971.916000004,2536719.1377500053,2540407.513250005,2544689.3190000043,2551843.5852500056,2562191.832500006,2574772.6037500086,2587936.780750007,2602032.8305000057,2616290.7082500043,2630960.4575000037,2644692.2732500047,2657966.1665000045,2670464.9225000055,2682975.360250003,2695611.8455000017,2707298.8877499998,2717608.09675,2726986.3855,2736585.3525000005,2744839.6627500015
153.0,2519067.217500001,2524366.1242500017,2528788.925250003,2532971.916000004,2536719.1377500053,2540407.513250005,2544689.3190000043,2551843.5852500056,2562191.832500006,2574772.6037500086,2587936.780750007,2602032.8305000057,2616290.7082500043,2630960.4575000037,2644692.2732500047,2657966.1665000045,2670464.9225000055,2682975.360250003,2695611.8455000017,2707298.8877499998,2717608.09675,2726986.3855,2736585.3525000005,2744839.6627500015
154.0,7557201.652500004,7573098.372750005,7586366.775750009,7598915.748000012,7610157.413250016,7621222.539750015,7634067.957000013,7655530.755750017,7686575.497500018,7724317.811250025,7763810.342250021,7806098.491500017,7848872.1247500125,7892881.372500012,7934076.819750015,7973898.499500014,8011394.767500017,8048926.080750009,8086835.536500005,8121896.663249999,8152824.29025,8180959.1565,8209756.057500001,8234518.988250004
155.0,7557201.652500004,7573098.372750005,7586366.775750009,7598915.748000012,7610157.413250016,7621222.539750015,7634067.957000013,7655530.755750017,7686575.497500018,7724317.811250025,7763810.342250021,7806098.491500017,7848872.1247500125,7892881.372500012,7934076.819750015,7973898.499500014,8011394.767500017,8048926.080750009,8086835.536500005,8121896.663249999,8152824.29025,8180959.1565,8209756.057500001,8234518.988250004
156.0,1726717.7262499924,1730694.7432499926,1734273.8697499929,1737352.507749993,1740302.6599999925,1743372.2499999923,1746745.0612499923,1752509.8154999926,1761008.4934999929,1769052.5417499924,1777209.0182499927,1785782.7527499935,1794080.3132499936,1802690.860249994,1811249.4697499934,1819493.647499993,1828053.9634999929,1836804.1054999924,1846021.199749992,1854910.4424999922,1861994.236249992,1868871.0767499916,1875145.4577499924,1881234.1437499914
157.0,1726717.7262499924,1730694.7432499926,1734273.8697499929,1737352.507749993,1740302.6599999925,1743372.2499999923,1746745.0612499923,1752509.8154999926,1761008.4934999929,1769052.5417499924,1777209.0182499927,1785782.7527499935,1794080.3132499936,1802690.860249994,1811249.4697499934,1819493.647499993,1828053.9634999929,1836804.1054999924,1846021.199749992,1854910.4424999922,1861994.236249992,1868871.0767499916,1875145.4577499924,1881234.1437499914
158.0,5180153.178749977,5192084.229749978,5202821.609249978,5212057.523249978,5220907.979999977,5230116.749999977,5240235.1837499775,5257529.446499977,5283025.480499979,5307157.625249977,5331627.054749979,5357348.25824998,5382240.93974998,5408072.580749982,5433748.40924998,5458480.9424999785,5484161.890499978,5510412.316499977,5538063.599249976,5564731.327499976,5585982.708749976,5606613.230249975,5625436.373249977,5643702.431249974
159.0,5180153.178749977,5192084.229749978,5202821.609249978,5212057.523249978,5220907.979999977,5230116.749999977,5240235.1837499775,5257529.446499977,5283025.480499979,5307157.625249977,5331627.054749979,5357348.25824998,5382240.93974998,5408072.580749982,5433748.40924998,5458480.9424999785,5484161.890499978,5510412.316499977,5538063.599249976,5564731.327499976,5585982.708749976,5606613.230249975,5625436.373249977,5643702.431249974
160.0,1199432.9954999993,1202586.8632499985,1205087.9747499977,1207296.460999998,1209481.542999998,1211681.7652499976,1214257.4812499972,1218733.1007499972,1223926.4349999977,1229463.7017499974,1234648.7024999976,1239974.8592499977,1245264.7142499974,1250600.2362499975,1256623.8112499977,1262148.700249997,1267468.7527499974,1273006.7577499973,1278831.7852499965,1284219.6337499965,1289526.791249997,1294608.9537499968,1299373.5437499967,1303723.4252499964
161.0,1199432.9954999993,1202586.8632499985,1205087.9747499977,1207296.460999998,1209481.542999998,1211681.7652499976,1214257.4812499972,1218733.1007499972,1223926.4349999977,1229463.7017499974,1234648.7024999976,1239974.8592499977,1245264.7142499974,1250600.2362499975,1256623.8112499977,1262148.700249997,1267468.7527499974,1273006.7577499973,1278831.7852499965,1284219.6337499965,1289526.791249997,1294608.9537499968,1299373.5437499967,1303723.4252499964
162.0,3598298.986499998,3607760.5897499956,3615263.924249993,3621889.382999994,3628444.628999994,3635045.295749993,3642772.4437499912,3656199.3022499913,3671779.304999993,3688391.1052499926,3703946.1074999925,3719924.5777499927,3735794.142749992,3751800.708749993,3769871.4337499933,3786446.100749991,3802406.2582499925,3819020.273249992,3836495.3557499894,3852658.90124999,3868580.373749991,3883826.8612499908,3898120.6312499903,3911170.275749989
163.0,3598298.986499998,3607760.5897499956,3615263.924249993,3621889.382999994,3628444.628999994,3635045.295749993,3642772.4437499912,3656199.3022499913,3671779.304999993,3688391.1052499926,3703946.1074999925,3719924.5777499927,3735794.142749992,3751800.708749993,3769871.4337499933,3786446.100749991,3802406.2582499925,3819020.273249992,3836495.3557499894,3852658.90124999,3868580.373749991,3883826.8612499908,3898120.6312499903,3911170.275749989
164.0,912688.8818499992,915145.7370999989,917119.4608499989,918849.0313499989,920439.4403499988,922093.3485999987,924303.3033499982,927058.559349998,930146.6985999981,933429.5363499981,936503.2670999982,939436.7098499979,942729.0115999979,945998.3935999977,949280.7293499978,952601.8473499981,956400.3610999979,960589.4473499977,964715.1773499977,968540.758349998,972251.6145999982,976042.2480999979,979549.3380999976,983039.8088499978
165.0,912688.8818499992,915145.7370999989,917119.4608499989,918849.0313499989,920439.4403499988,922093.3485999987,924303.3033499982,927058.559349998,930146.6985999981,933429.5363499981,936503.2670999982,939436.7098499979,942729.0115999979,945998.3935999977,949280.7293499978,952601.8473499981,956400.3610999979,960589.4473499977,964715.1773499977,968540.758349998,972251.6145999982,976042.2480999979,979549.3380999976,983039.8088499978
166.0,2738066.6455499977,2745437.211299997,2751358.3825499965,2756547.0940499967,2761318.321049996,2766280.0457999962,2772909.9100499945,2781175.678049994,2790440.0957999947,2800288.6090499945,2809509.801299995,2818310.1295499937,2828187.0347999935,2837995.180799993,2847842.1880499935,2857805.542049994,2869201.0832999935,2881768.342049993,2894145.532049993,2905622.2750499942,2916754.843799995,2928126.744299994,2938648.014299993,2949119.4265499935
167.0,2738066.6455499977,2745437.211299997,2751358.3825499965,2756547.0940499967,2761318.321049996,2766280.0457999962,2772909.9100499945,2781175.678049994,2790440.0957999947,2800288.6090499945,2809509.801299995,2818310.1295499937,2828187.0347999935,2837995.180799993,2847842.1880499935,2857805.542049994,2869201.0832999935,2881768.342049993,2894145.532049993,2905622.2750499942,2916754.843799995,2928126.744299994,2938648.014299993,2949119.4265499935
168.0,31529691.119450074,31596730.807700075,31654098.004700072,31705175.49545008,31753414.06795008,31803006.21620008,31866484.677450087,31968020.445200082,32104888.23670008,32253504.89820009,32407653.46295009,32563405.217450093,32724043.72270009,32894131.660700098,33060127.278950103,33216814.9924501,33374129.701450095,33533044.499700096,33687982.8674501,33831119.31820013,33960331.292950116,34082198.05070011,34196818.067200094,34300647.48320009
169.0,31529691.119450074,31596730.807700075,31654098.004700072,31705175.49545008,31753414.06795008,31803006.21620008,31866484.677450087,31968020.445200082,32104888.23670008,32253504.89820009,32407653.46295009,32563405.217450093,32724043.72270009,32894131.660700098,33060127.278950103,33216814.9924501,33374129.701450095,33533044.499700096,33687982.8674501,33831119.31820013,33960331.292950116,34082198.05070011,34196818.067200094,34300647.48320009
170.0,94589073.35835022,94790192.42310023,94962294.01410022,95115526.48635024,95260242.20385024,95409018.64860024,95599454.03235026,95904061.33560024,96314664.71010023,96760514.69460027,97222960.38885027,97690215.65235028,98172131.16810027,98682394.9821003,99180381.83685032,99650444.9773503,100122389.10435028,100599133.49910028,101063948.60235031,101493357.95460038,101880993.87885034,102246594.15210034,102590454.20160028,102901942.44960026
171.0,94589073.35835022,94790192.42310023,94962294.01410022,95115526.48635024,95260242.20385024,95409018.64860024,95599454.03235026,95904061.33560024,96314664.71010023,96760514.69460027,97222960.38885027,97690215.65235028,98172131.16810027,98682394.9821003,99180381.83685032,99650444.9773503,100122389.10435028,100599133.49910028,101063948.60235031,101493357.95460038,101880993.87885034,102246594.15210034,102590454.20160028,102901942.44960026
172.0,3206655.3395000077,3215395.840000008,3222725.3882500087,3228986.66700001,3234396.2692500097,3239731.1292500095,3246378.9215000086,3256270.77150001,3269240.589000009,3282441.8940000087,3296436.1672500093,3310334.314250008,3324751.449000009,3340170.3280000114,3355224.233500011,3369691.52225001,3384396.405250011,3399261.640250012,3413955.04775001,3428608.3852500096,3442945.87275001,3457741.9577500103,3471899.592750007,3485318.9377500066
173.0,3206655.3395000077,3215395.840000008,3222725.3882500087,3228986.66700001,3234396.2692500097,3239731.1292500095,3246378.9215000086,3256270.77150001,3269240.589000009,3282441.8940000087,3296436.1672500093,3310334.314250008,3324751.449000009,3340170.3280000114,3355224.233500011,3369691.52225001,3384396.405250011,3399261.640250012,3413955.04775001,3428608.3852500096,3442945.87275001,3457741.9577500103,3471899.592750007,3485318.9377500066
174.0,9619966.018500023,9646187.520000024,9668176.164750027,9686960.00100003,9703188.80775003,9719193.38775003,9739136.764500026,9768812.31450003,9807721.767000027,9847325.682000026,9889308.501750028,9931002.942750026,9974254.347000027,10020510.984000035,10065672.700500032,10109074.566750031,10153189.215750033,10197784.920750035,10241865.14325003,10285825.155750029,10328837.61825003,10373225.87325003,10415698.77825002,10455956.81325002
175.0,9619966.018500023,9646187.520000024,9668176.164750027,9686960.00100003,9703188.80775003,9719193.38775003,9739136.764500026,9768812.31450003,9807721.767000027,9847325.682000026,9889308.501750028,9931002.942750026,9974254.347000027,10020510.984000035,10065672.700500032,10109074.566750031,10153189.215750033,10197784.920750035,10241865.14325003,10285825.155750029,10328837.61825003,10373225.87325003,10415698.77825002,10455956.81325002
176.0,1292516.492749999,1295399.4044999992,1297712.0657499991,1299752.719499998,1301743.2772499975,1303738.7249999973,1306109.7482499976,1310312.0954999975,1316761.961749998,1323831.6807499975,1330969.139999997,1338347.0149999969,1346063.9972499965,1353896.244999996,1361706.3372499964,1368711.060999997,1376090.8604999974,1382569.4479999978,1389170.450499998,1394634.107999998,1399638.2729999982,1404671.3929999978,1409350.305499998,1413553.3824999982
177.0,1292516.492749999,1295399.4044999992,1297712.0657499991,1299752.719499998,1301743.2772499975,1303738.7249999973,1306109.7482499976,1310312.0954999975,1316761.961749998,1323831.6807499975,1330969.139999997,1338347.0149999969,1346063.9972499965,1353896.244999996,1361706.3372499964,1368711.060999997,1376090.8604999974,1382569.4479999978,1389170.450499998,1394634.107999998,1399638.2729999982,1404671.3929999978,1409350.305499998,1413553.3824999982
178.0,3877549.478249997,3886198.2134999977,3893136.1972499974,3899258.1584999943,3905229.8317499924,3911216.174999992,3918329.244749993,3930936.2864999925,3950285.8852499938,3971495.0422499925,3992907.4199999915,4015041.0449999906,4038191.99174999,4061688.7349999878,4085119.0117499894,4106133.182999991,4128272.581499992,4147708.343999993,4167511.351499994,4183902.3239999935,4198914.818999995,4214014.178999994,4228050.916499994,4240660.147499994
179.0,3877549.478249997,3886198.2134999977,3893136.1972499974,3899258.1584999943,3905229.8317499924,3911216.174999992,3918329.244749993,3930936.2864999925,3950285.8852499938,3971495.0422499925,3992907.4199999915,4015041.0449999906,4038191.99174999,4061688.7349999878,4085119.0117499894,4106133.182999991,4128272.581499992,4147708.343999993,4167511.351499994,4183902.3239999935,4198914.818999995,4214014.178999994,4228050.916499994,4240660.147499994
180.0,789313.8652000041,790706.3843750042,791851.2759000042,792975.322350004,793962.2672000038,794958.3188250037,796474.5220750036,799002.7945750033,802224.3680750034,805904.3083250034,809991.9495750031,814008.4653250028,817861.9268250032,822440.4853250032,826611.5993250029,830628.883575003,834826.805325003,839106.4703250033,843013.810075003,846407.117825003,849239.0145750034,851491.8955750031,853821.1555750036,855850.7899250037
181.0,789313.8652000041,790706.3843750042,791851.2759000042,792975.322350004,793962.2672000038,794958.3188250037,796474.5220750036,799002.7945750033,802224.3680750034,805904.3083250034,809991.9495750031,814008.4653250028,817861.9268250032,822440.4853250032,826611.5993250029,830628.883575003,834826.805325003,839106.4703250033,843013.810075003,846407.117825003,849239.0145750034,851491.8955750031,853821.1555750036,855850.7899250037
182.0,2367941.595600012,2372119.1531250128,2375553.8277000124,2378925.967050012,2381886.8016000115,2384874.956475011,2389423.566225011,2397008.38372501,2406673.10422501,2417712.92497501,2429975.8487250092,2442025.3959750086,2453585.7804750097,2467321.4559750096,2479834.7979750084,2491886.650725009,2504480.415975009,2517319.4109750097,2529041.430225009,2539221.353475009,2547717.04372501,2554475.686725009,2561463.466725011,2567552.369775011
183.0,2367941.595600012,2372119.1531250128,2375553.8277000124,2378925.967050012,2381886.8016000115,2384874.956475011,2389423.566225011,2397008.38372501,2406673.10422501,2417712.92497501,2429975.8487250092,2442025.3959750086,2453585.7804750097,2467321.4559750096,2479834.7979750084,2491886.650725009,2504480.415975009,2517319.4109750097,2529041.430225009,2539221.353475009,2547717.04372501,2554475.686725009,2561463.466725011,2567552.369775011
184.0,33785861.804999985,33863830.53499998,33930476.507499985,33989601.78749999,34044129.12499999,34100278.06249999,34171703.39749999,34280632.20999999,34423599.20999999,34573720.794999994,34727490.565,34884848.365,35048260.779999994,35218534.84999999,35384435.27999999,35543429.27499999,35704053.51749998,35864609.48249997,36023266.53999998,36173860.17999998,36315797.12499997,36449773.23749997,36574944.07249997,36690179.954999976
185.0,33785861.804999985,33863830.53499998,33930476.507499985,33989601.78749999,34044129.12499999,34100278.06249999,34171703.39749999,34280632.20999999,34423599.20999999,34573720.794999994,34727490.565,34884848.365,35048260.779999994,35218534.84999999,35384435.27999999,35543429.27499999,35704053.51749998,35864609.48249997,36023266.53999998,36173860.17999998,36315797.12499997,36449773.23749997,36574944.07249997,36690179.954999976
186.0,101357585.41499996,101591491.60499994,101791429.52249995,101968805.36249995,102132387.37499997,102300834.18749997,102515110.19249998,102841896.62999998,103270797.62999998,103721162.38499999,104182471.695,104654545.095,105144782.33999997,105655604.54999995,106153305.83999996,106630287.82499997,107112160.55249995,107593828.44749992,108069799.61999993,108521580.53999993,108947391.37499991,109349319.7124999,109724832.21749991,110070539.86499992
187.0,101357585.41499996,101591491.60499994,101791429.52249995,101968805.36249995,102132387.37499997,102300834.18749997,102515110.19249998,102841896.62999998,103270797.62999998,103721162.38499999,104182471.695,104654545.095,105144782.33999997,105655604.54999995,106153305.83999996,106630287.82499997,107112160.55249995,107593828.44749992,108069799.61999993,108521580.53999993,108947391.37499991,109349319.7124999,109724832.21749991,110070539.86499992
188.0,897302.9252499961,899638.7139999961,901557.110499996,903295.9429999959,904926.389999996,906572.0134999957,908530.0787499956,911711.2967499958,915421.5327499958,919027.6827499961,922591.4352499963,926303.0702499963,930289.159499996,934009.2594999959,937587.1944999961,941221.646999996,944984.2469999958,948488.514499996,952310.7519999958,955847.3259999957,959497.7664999958,963036.7254999959,966260.7247499957,969126.2977499961
189.0,897302.9252499961,899638.7139999961,901557.110499996,903295.9429999959,904926.389999996,906572.0134999957,908530.0787499956,911711.2967499958,915421.5327499958,919027.6827499961,922591.4352499963,926303.0702499963,930289.159499996,934009.2594999959,937587.1944999961,941221.646999996,944984.2469999958,948488.514499996,952310.7519999958,955847.3259999957,959497.7664999958,963036.7254999959,966260.7247499957,969126.2977499961
190.0,2691908.7757499884,2698916.1419999884,2704671.331499988,2709887.828999988,2714779.1699999883,2719716.040499987,2725590.2362499866,2735133.890249987,2746264.5982499877,2757083.0482499884,2767774.3057499886,2778909.210749989,2790867.478499988,2802027.7784999874,2812761.5834999885,2823664.940999988,2834952.7409999873,2845465.543499988,2856932.2559999875,2867541.977999987,2878493.2994999876,2889110.1764999875,2898782.174249987,2907378.893249988
191.0,2691908.7757499884,2698916.1419999884,2704671.331499988,2709887.828999988,2714779.1699999883,2719716.040499987,2725590.2362499866,2735133.890249987,2746264.5982499877,2757083.0482499884,2767774.3057499886,2778909.210749989,2790867.478499988,2802027.7784999874,2812761.5834999885,2823664.940999988,2834952.7409999873,2845465.543499988,2856932.2559999875,2867541.977999987,2878493.2994999876,2889110.1764999875,2898782.174249987,2907378.893249988
192.0,251055.38530000075,251362.5107250008,251615.71832500075,251872.8516250007,252123.06097500076,252416.2771500008,252919.23597500077,253739.61325000078,254742.14587500074,255705.36837500075,256642.13180000073,257567.6266000007,258436.35380000065,259529.4498750007,260563.00205000062,261507.3404250006,262519.2579750005,263508.8097250004,264565.55172500043,265415.4690000004,266171.48400000023,266765.96220000024,267289.65890000015,267809.58570000005
193.0,251055.38530000075,251362.5107250008,251615.71832500075,251872.8516250007,252123.06097500076,252416.2771500008,252919.23597500077,253739.61325000078,254742.14587500074,255705.36837500075,256642.13180000073,257567.6266000007,258436.35380000065,259529.4498750007,260563.00205000062,261507.3404250006,262519.2579750005,263508.8097250004,264565.55172500043,265415.4690000004,266171.48400000023,266765.96220000024,267289.65890000015,267809.58570000005
194.0,753166.1559000022,754087.5321750024,754847.1549750023,755618.5548750021,756369.1829250023,757248.8314500024,758757.7079250023,761218.8397500024,764226.4376250022,767116.1051250022,769926.3954000021,772702.8798000021,775309.061400002,778588.3496250021,781689.0061500019,784522.0212750018,787557.7739250015,790526.4291750012,793696.6551750014,796246.4070000012,798514.4520000007,800297.8866000008,801868.9767000005,803428.7571000002
195.0,753166.1559000022,754087.5321750024,754847.1549750023,755618.5548750021,756369.1829250023,757248.8314500024,758757.7079250023,761218.8397500024,764226.4376250022,767116.1051250022,769926.3954000021,772702.8798000021,775309.061400002,778588.3496250021,781689.0061500019,784522.0212750018,787557.7739250015,790526.4291750012,793696.6551750014,796246.4070000012,798514.4520000007,800297.8866000008,801868.9767000005,803428.7571000002
196.0,435753.2684499995,436849.2655999995,437609.70419999934,438293.70017499937,438932.44574999926,439884.94917499914,440993.5758749992,442522.7488749991,444689.76287499926,446675.65612499916,448774.3141249991,451184.664874999,453261.33062499895,455590.40612499905,457871.9671249991,460149.51962499914,462429.86512499925,464545.47862499923,466505.5331249991,468374.79262499925,470046.83787499927,471783.08962499927,473559.1993749993,474961.82062499935
197.0,435753.2684499995,436849.2655999995,437609.70419999934,438293.70017499937,438932.44574999926,439884.94917499914,440993.5758749992,442522.7488749991,444689.76287499926,446675.65612499916,448774.3141249991,451184.664874999,453261.33062499895,455590.40612499905,457871.9671249991,460149.51962499914,462429.86512499925,464545.47862499923,466505.5331249991,468374.79262499925,470046.83787499927,471783.08962499927,473559.1993749993,474961.82062499935
198.0,1307259.8053499986,1310547.7967999985,1312829.112599998,1314881.100524998,1316797.3372499978,1319654.8475249973,1322980.7276249977,1327568.2466249974,1334069.2886249977,1340026.9683749974,1346322.9423749973,1353553.994624997,1359783.9918749968,1366771.2183749971,1373615.9013749973,1380448.5588749973,1387289.5953749977,1393636.4358749976,1399516.5993749972,1405124.3778749977,1410140.5136249978,1415349.2688749977,1420677.598124998,1424885.4618749982
199.0,1307259.8053499986,1310547.7967999985,1312829.112599998,1314881.100524998,1316797.3372499978,1319654.8475249973,1322980.7276249977,1327568.2466249974,1334069.2886249977,1340026.9683749974,1346322.9423749973,1353553.994624997,1359783.9918749968,1366771.2183749971,1373615.9013749973,1380448.5588749973,1387289.5953749977,1393636.4358749976,1399516.5993749972,1405124.3778749977,1410140.5136249978,1415349.2688749977,1420677.598124998,1424885.4618749982
200.0,739133.443824996,741025.8788749955,742217.603424996,743132.4871999962,744088.1041999961,744951.5289999958,746110.6912749959,748095.007874996,750824.5566249964,754450.1763749963,757741.1511249967,761724.716624997,765810.5186249968,769740.5536249971,773498.8201249971,777106.1096249964,780825.1858749964,784598.4111249963,788610.1186249966,791984.6806249964,795664.0473749968,799149.6481249967,802396.5129249962,805672.1274999959
201.0,739133.443824996,741025.8788749955,742217.603424996,743132.4871999962,744088.1041999961,744951.5289999958,746110.6912749959,748095.007874996,750824.5566249964,754450.1763749963,757741.1511249967,761724.716624997,765810.5186249968,769740.5536249971,773498.8201249971,777106.1096249964,780825.1858749964,784598.4111249963,788610.1186249966,791984.6806249964,795664.0473749968,799149.6481249967,802396.5129249962,805672.1274999959
202.0,2217400.331474988,2223077.6366249863,2226652.810274988,2229397.461599989,2232264.312599988,2234854.5869999873,2238332.0738249877,2244285.0236249883,2252473.669874989,2263350.529124989,2273223.4533749903,2285174.149874991,2297431.5558749903,2309221.6608749917,2320496.4603749914,2331318.3288749894,2342475.557624989,2353795.2333749887,2365830.35587499,2375954.0418749894,2386992.1421249905,2397448.94437499,2407189.5387749886,2417016.3824999877
203.0,2217400.331474988,2223077.6366249863,2226652.810274988,2229397.461599989,2232264.312599988,2234854.5869999873,2238332.0738249877,2244285.0236249883,2252473.669874989,2263350.529124989,2273223.4533749903,2285174.149874991,2297431.5558749903,2309221.6608749917,2320496.4603749914,2331318.3288749894,2342475.557624989,2353795.2333749887,2365830.35587499,2375954.0418749894,2386992.1421249905,2397448.94437499,2407189.5387749886,2417016.3824999877
204.0,802074.6829999959,803965.825749996,805749.2382499959,807277.769499996,808876.5079999957,810302.4627499961,812393.9764999961,815243.5022499963,818348.6707499964,821377.9559999965,824163.9389999963,826999.8202499963,830071.8277499966,833811.7127499967,836965.4352499966,840090.5844999965,843313.8912499965,847069.4939999962,850687.7637499962,854273.2197499963,858070.2967499965,861787.7857499961,865335.6299999962,868341.5769999962
205.0,802074.6829999959,803965.825749996,805749.2382499959,807277.769499996,808876.5079999957,810302.4627499961,812393.9764999961,815243.5022499963,818348.6707499964,821377.9559999965,824163.9389999963,826999.8202499963,830071.8277499966,833811.7127499967,836965.4352499966,840090.5844999965,843313.8912499965,847069.4939999962,850687.7637499962,854273.2197499963,858070.2967499965,861787.7857499961,865335.6299999962,868341.5769999962
206.0,2406224.0489999875,2411897.477249988,2417247.7147499877,2421833.308499988,2426629.523999987,2430907.388249988,2437181.9294999884,2445730.506749989,2455046.0122499894,2464133.8679999895,2472491.8169999886,2480999.460749989,2490215.48324999,2501435.13824999,2510896.30574999,2520271.7534999894,2529941.6737499894,2541208.4819999887,2552063.2912499886,2562819.659249989,2574210.8902499895,2585363.3572499882,2596006.8899999885,2605024.7309999885
207.0,2406224.0489999875,2411897.477249988,2417247.7147499877,2421833.308499988,2426629.523999987,2430907.388249988,2437181.9294999884,2445730.506749989,2455046.0122499894,2464133.8679999895,2472491.8169999886,2480999.460749989,2490215.48324999,2501435.13824999,2510896.30574999,2520271.7534999894,2529941.6737499894,2541208.4819999887,2552063.2912499886,2562819.659249989,2574210.8902499895,2585363.3572499882,2596006.8899999885,2605024.7309999885
