0.0,0.0,1.0,2.0,3.0,4.0,5.0,6.0,7.0,8.0,9.0,10.0,11.0,12.0,13.0,14.0,15.0,16.0,17.0,18.0,19.0,20.0,21.0,22.0,23.0
0.0,4101000.128400042,4105339.441150043,4107979.822400041,4110154.089150042,4112193.9731500405,4114168.884150041,4116553.23490004,4120388.85865004,4125683.8836500407,4131308.82565004,4137486.089150042,4143595.295900041,4150087.4246500414,4156623.725400041,4163039.2214000393,4169051.7414000407,4174976.665650041,4181111.6414000397,4187263.878900041,4193090.9936500443,4198725.603400042,4204040.7624000395,4209285.598650038,4213604.266650039
1.0,4101000.128400042,4105339.441150043,4107979.822400041,4110154.089150042,4112193.9731500405,4114168.884150041,4116553.23490004,4120388.85865004,4125683.8836500407,4131308.82565004,4137486.089150042,4143595.295900041,4150087.4246500414,4156623.725400041,4163039.2214000393,4169051.7414000407,4174976.665650041,4181111.6414000397,4187263.878900041,4193090.9936500443,4198725.603400042,4204040.7624000395,4209285.598650038,4213604.266650039
2.0,12303000.385200126,12316018.32345013,12323939.467200123,12330462.267450126,12336581.919450121,12342506.652450122,12349659.70470012,12361166.57595012,12377051.650950123,12393926.47695012,12412458.267450126,12430785.887700122,12450262.273950124,12469871.176200122,12489117.664200118,12507155.224200122,12524929.996950123,12543334.92420012,12561791.636700124,12579272.980950132,12596176.810200127,12612122.28720012,12627856.795950115,12640812.799950115
3.0,12303000.385200126,12316018.32345013,12323939.467200123,12330462.267450126,12336581.919450121,12342506.652450122,12349659.70470012,12361166.57595012,12377051.650950123,12393926.47695012,12412458.267450126,12430785.887700122,12450262.273950124,12469871.176200122,12489117.664200118,12507155.224200122,12524929.996950123,12543334.92420012,12561791.636700124,12579272.980950132,12596176.810200127,12612122.28720012,12627856.795950115,12640812.799950115
4.0,2093277.3143000067,2094845.1946250068,2096243.5840750067,2097572.5754750073,2098836.5640500067,2100184.780550007,2102008.1063250075,2104465.169825007,2107144.4688250073,2109606.626575008,2112385.573825008,2114734.7468250073,2117394.8830750072,2120117.1815750073,2122714.5633250074,2125461.2695750063,2128269.4598250063,2131131.4463250064,2133914.0520750065,2136576.285825007,2139471.922325007,2141975.141325009,2144363.353050008,2146594.7502000094
5.0,2093277.3143000067,2094845.1946250068,2096243.5840750067,2097572.5754750073,2098836.5640500067,2100184.780550007,2102008.1063250075,2104465.169825007,2107144.4688250073,2109606.626575008,2112385.573825008,2114734.7468250073,2117394.8830750072,2120117.1815750073,2122714.5633250074,2125461.2695750063,2128269.4598250063,2131131.4463250064,2133914.0520750065,2136576.285825007,2139471.922325007,2141975.141325009,2144363.353050008,2146594.7502000094
6.0,6279831.942900021,6284535.58387502,6288730.75222502,6292717.726425022,6296509.69215002,6300554.34165002,6306024.318975022,6313395.509475022,6321433.406475022,6328819.879725024,6337156.721475024,6344204.240475021,6352184.649225022,6360351.544725021,6368143.689975022,6376383.808725019,6384808.379475019,6393394.33897502,6401742.15622502,6409728.857475022,6418415.766975021,6425925.423975027,6433090.059150023,6439784.250600029
7.0,6279831.942900021,6284535.58387502,6288730.75222502,6292717.726425022,6296509.69215002,6300554.34165002,6306024.318975022,6313395.509475022,6321433.406475022,6328819.879725024,6337156.721475024,6344204.240475021,6352184.649225022,6360351.544725021,6368143.689975022,6376383.808725019,6384808.379475019,6393394.33897502,6401742.15622502,6409728.857475022,6418415.766975021,6425925.423975027,6433090.059150023,6439784.250600029
8.0,16056620.291500203,16067264.160500202,16076229.785000209,16084224.179000197,16091433.6542502,16098579.4972502,16106578.506000198,16119521.984750202,16139649.692250207,16164059.783250205,16191464.992750205,16218214.982250206,16245302.981750201,16273880.269500203,16303356.264750196,16331576.08725019,16358700.177250186,16385125.799750185,16410500.069000188,16432813.733500186,16451992.19650019,16468991.10500019,16485260.646000203,16500253.304500205
9.0,16056620.291500203,16067264.160500202,16076229.785000209,16084224.179000197,16091433.6542502,16098579.4972502,16106578.506000198,16119521.984750202,16139649.692250207,16164059.783250205,16191464.992750205,16218214.982250206,16245302.981750201,16273880.269500203,16303356.264750196,16331576.08725019,16358700.177250186,16385125.799750185,16410500.069000188,16432813.733500186,16451992.19650019,16468991.10500019,16485260.646000203,16500253.304500205
10.0,48169860.87450061,48201792.48150061,48228689.35500063,48252672.53700059,48274300.9627506,48295738.4917506,48319735.518000595,48358565.954250604,48418949.07675062,48492179.349750616,48574394.978250615,48654644.94675062,48735908.9452506,48821640.80850061,48910068.794250585,48994728.26175057,49076100.53175056,49155377.39925055,49231500.20700057,49298441.20050056,49355976.58950057,49406973.31500057,49455781.938000605,49500759.913500614
11.0,48169860.87450061,48201792.48150061,48228689.35500063,48252672.53700059,48274300.9627506,48295738.4917506,48319735.518000595,48358565.954250604,48418949.07675062,48492179.349750616,48574394.978250615,48654644.94675062,48735908.9452506,48821640.80850061,48910068.794250585,48994728.26175057,49076100.53175056,49155377.39925055,49231500.20700057,49298441.20050056,49355976.58950057,49406973.31500057,49455781.938000605,49500759.913500614
12.0,3795223.231175006,3798149.4403000055,3800758.2302000048,3802957.9425250045,3805175.996450004,3807441.692800005,3810681.5640500057,3815301.057450005,3820215.638950005,3825180.2954500043,3830255.9489500057,3835332.7034500064,3840589.4177000057,3846475.8057000055,3851822.4782000063,3857264.708950006,3862949.3399500074,3868912.9627000075,3874708.3817000077,3880362.568950007,3885658.496450006,3890775.2144250064,3895456.9559250064,3899872.297725007
13.0,3795223.231175006,3798149.4403000055,3800758.2302000048,3802957.9425250045,3805175.996450004,3807441.692800005,3810681.5640500057,3815301.057450005,3820215.638950005,3825180.2954500043,3830255.9489500057,3835332.7034500064,3840589.4177000057,3846475.8057000055,3851822.4782000063,3857264.708950006,3862949.3399500074,3868912.9627000075,3874708.3817000077,3880362.568950007,3885658.496450006,3890775.2144250064,3895456.9559250064,3899872.297725007
14.0,11385669.693525018,11394448.320900016,11402274.690600015,11408873.827575013,11415527.989350013,11422325.078400016,11432044.692150017,11445903.172350015,11460646.916850016,11475540.886350013,11490767.846850017,11505998.11035002,11521768.253100017,11539427.417100016,11555467.434600018,11571794.126850018,11588848.019850023,11606738.888100022,11624125.145100024,11641087.706850022,11656975.489350017,11672325.643275019,11686370.86777502,11699616.89317502
15.0,11385669.693525018,11394448.320900016,11402274.690600015,11408873.827575013,11415527.989350013,11422325.078400016,11432044.692150017,11445903.172350015,11460646.916850016,11475540.886350013,11490767.846850017,11505998.11035002,11521768.253100017,11539427.417100016,11555467.434600018,11571794.126850018,11588848.019850023,11606738.888100022,11624125.145100024,11641087.706850022,11656975.489350017,11672325.643275019,11686370.86777502,11699616.89317502
16.0,2173330.1101000034,2174624.196350005,2175943.672600003,2177036.2816000027,2178135.881850003,2179574.6816000026,2181636.9813500014,2184286.5481000002,2187561.720850001,2190980.3431000034,2194345.3413500036,2197842.9463500045,2201446.0631000055,2205062.761850005,2208810.6551000057,2212683.8391000065,2216499.6041000052,2220545.5186000043,2224158.753100006,2227623.732100007,2230577.866350007,2233168.805850008,2235496.024100008,2237491.908100007
17.0,2173330.1101000034,2174624.196350005,2175943.672600003,2177036.2816000027,2178135.881850003,2179574.6816000026,2181636.9813500014,2184286.5481000002,2187561.720850001,2190980.3431000034,2194345.3413500036,2197842.9463500045,2201446.0631000055,2205062.761850005,2208810.6551000057,2212683.8391000065,2216499.6041000052,2220545.5186000043,2224158.753100006,2227623.732100007,2230577.866350007,2233168.805850008,2235496.024100008,2237491.908100007
18.0,6519990.330300011,6523872.589050015,6527831.017800009,6531108.844800008,6534407.645550009,6538724.044800008,6544910.944050005,6552859.644300001,6562685.162550003,6572941.02930001,6583036.02405001,6593528.839050014,6604338.1893000165,6615188.285550015,6626431.965300017,6638051.517300019,6649498.812300015,6661636.555800013,6672476.259300018,6682871.196300021,6691733.599050021,6699506.417550024,6706488.072300024,6712475.724300021
19.0,6519990.330300011,6523872.589050015,6527831.017800009,6531108.844800008,6534407.645550009,6538724.044800008,6544910.944050005,6552859.644300001,6562685.162550003,6572941.02930001,6583036.02405001,6593528.839050014,6604338.1893000165,6615188.285550015,6626431.965300017,6638051.517300019,6649498.812300015,6661636.555800013,6672476.259300018,6682871.196300021,6691733.599050021,6699506.417550024,6706488.072300024,6712475.724300021
20.0,2937448.8382500093,2940069.154250008,2942027.7975000064,2943831.143500006,2945596.0812500063,2947466.3570000073,2949976.431500007,2953582.499250007,2957813.6712500066,2961767.3747500055,2965840.5662500043,2969458.7187500037,2973061.957500005,2976838.229750006,2980841.0750000067,2984664.3917500065,2988496.278250006,2992604.5082500046,2996880.349000003,3001068.9422500026,3004872.8202500036,3008486.9800000056,3012021.671250007,3015425.324000008
21.0,2937448.8382500093,2940069.154250008,2942027.7975000064,2943831.143500006,2945596.0812500063,2947466.3570000073,2949976.431500007,2953582.499250007,2957813.6712500066,2961767.3747500055,2965840.5662500043,2969458.7187500037,2973061.957500005,2976838.229750006,2980841.0750000067,2984664.3917500065,2988496.278250006,2992604.5082500046,2996880.349000003,3001068.9422500026,3004872.8202500036,3008486.9800000056,3012021.671250007,3015425.324000008
22.0,8812346.514750028,8820207.462750025,8826083.392500019,8831493.430500017,8836788.243750019,8842399.071000021,8849929.294500021,8860747.497750022,8873441.01375002,8885302.124250017,8897521.698750013,8908376.156250011,8919185.872500015,8930514.689250018,8942523.22500002,8953993.17525002,8965488.834750019,8977813.524750013,8990641.04700001,9003206.826750008,9014618.46075001,9025460.940000016,9036065.01375002,9046275.972000023
23.0,8812346.514750028,8820207.462750025,8826083.392500019,8831493.430500017,8836788.243750019,8842399.071000021,8849929.294500021,8860747.497750022,8873441.01375002,8885302.124250017,8897521.698750013,8908376.156250011,8919185.872500015,8930514.689250018,8942523.22500002,8953993.17525002,8965488.834750019,8977813.524750013,8990641.04700001,9003206.826750008,9014618.46075001,9025460.940000016,9036065.01375002,9046275.972000023
24.0,1928246.7372499907,1929927.098749991,1931139.2129999916,1932218.3734999916,1933211.7354999918,1934358.9427499908,1935848.502999991,1938091.476749991,1940793.093249991,1943159.2764999908,1945531.9392499907,1947943.26499999,1950310.92074999,1953119.8439999889,1955835.4524999892,1958673.9839999892,1961375.9707499892,1964191.9682499892,1967151.0567499888,1969995.2439999892,1973044.0484999893,1975548.9332499893,1977723.8222499886,1979929.6142499885
25.0,1928246.7372499907,1929927.098749991,1931139.2129999916,1932218.3734999916,1933211.7354999918,1934358.9427499908,1935848.502999991,1938091.476749991,1940793.093249991,1943159.2764999908,1945531.9392499907,1947943.26499999,1950310.92074999,1953119.8439999889,1955835.4524999892,1958673.9839999892,1961375.9707499892,1964191.9682499892,1967151.0567499888,1969995.2439999892,1973044.0484999893,1975548.9332499893,1977723.8222499886,1979929.6142499885
26.0,5784740.211749972,5789781.296249973,5793417.638999974,5796655.120499975,5799635.206499975,5803076.828249972,5807545.508999973,5814274.430249973,5822379.279749973,5829477.829499973,5836595.817749972,5843829.79499997,5850932.76224997,5859359.531999966,5867506.357499967,5876021.951999968,5884127.912249967,5892575.904749967,5901453.170249967,5909985.731999967,5919132.145499968,5926646.799749968,5933171.466749966,5939788.842749965
27.0,5784740.211749972,5789781.296249973,5793417.638999974,5796655.120499975,5799635.206499975,5803076.828249972,5807545.508999973,5814274.430249973,5822379.279749973,5829477.829499973,5836595.817749972,5843829.79499997,5850932.76224997,5859359.531999966,5867506.357499967,5876021.951999968,5884127.912249967,5892575.904749967,5901453.170249967,5909985.731999967,5919132.145499968,5926646.799749968,5933171.466749966,5939788.842749965
28.0,71234875.24440032,71294150.54115035,71342312.79762532,71385015.52212533,71424971.67587535,71464752.54922535,71513804.68897533,71587630.89872533,71679205.17897533,71774457.73447533,71871915.18247534,71966850.81572536,72065236.52297536,72166955.04047534,72269847.41747534,72370144.62997532,72470012.86922534,72571352.0834753,72674721.79322533,72775551.08847532,72872097.8169753,72963538.87197529,73050847.75797527,73132314.41597524
29.0,71234875.24440032,71294150.54115035,71342312.79762532,71385015.52212533,71424971.67587535,71464752.54922535,71513804.68897533,71587630.89872533,71679205.17897533,71774457.73447533,71871915.18247534,71966850.81572536,72065236.52297536,72166955.04047534,72269847.41747534,72370144.62997532,72470012.86922534,72571352.0834753,72674721.79322533,72775551.08847532,72872097.8169753,72963538.87197529,73050847.75797527,73132314.41597524
30.0,213704625.73320097,213882451.62345105,214026938.39287597,214155046.566376,214274915.02762604,214394257.64767605,214541414.066926,214762892.696176,215037615.53692597,215323373.203426,215615745.54742604,215900552.44717607,216195709.56892607,216500865.12142602,216809542.25242603,217110433.88992596,217410038.60767603,217714056.25042593,218024165.37967598,218326653.26542595,218616293.4509259,218890616.61592585,219152543.27392578,219396943.24792573
31.0,213704625.73320097,213882451.62345105,214026938.39287597,214155046.566376,214274915.02762604,214394257.64767605,214541414.066926,214762892.696176,215037615.53692597,215323373.203426,215615745.54742604,215900552.44717607,216195709.56892607,216500865.12142602,216809542.25242603,217110433.88992596,217410038.60767603,217714056.25042593,218024165.37967598,218326653.26542595,218616293.4509259,218890616.61592585,219152543.27392578,219396943.24792573
32.0,1941941.906675015,1943546.047675015,1944910.865175015,1946138.7468500151,1947325.4517750149,1948569.4342750155,1950111.555775016,1952407.2232750163,1954775.7207750157,1957156.6147750162,1959281.9510250157,1961355.0797750156,1963334.7142750155,1965480.201775016,1967838.9937750155,1970243.410275015,1972805.5372750151,1975392.982025015,1978097.952275015,1980744.0987750152,1983652.5560250152,1986468.387025015,1989107.4597750152,1991483.8445250152
33.0,1941941.906675015,1943546.047675015,1944910.865175015,1946138.7468500151,1947325.4517750149,1948569.4342750155,1950111.555775016,1952407.2232750163,1954775.7207750157,1957156.6147750162,1959281.9510250157,1961355.0797750156,1963334.7142750155,1965480.201775016,1967838.9937750155,1970243.410275015,1972805.5372750151,1975392.982025015,1978097.952275015,1980744.0987750152,1983652.5560250152,1986468.387025015,1989107.4597750152,1991483.8445250152
34.0,5825825.720025046,5830638.143025044,5834732.595525045,5838416.240550045,5841976.355325045,5845708.302825047,5850334.667325048,5857221.669825049,5864327.162325047,5871469.844325049,5877845.853075047,5884065.239325047,5890004.142825047,5896440.605325048,5903516.981325046,5910730.230825045,5918416.611825045,5926178.946075045,5934293.856825044,5942232.296325046,5950957.668075046,5959405.161075044,5967322.379325045,5974451.533575046
35.0,5825825.720025046,5830638.143025044,5834732.595525045,5838416.240550045,5841976.355325045,5845708.302825047,5850334.667325048,5857221.669825049,5864327.162325047,5871469.844325049,5877845.853075047,5884065.239325047,5890004.142825047,5896440.605325048,5903516.981325046,5910730.230825045,5918416.611825045,5926178.946075045,5934293.856825044,5942232.296325046,5950957.668075046,5959405.161075044,5967322.379325045,5974451.533575046
36.0,1161650.403024994,1162404.6682999944,1163071.7407499948,1163675.9883499953,1164339.1458999945,1165052.102074995,1166051.9225749949,1167664.454124994,1169487.9578749945,1171262.5498749947,1172673.6576249949,1174149.5705999946,1175680.252849995,1177312.444099995,1179019.982624996,1180775.1892749954,1182481.2333749963,1184380.344874996,1186374.7751249962,1188059.0563749962,1189452.4673499966,1190744.577699996,1192010.2709999958,1193073.7098249951
37.0,1161650.403024994,1162404.6682999944,1163071.7407499948,1163675.9883499953,1164339.1458999945,1165052.102074995,1166051.9225749949,1167664.454124994,1169487.9578749945,1171262.5498749947,1172673.6576249949,1174149.5705999946,1175680.252849995,1177312.444099995,1179019.982624996,1180775.1892749954,1182481.2333749963,1184380.344874996,1186374.7751249962,1188059.0563749962,1189452.4673499966,1190744.577699996,1192010.2709999958,1193073.7098249951
38.0,3484951.2090749824,3487214.0048999833,3489215.2222499843,3491027.965049986,3493017.437699984,3495156.306224985,3498155.7677249843,3502993.3623749823,3508463.8736249832,3513787.649624984,3518020.9728749846,3522448.711799984,3527040.7585499845,3531937.332299985,3537059.947874988,3542325.567824986,3547443.7001249893,3553141.034624988,3559124.325374989,3564177.169124989,3568357.4020499894,3572233.733099988,3576030.812999987,3579221.1294749854
39.0,3484951.2090749824,3487214.0048999833,3489215.2222499843,3491027.965049986,3493017.437699984,3495156.306224985,3498155.7677249843,3502993.3623749823,3508463.8736249832,3513787.649624984,3518020.9728749846,3522448.711799984,3527040.7585499845,3531937.332299985,3537059.947874988,3542325.567824986,3547443.7001249893,3553141.034624988,3559124.325374989,3564177.169124989,3568357.4020499894,3572233.733099988,3576030.812999987,3579221.1294749854
40.0,2685914.4179499894,2687797.917199989,2689457.7686749897,2690917.33274999,2692376.13582499,2693791.48967499,2695675.1026749895,2698494.463424989,2701762.2324249893,2705416.39392499,2709271.62392499,2713099.6469249907,2716998.71792499,2721161.83892499,2725295.526674989,2729375.2044249894,2733535.145424989,2737480.21592499,2741731.077424989,2745402.1444249884,2749115.8289249875,2752600.5074249883,2755837.766424987,2758491.950174987
41.0,2685914.4179499894,2687797.917199989,2689457.7686749897,2690917.33274999,2692376.13582499,2693791.48967499,2695675.1026749895,2698494.463424989,2701762.2324249893,2705416.39392499,2709271.62392499,2713099.6469249907,2716998.71792499,2721161.83892499,2725295.526674989,2729375.2044249894,2733535.145424989,2737480.21592499,2741731.077424989,2745402.1444249884,2749115.8289249875,2752600.5074249883,2755837.766424987,2758491.950174987
42.0,8057743.253849968,8063393.751599967,8068373.306024969,8072751.998249969,8077128.40747497,8081374.46902497,8087025.308024969,8095483.390274967,8105286.697274968,8116249.18177497,8127814.871774971,8139298.940774972,8150996.153774971,8163485.51677497,8175886.580024967,8188125.613274968,8200605.436274967,8212440.64777497,8225193.232274967,8236206.433274966,8247347.486774962,8257801.522274965,8267513.2992749605,8275475.85052496
43.0,8057743.253849968,8063393.751599967,8068373.306024969,8072751.998249969,8077128.40747497,8081374.46902497,8087025.308024969,8095483.390274967,8105286.697274968,8116249.18177497,8127814.871774971,8139298.940774972,8150996.153774971,8163485.51677497,8175886.580024967,8188125.613274968,8200605.436274967,8212440.64777497,8225193.232274967,8236206.433274966,8247347.486774962,8257801.522274965,8267513.2992749605,8275475.85052496
44.0,2512267.4186999807,2513945.4205999817,2515437.8286499814,2516792.4524499797,2518041.2504249793,2519414.18694998,2521087.45419998,2523564.15669998,2526952.815199981,2530455.4649499813,2533761.921199983,2537338.885449983,2541188.293449985,2545202.330699986,2549341.1439499855,2553288.389449983,2557420.0764499833,2561624.4616999845,2565555.6096999836,2569214.0221999846,2572561.922449983,2575675.4662249843,2578350.6854499844,2580887.0934499847
45.0,2512267.4186999807,2513945.4205999817,2515437.8286499814,2516792.4524499797,2518041.2504249793,2519414.18694998,2521087.45419998,2523564.15669998,2526952.815199981,2530455.4649499813,2533761.921199983,2537338.885449983,2541188.293449985,2545202.330699986,2549341.1439499855,2553288.389449983,2557420.0764499833,2561624.4616999845,2565555.6096999836,2569214.0221999846,2572561.922449983,2575675.4662249843,2578350.6854499844,2580887.0934499847
46.0,7536802.256099942,7541836.261799945,7546313.485949945,7550377.35734994,7554123.751274938,7558242.56084994,7563262.36259994,7570692.470099941,7580858.445599943,7591366.394849944,7601285.763599949,7612016.65634995,7623564.880349955,7635606.992099958,7648023.4318499565,7659865.168349949,7672260.22934995,7684873.385099953,7696666.829099951,7707642.066599954,7717685.767349949,7727026.398674953,7735052.056349954,7742661.280349954
47.0,7536802.256099942,7541836.261799945,7546313.485949945,7550377.35734994,7554123.751274938,7558242.56084994,7563262.36259994,7570692.470099941,7580858.445599943,7591366.394849944,7601285.763599949,7612016.65634995,7623564.880349955,7635606.992099958,7648023.4318499565,7659865.168349949,7672260.22934995,7684873.385099953,7696666.829099951,7707642.066599954,7717685.767349949,7727026.398674953,7735052.056349954,7742661.280349954
48.0,2095093.469475005,2096431.4922250044,2097572.9082250046,2098782.217225005,2099875.3567250054,2101070.162725006,2102664.7112250067,2105032.4232250066,2108350.1429750067,2111821.8622250054,2115411.514975005,2118916.272475005,2122484.8597250064,2126566.372225009,2130586.470725009,2134338.121975007,2138028.918225008,2142021.6279750066,2146003.2107250057,2149790.2677250057,2152561.126475007,2154896.235225006,2157116.1169750043,2159262.282725004
49.0,2095093.469475005,2096431.4922250044,2097572.9082250046,2098782.217225005,2099875.3567250054,2101070.162725006,2102664.7112250067,2105032.4232250066,2108350.1429750067,2111821.8622250054,2115411.514975005,2118916.272475005,2122484.8597250064,2126566.372225009,2130586.470725009,2134338.121975007,2138028.918225008,2142021.6279750066,2146003.2107250057,2149790.2677250057,2152561.126475007,2154896.235225006,2157116.1169750043,2159262.282725004
50.0,6285280.408425015,6289294.476675013,6292718.724675014,6296346.651675015,6299626.070175016,6303210.488175019,6307994.13367502,6315097.26967502,6325050.428925021,6335465.586675016,6346234.5449250145,6356748.817425015,6367454.57917502,6379699.116675027,6391759.412175028,6403014.3659250215,6414086.754675024,6426064.88392502,6438009.632175017,6449370.803175017,6457683.379425021,6464688.705675018,6471348.350925013,6477786.848175012
51.0,6285280.408425015,6289294.476675013,6292718.724675014,6296346.651675015,6299626.070175016,6303210.488175019,6307994.13367502,6315097.26967502,6325050.428925021,6335465.586675016,6346234.5449250145,6356748.817425015,6367454.57917502,6379699.116675027,6391759.412175028,6403014.3659250215,6414086.754675024,6426064.88392502,6438009.632175017,6449370.803175017,6457683.379425021,6464688.705675018,6471348.350925013,6477786.848175012
52.0,2299216.756024997,2301126.304524998,2302470.3480749982,2303790.689100001,2304994.291874999,2306406.1953749997,2308302.5176249994,2311464.0468750005,2315281.2643750026,2318695.496125002,2322024.452125002,2325117.130125004,2328211.187875005,2331318.926625006,2334555.400125005,2337620.2391250045,2340923.5326250046,2344724.8683750043,2348707.940625005,2352213.9246250065,2355304.4781250055,2357991.7928750073,2360382.316875007,2362569.489125007
53.0,2299216.756024997,2301126.304524998,2302470.3480749982,2303790.689100001,2304994.291874999,2306406.1953749997,2308302.5176249994,2311464.0468750005,2315281.2643750026,2318695.496125002,2322024.452125002,2325117.130125004,2328211.187875005,2331318.926625006,2334555.400125005,2337620.2391250045,2340923.5326250046,2344724.8683750043,2348707.940625005,2352213.9246250065,2355304.4781250055,2357991.7928750073,2360382.316875007,2362569.489125007
54.0,6897650.268074991,6903378.913574995,6907411.044224994,6911372.067300003,6914982.875624998,6919218.586124999,6924907.552874998,6934392.140625002,6945843.793125007,6956086.488375006,6966073.356375007,6975351.390375012,6984633.563625015,6993956.779875018,7003666.200375015,7012860.717375014,7022770.597875014,7034174.605125013,7046123.821875015,7056641.7738750195,7065913.434375016,7073975.378625022,7081146.950625021,7087708.4673750205
55.0,6897650.268074991,6903378.913574995,6907411.044224994,6911372.067300003,6914982.875624998,6919218.586124999,6924907.552874998,6934392.140625002,6945843.793125007,6956086.488375006,6966073.356375007,6975351.390375012,6984633.563625015,6993956.779875018,7003666.200375015,7012860.717375014,7022770.597875014,7034174.605125013,7046123.821875015,7056641.7738750195,7065913.434375016,7073975.378625022,7081146.950625021,7087708.4673750205
56.0,4973980.14112501,4977705.724975013,4980617.236975013,4983377.084750014,4985937.308925015,4988422.816450013,4991239.292525011,4995856.960000009,5002393.8798500085,5009447.07520001,5016504.9168250095,5023670.9663250055,5030661.092725004,5037824.9617500035,5045135.3841750035,5052152.487525007,5058804.2143000085,5065663.589125008,5072267.187800007,5078433.639375006,5084119.513125004,5089660.833700003,5094776.518025003,5099889.09185
57.0,4973980.14112501,4977705.724975013,4980617.236975013,4983377.084750014,4985937.308925015,4988422.816450013,4991239.292525011,4995856.960000009,5002393.8798500085,5009447.07520001,5016504.9168250095,5023670.9663250055,5030661.092725004,5037824.9617500035,5045135.3841750035,5052152.487525007,5058804.2143000085,5065663.589125008,5072267.187800007,5078433.639375006,5084119.513125004,5089660.833700003,5094776.518025003,5099889.09185
58.0,14921940.423375031,14933117.17492504,14941851.710925039,14950131.254250042,14957811.926775046,14965268.449350039,14973717.877575032,14987570.880000029,15007181.639550027,15028341.22560003,15049514.750475029,15071012.898975017,15091983.278175011,15113474.88525001,15135406.152525011,15156457.46257502,15176412.642900025,15196990.767375026,15216801.56340002,15235300.918125018,15252358.539375013,15268982.50110001,15284329.55407501,15299667.27555
59.0,14921940.423375031,14933117.17492504,14941851.710925039,14950131.254250042,14957811.926775046,14965268.449350039,14973717.877575032,14987570.880000029,15007181.639550027,15028341.22560003,15049514.750475029,15071012.898975017,15091983.278175011,15113474.88525001,15135406.152525011,15156457.46257502,15176412.642900025,15196990.767375026,15216801.56340002,15235300.918125018,15252358.539375013,15268982.50110001,15284329.55407501,15299667.27555
60.0,2161784.502375001,2164122.2966249995,2165772.365475001,2167122.654975,2168433.9131499985,2169649.1233499986,2171313.344849998,2173660.5835999986,2176765.814349999,2180028.68585,2183213.775849999,2186273.778099999,2189310.5965999984,2192276.255099998,2195476.704099997,2198835.584849997,2202114.292099997,2205387.0345999976,2208728.2668499975,2211947.4768499974,2214724.524849995,2217371.3373499927,2220118.402349994,2222671.5845999923
61.0,2161784.502375001,2164122.2966249995,2165772.365475001,2167122.654975,2168433.9131499985,2169649.1233499986,2171313.344849998,2173660.5835999986,2176765.814349999,2180028.68585,2183213.775849999,2186273.778099999,2189310.5965999984,2192276.255099998,2195476.704099997,2198835.584849997,2202114.292099997,2205387.0345999976,2208728.2668499975,2211947.4768499974,2214724.524849995,2217371.3373499927,2220118.402349994,2222671.5845999923
62.0,6485353.507125003,6492366.8898749985,6497317.096425002,6501367.9649249995,6505301.739449996,6508947.370049996,6513940.034549994,6520981.750799996,6530297.443049997,6540086.05755,6549641.327549997,6558821.3342999965,6567931.789799996,6576828.765299994,6586430.112299991,6596506.754549991,6606342.87629999,6616161.103799993,6626184.800549992,6635842.430549992,6644173.574549985,6652114.012049979,6660355.207049983,6668014.753799977
63.0,6485353.507125003,6492366.8898749985,6497317.096425002,6501367.9649249995,6505301.739449996,6508947.370049996,6513940.034549994,6520981.750799996,6530297.443049997,6540086.05755,6549641.327549997,6558821.3342999965,6567931.789799996,6576828.765299994,6586430.112299991,6596506.754549991,6606342.87629999,6616161.103799993,6626184.800549992,6635842.430549992,6644173.574549985,6652114.012049979,6660355.207049983,6668014.753799977
64.0,1259899.5023749913,1260875.3489749911,1261722.0553499917,1262459.6009249918,1263204.2935749923,1264014.9505249925,1265121.4226499922,1266693.0288999921,1268558.0548999924,1270229.7678999917,1271848.9473999918,1273407.6048999915,1274871.427399992,1276429.5692249918,1278023.8481499918,1279645.1368999914,1281380.2046499911,1283443.6581499905,1285352.071649991,1287237.3791499909,1288955.044649991,1290804.5383749912,1292271.4960249916,1293654.202824991
65.0,1259899.5023749913,1260875.3489749911,1261722.0553499917,1262459.6009249918,1263204.2935749923,1264014.9505249925,1265121.4226499922,1266693.0288999921,1268558.0548999924,1270229.7678999917,1271848.9473999918,1273407.6048999915,1274871.427399992,1276429.5692249918,1278023.8481499918,1279645.1368999914,1281380.2046499911,1283443.6581499905,1285352.071649991,1287237.3791499909,1288955.044649991,1290804.5383749912,1292271.4960249916,1293654.202824991
66.0,3779698.507124974,3782626.0469249734,3785166.166049975,3787378.802774975,3789612.880724977,3792044.851574978,3795364.2679499765,3800079.0866999766,3805674.1646999773,3810689.303699975,3815546.8421999756,3820222.814699975,3824614.282199976,3829288.7076749755,3834071.5444499757,3838935.4106999743,3844140.613949973,3850330.9744499717,3856056.214949973,3861712.1374499723,3866865.1339499727,3872413.6151249735,3876814.488074975,3880962.6084749727
67.0,3779698.507124974,3782626.0469249734,3785166.166049975,3787378.802774975,3789612.880724977,3792044.851574978,3795364.2679499765,3800079.0866999766,3805674.1646999773,3810689.303699975,3815546.8421999756,3820222.814699975,3824614.282199976,3829288.7076749755,3834071.5444499757,3838935.4106999743,3844140.613949973,3850330.9744499717,3856056.214949973,3861712.1374499723,3866865.1339499727,3872413.6151249735,3876814.488074975,3880962.6084749727
68.0,2524622.4530250076,2527121.2677750066,2528889.9717750065,2530522.4105250053,2531953.110275003,2533392.5612750025,2535426.0265250024,2538551.092025001,2541795.9982750015,2544873.278025002,2548105.654275002,2551096.229775001,2553998.8460250003,2557135.693525001,2560513.7372750007,2563776.4917750005,2567417.441025,2570858.838775001,2574761.9222750016,2578345.3115250026,2582134.1430250015,2585667.525775001,2588781.295025001,2591824.3317750026
69.0,2524622.4530250076,2527121.2677750066,2528889.9717750065,2530522.4105250053,2531953.110275003,2533392.5612750025,2535426.0265250024,2538551.092025001,2541795.9982750015,2544873.278025002,2548105.654275002,2551096.229775001,2553998.8460250003,2557135.693525001,2560513.7372750007,2563776.4917750005,2567417.441025,2570858.838775001,2574761.9222750016,2578345.3115250026,2582134.1430250015,2585667.525775001,2588781.295025001,2591824.3317750026
70.0,7573867.359075023,7581363.80332502,7586669.9153250195,7591567.231575016,7595859.330825009,7600177.683825008,7606278.079575008,7615653.276075004,7625387.994825005,7634619.834075007,7644316.962825006,7653288.689325003,7661996.538075001,7671407.080575002,7681541.211825002,7691329.475325001,7702252.323075,7712576.516325003,7724285.766825005,7735035.934575008,7746402.4290750045,7757002.577325003,7766343.885075003,7775472.995325008
71.0,7573867.359075023,7581363.80332502,7586669.9153250195,7591567.231575016,7595859.330825009,7600177.683825008,7606278.079575008,7615653.276075004,7625387.994825005,7634619.834075007,7644316.962825006,7653288.689325003,7661996.538075001,7671407.080575002,7681541.211825002,7691329.475325001,7702252.323075,7712576.516325003,7724285.766825005,7735035.934575008,7746402.4290750045,7757002.577325003,7766343.885075003,7775472.995325008
72.0,1795283.0550000079,1796644.5342500077,1797957.945250007,1799016.2787500063,1800076.7062500063,1801119.5957500061,1802591.5315000068,1804883.4410000066,1807538.3790000065,1810284.5532500062,1812910.846000006,1815615.8510000058,1818280.862500006,1821140.8307500056,1823849.395750006,1826700.9702500058,1829493.676750006,1832244.5985000057,1834962.0285000051,1837740.761000005,1840219.8760000055,1842754.858000005,1845429.6430000053,1847536.5200000056
73.0,1795283.0550000079,1796644.5342500077,1797957.945250007,1799016.2787500063,1800076.7062500063,1801119.5957500061,1802591.5315000068,1804883.4410000066,1807538.3790000065,1810284.5532500062,1812910.846000006,1815615.8510000058,1818280.862500006,1821140.8307500056,1823849.395750006,1826700.9702500058,1829493.676750006,1832244.5985000057,1834962.0285000051,1837740.761000005,1840219.8760000055,1842754.858000005,1845429.6430000053,1847536.5200000056
74.0,5385849.165000023,5389933.602750023,5393873.835750021,5397048.836250019,5400230.118750019,5403358.787250019,5407774.59450002,5414650.323000019,5422615.13700002,5430853.659750018,5438732.538000017,5446847.553000018,5454842.587500018,5463422.492250017,5471548.187250018,5480102.9107500175,5488481.0302500175,5496733.795500017,5504886.085500015,5513222.283000015,5520659.628000016,5528264.574000015,5536288.929000016,5542609.560000017
75.0,5385849.165000023,5389933.602750023,5393873.835750021,5397048.836250019,5400230.118750019,5403358.787250019,5407774.59450002,5414650.323000019,5422615.13700002,5430853.659750018,5438732.538000017,5446847.553000018,5454842.587500018,5463422.492250017,5471548.187250018,5480102.9107500175,5488481.0302500175,5496733.795500017,5504886.085500015,5513222.283000015,5520659.628000016,5528264.574000015,5536288.929000016,5542609.560000017
76.0,9932867.690749895,9940413.464749897,9946823.545999898,9952292.1832499,9957628.938999906,9962901.584499901,9969014.50774991,9978024.852499904,9992066.401999898,10006873.683499904,10022477.610749906,10038272.384749912,10054926.289749919,10072060.265499925,10088792.56049993,10104668.948999928,10120625.819499932,10136062.434249938,10151079.653749933,10165052.788499927,10178225.696499927,10190539.241749927,10202528.039249929,10213733.471749924
77.0,9932867.690749895,9940413.464749897,9946823.545999898,9952292.1832499,9957628.938999906,9962901.584499901,9969014.50774991,9978024.852499904,9992066.401999898,10006873.683499904,10022477.610749906,10038272.384749912,10054926.289749919,10072060.265499925,10088792.56049993,10104668.948999928,10120625.819499932,10136062.434249938,10151079.653749933,10165052.788499927,10178225.696499927,10190539.241749927,10202528.039249929,10213733.471749924
78.0,29798603.072249684,29821240.394249693,29840470.63799969,29856876.549749702,29872886.81699972,29888704.7534997,29907043.52324973,29934074.557499714,29976199.205999695,30020621.050499715,30067432.832249716,30114817.154249735,30164778.869249754,30216180.796499774,30266377.681499794,30314006.846999787,30361877.458499797,30408187.302749813,30453238.9612498,30495158.36549978,30534677.08949978,30571617.725249782,30607584.117749788,30641200.415249772
79.0,29798603.072249684,29821240.394249693,29840470.63799969,29856876.549749702,29872886.81699972,29888704.7534997,29907043.52324973,29934074.557499714,29976199.205999695,30020621.050499715,30067432.832249716,30114817.154249735,30164778.869249754,30216180.796499774,30266377.681499794,30314006.846999787,30361877.458499797,30408187.302749813,30453238.9612498,30495158.36549978,30534677.08949978,30571617.725249782,30607584.117749788,30641200.415249772
80.0,1650541.7557999971,1652012.5002999972,1653033.802799997,1653910.2667999973,1654731.6530499968,1655603.212049997,1656883.032049998,1658522.087799998,1660441.167049998,1662655.3135499975,1665122.554049997,1667442.1300499965,1669881.5895499971,1672314.1695499972,1674947.354549998,1677462.9765499972,1679879.536799997,1682356.4460499971,1684900.614299997,1687210.5837999978,1689445.9612999982,1691330.1632999973,1693131.1542999975,1694827.5200499971
81.0,1650541.7557999971,1652012.5002999972,1653033.802799997,1653910.2667999973,1654731.6530499968,1655603.212049997,1656883.032049998,1658522.087799998,1660441.167049998,1662655.3135499975,1665122.554049997,1667442.1300499965,1669881.5895499971,1672314.1695499972,1674947.354549998,1677462.9765499972,1679879.536799997,1682356.4460499971,1684900.614299997,1687210.5837999978,1689445.9612999982,1691330.1632999973,1693131.1542999975,1694827.5200499971
82.0,4951625.267399991,4956037.500899991,4959101.408399991,4961730.800399992,4964194.95914999,4966809.636149991,4970649.096149994,4975566.263399994,4981323.501149993,4987965.940649993,4995367.662149991,5002326.39014999,5009644.768649992,5016942.508649992,5024842.063649993,5032388.929649992,5039638.610399991,5047069.338149991,5054701.842899991,5061631.751399994,5068337.883899994,5073990.489899992,5079393.462899992,5084482.560149992
83.0,4951625.267399991,4956037.500899991,4959101.408399991,4961730.800399992,4964194.95914999,4966809.636149991,4970649.096149994,4975566.263399994,4981323.501149993,4987965.940649993,4995367.662149991,5002326.39014999,5009644.768649992,5016942.508649992,5024842.063649993,5032388.929649992,5039638.610399991,5047069.338149991,5054701.842899991,5061631.751399994,5068337.883899994,5073990.489899992,5079393.462899992,5084482.560149992
84.0,1385930.923917496,1387033.5236674966,1387903.8076674968,1388684.4054174959,1389411.0159174958,1390183.756667496,1391185.324917496,1392880.0134174956,1394692.4349174951,1396281.8574174948,1397774.1519174946,1399224.9316674944,1400749.8424174944,1402337.4579174952,1404001.1821674956,1405617.183917496,1407312.7161674958,1409138.428417496,1411102.3571674959,1413041.5634174962,1414764.2834174954,1416517.1389174953,1418154.9291674956,1419726.8216674956
85.0,1385930.923917496,1387033.5236674966,1387903.8076674968,1388684.4054174959,1389411.0159174958,1390183.756667496,1391185.324917496,1392880.0134174956,1394692.4349174951,1396281.8574174948,1397774.1519174946,1399224.9316674944,1400749.8424174944,1402337.4579174952,1404001.1821674956,1405617.183917496,1407312.7161674958,1409138.428417496,1411102.3571674959,1413041.5634174962,1414764.2834174954,1416517.1389174953,1418154.9291674956,1419726.8216674956
86.0,4157792.7717524883,4161100.57100249,4163711.423002491,4166053.2162524876,4168233.0477524875,4170551.270002488,4173555.9747524876,4178640.040252487,4184077.3047524854,4188845.572252484,4193322.4557524836,4197674.795002483,4202249.527252483,4207012.373752486,4212003.546502487,4216851.551752487,4221938.148502488,4227415.285252487,4233307.071502488,4239124.6902524885,4244292.850252487,4249551.416752486,4254464.787502486,4259180.4650024865
87.0,4157792.7717524883,4161100.57100249,4163711.423002491,4166053.2162524876,4168233.0477524875,4170551.270002488,4173555.9747524876,4178640.040252487,4184077.3047524854,4188845.572252484,4193322.4557524836,4197674.795002483,4202249.527252483,4207012.373752486,4212003.546502487,4216851.551752487,4221938.148502488,4227415.285252487,4233307.071502488,4239124.6902524885,4244292.850252487,4249551.416752486,4254464.787502486,4259180.4650024865
88.0,1613043.3944499993,1614046.44715,1614938.5796000012,1615711.9769750016,1616433.1470250026,1617204.3829250026,1618229.9442000026,1619782.4156000023,1621691.8378500028,1623728.0878500035,1625611.7016000038,1627508.3281500037,1629657.0724500038,1631872.611950004,1633944.6259500028,1636018.6192000024,1638203.789950002,1640370.3649500024,1642604.4072000019,1644582.7222000018,1646479.6639500028,1648258.5786250024,1650132.658525003,1651872.7869250032
89.0,1613043.3944499993,1614046.44715,1614938.5796000012,1615711.9769750016,1616433.1470250026,1617204.3829250026,1618229.9442000026,1619782.4156000023,1621691.8378500028,1623728.0878500035,1625611.7016000038,1627508.3281500037,1629657.0724500038,1631872.611950004,1633944.6259500028,1636018.6192000024,1638203.789950002,1640370.3649500024,1642604.4072000019,1644582.7222000018,1646479.6639500028,1648258.5786250024,1650132.658525003,1651872.7869250032
90.0,4839130.183349998,4842139.34145,4844815.738800004,4847135.930925005,4849299.441075008,4851613.148775008,4854689.832600008,4859347.246800007,4865075.513550009,4871184.2635500105,4876835.104800011,4882524.984450011,4888971.217350012,4895617.835850012,4901833.877850008,4908055.857600007,4914611.369850006,4921111.094850007,4927813.221600005,4933748.166600006,4939438.991850008,4944775.735875007,4950397.975575008,4955618.36077501
91.0,4839130.183349998,4842139.34145,4844815.738800004,4847135.930925005,4849299.441075008,4851613.148775008,4854689.832600008,4859347.246800007,4865075.513550009,4871184.2635500105,4876835.104800011,4882524.984450011,4888971.217350012,4895617.835850012,4901833.877850008,4908055.857600007,4914611.369850006,4921111.094850007,4927813.221600005,4933748.166600006,4939438.991850008,4944775.735875007,4950397.975575008,4955618.36077501
92.0,5021996.460422471,5025090.732219972,5027703.473052473,5030103.426709971,5032340.769807472,5034611.437144972,5037333.211569974,5041274.6359949745,5046153.984394975,5051002.502119973,5056224.340844969,5061432.618069969,5066599.261544966,5071924.1922449665,5077476.93144497,5083077.408119973,5088666.51654497,5094081.753394969,5099396.086569968,5104609.424044972,5109536.079819972,5114405.326869969,5118956.660619971,5123820.2243449725
93.0,5021996.460422471,5025090.732219972,5027703.473052473,5030103.426709971,5032340.769807472,5034611.437144972,5037333.211569974,5041274.6359949745,5046153.984394975,5051002.502119973,5056224.340844969,5061432.618069969,5066599.261544966,5071924.1922449665,5077476.93144497,5083077.408119973,5088666.51654497,5094081.753394969,5099396.086569968,5104609.424044972,5109536.079819972,5114405.326869969,5118956.660619971,5123820.2243449725
94.0,15065989.381267413,15075272.196659915,15083110.41915742,15090310.280129913,15097022.309422415,15103834.311434917,15111999.634709923,15123823.907984924,15138461.953184925,15153007.50635992,15168673.022534907,15184297.854209907,15199797.7846349,15215772.5767349,15232430.79433491,15249232.224359918,15265999.54963491,15282245.260184906,15298188.259709902,15313828.272134917,15328608.239459915,15343215.980609909,15356869.981859915,15371460.673034918
95.0,15065989.381267413,15075272.196659915,15083110.41915742,15090310.280129913,15097022.309422415,15103834.311434917,15111999.634709923,15123823.907984924,15138461.953184925,15153007.50635992,15168673.022534907,15184297.854209907,15199797.7846349,15215772.5767349,15232430.79433491,15249232.224359918,15265999.54963491,15282245.260184906,15298188.259709902,15313828.272134917,15328608.239459915,15343215.980609909,15356869.981859915,15371460.673034918
96.0,1597515.306725,1598636.184475,1599661.9412249995,1600576.577724999,1601501.740474998,1602478.1197249983,1603877.2184749986,1605948.1714749988,1608333.228224998,1610603.3319749988,1612936.2669749982,1615242.4452249985,1617626.004725,1620205.8259750004,1622616.1439750006,1624950.4977249997,1627455.9422249997,1629852.2219749994,1632187.6439749997,1634478.7549749992,1636544.7349749997,1638482.0399749998,1640327.7802249999,1642124.2382250007
97.0,1597515.306725,1598636.184475,1599661.9412249995,1600576.577724999,1601501.740474998,1602478.1197249983,1603877.2184749986,1605948.1714749988,1608333.228224998,1610603.3319749988,1612936.2669749982,1615242.4452249985,1617626.004725,1620205.8259750004,1622616.1439750006,1624950.4977249997,1627455.9422249997,1629852.2219749994,1632187.6439749997,1634478.7549749992,1636544.7349749997,1638482.0399749998,1640327.7802249999,1642124.2382250007
98.0,4792545.920175,4795908.553425,4798985.823674998,4801729.733174997,4804505.221424994,4807434.359174995,4811631.655424995,4817844.514424996,4824999.684674994,4831809.995924996,4838808.800924994,4845727.335674996,4852878.014175,4860617.477925001,4867848.431925002,4874851.493174999,4882367.826674999,4889556.665924998,4896562.931924999,4903436.264924997,4909634.204924999,4915446.119925,4920983.340675,4926372.714675002
99.0,4792545.920175,4795908.553425,4798985.823674998,4801729.733174997,4804505.221424994,4807434.359174995,4811631.655424995,4817844.514424996,4824999.684674994,4831809.995924996,4838808.800924994,4845727.335674996,4852878.014175,4860617.477925001,4867848.431925002,4874851.493174999,4882367.826674999,4889556.665924998,4896562.931924999,4903436.264924997,4909634.204924999,4915446.119925,4920983.340675,4926372.714675002
100.0,5604406.978187475,5608922.019412475,5612321.745737477,5615380.091962476,5618396.004537475,5621642.464087473,5626243.94608747,5633294.329712473,5641582.950037473,5648997.220812473,5656523.293262475,5663728.902287477,5671309.05611248,5679416.14888748,5687404.362562479,5694750.48363748,5702752.183762483,5711104.646562482,5719741.784437481,5728182.09616248,5735757.016662478,5742845.83231248,5749361.905162479,5755984.773837477
101.0,5604406.978187475,5608922.019412475,5612321.745737477,5615380.091962476,5618396.004537475,5621642.464087473,5626243.94608747,5633294.329712473,5641582.950037473,5648997.220812473,5656523.293262475,5663728.902287477,5671309.05611248,5679416.14888748,5687404.362562479,5694750.48363748,5702752.183762483,5711104.646562482,5719741.784437481,5728182.09616248,5735757.016662478,5742845.83231248,5749361.905162479,5755984.773837477
102.0,16813220.934562426,16826766.058237426,16836965.23721243,16846140.27588743,16855188.013612427,16864927.39226242,16878731.83826241,16899882.98913742,16924748.85011242,16946991.66243742,16969569.879787426,16991186.70686243,17013927.168337442,17038248.44666244,17062213.08768744,17084251.45091244,17108256.55128745,17133313.939687446,17159225.353312444,17184546.28848744,17207271.049987435,17228537.49693744,17248085.715487435,17267954.32151243
103.0,16813220.934562426,16826766.058237426,16836965.23721243,16846140.27588743,16855188.013612427,16864927.39226242,16878731.83826241,16899882.98913742,16924748.85011242,16946991.66243742,16969569.879787426,16991186.70686243,17013927.168337442,17038248.44666244,17062213.08768744,17084251.45091244,17108256.55128745,17133313.939687446,17159225.353312444,17184546.28848744,17207271.049987435,17228537.49693744,17248085.715487435,17267954.32151243
104.0,9657759.347500015,9665160.679250015,9671811.152750017,9677625.82500002,9682933.646000016,9688256.67150001,9694305.313000012,9703481.680750012,9714908.38925001,9726942.870000005,9739407.5885,9751742.850249998,9764535.512,9777094.036749989,9789292.14899999,9800998.348749993,9812683.760749992,9824348.224749986,9836053.153749991,9848186.16799999,9859392.36074999,9870579.629499987,9881611.55699999,9891965.56175
105.0,9657759.347500015,9665160.679250015,9671811.152750017,9677625.82500002,9682933.646000016,9688256.67150001,9694305.313000012,9703481.680750012,9714908.38925001,9726942.870000005,9739407.5885,9751742.850249998,9764535.512,9777094.036749989,9789292.14899999,9800998.348749993,9812683.760749992,9824348.224749986,9836053.153749991,9848186.16799999,9859392.36074999,9870579.629499987,9881611.55699999,9891965.56175
106.0,28973278.042500045,28995482.037750043,29015433.458250053,29032877.47500006,29048800.93800005,29064770.01450003,29082915.939000037,29110445.042250037,29144725.16775003,29180828.610000014,29218222.7655,29255228.550749995,29293606.536,29331282.110249966,29367876.446999975,29402995.04624998,29438051.282249976,29473044.67424996,29508159.461249974,29544558.50399997,29578177.08224997,29611738.88849996,29644834.670999974,29675896.68525
107.0,28973278.042500045,28995482.037750043,29015433.458250053,29032877.47500006,29048800.93800005,29064770.01450003,29082915.939000037,29110445.042250037,29144725.16775003,29180828.610000014,29218222.7655,29255228.550749995,29293606.536,29331282.110249966,29367876.446999975,29402995.04624998,29438051.282249976,29473044.67424996,29508159.461249974,29544558.50399997,29578177.08224997,29611738.88849996,29644834.670999974,29675896.68525
108.0,3122556.6179750212,3126279.6759750224,3128178.036900022,3129896.8069500215,3131509.0729500204,3133198.8674500203,3135476.65920002,3139257.444700021,3143578.0409500217,3148101.6882000216,3152517.6699500224,3156937.2659500204,3161161.69920002,3165499.04370002,3170052.0834500208,3174605.4502000217,3179078.775450022,3183834.636700022,3188695.278200021,3193121.9654500214,3197248.732700022,3201256.9277000213,3204800.8952000234,3207903.240700023
109.0,3122556.6179750212,3126279.6759750224,3128178.036900022,3129896.8069500215,3131509.0729500204,3133198.8674500203,3135476.65920002,3139257.444700021,3143578.0409500217,3148101.6882000216,3152517.6699500224,3156937.2659500204,3161161.69920002,3165499.04370002,3170052.0834500208,3174605.4502000217,3179078.775450022,3183834.636700022,3188695.278200021,3193121.9654500214,3197248.732700022,3201256.9277000213,3204800.8952000234,3207903.240700023
110.0,9367669.853925064,9378839.027925067,9384534.110700067,9389690.420850065,9394527.218850061,9399596.60235006,9406429.97760006,9417772.334100062,9430734.122850064,9444305.064600065,9457553.009850066,9470811.797850061,9483485.097600061,9496497.131100059,9510156.250350062,9523816.350600066,9537236.326350067,9551503.910100065,9566085.834600063,9579365.896350063,9591746.198100066,9603770.783100065,9614402.68560007,9623709.722100068
111.0,9367669.853925064,9378839.027925067,9384534.110700067,9389690.420850065,9394527.218850061,9399596.60235006,9406429.97760006,9417772.334100062,9430734.122850064,9444305.064600065,9457553.009850066,9470811.797850061,9483485.097600061,9496497.131100059,9510156.250350062,9523816.350600066,9537236.326350067,9551503.910100065,9566085.834600063,9579365.896350063,9591746.198100066,9603770.783100065,9614402.68560007,9623709.722100068
112.0,2167601.638199982,2168894.191199982,2169936.4583249833,2171051.0196749843,2172007.100724986,2173027.686974987,2174279.2069749874,2176062.036224987,2178071.9927249863,2180098.416974986,2182005.4752249867,2183888.7289749873,2185941.830224987,2188064.568974987,2190184.7692249883,2192238.6129749883,2194321.982974987,2196606.3249749863,2198734.380724987,2200804.7954749856,2202793.3387249853,2204720.564224986,2206509.530224985,2208108.836724985
113.0,2167601.638199982,2168894.191199982,2169936.4583249833,2171051.0196749843,2172007.100724986,2173027.686974987,2174279.2069749874,2176062.036224987,2178071.9927249863,2180098.416974986,2182005.4752249867,2183888.7289749873,2185941.830224987,2188064.568974987,2190184.7692249883,2192238.6129749883,2194321.982974987,2196606.3249749863,2198734.380724987,2200804.7954749856,2202793.3387249853,2204720.564224986,2206509.530224985,2208108.836724985
114.0,6502804.914599946,6506682.573599946,6509809.374974949,6513153.059024952,6516021.3021749575,6519083.06092496,6522837.620924963,6528186.10867496,6534215.978174958,6540295.250924958,6546016.42567496,6551666.186924962,6557825.490674961,6564193.706924962,6570554.307674965,6576715.838924965,6582965.948924961,6589818.974924959,6596203.142174961,6602414.386424957,6608380.016174955,6614161.692674957,6619528.590674955,6624326.510174954
115.0,6502804.914599946,6506682.573599946,6509809.374974949,6513153.059024952,6516021.3021749575,6519083.06092496,6522837.620924963,6528186.10867496,6534215.978174958,6540295.250924958,6546016.42567496,6551666.186924962,6557825.490674961,6564193.706924962,6570554.307674965,6576715.838924965,6582965.948924961,6589818.974924959,6596203.142174961,6602414.386424957,6608380.016174955,6614161.692674957,6619528.590674955,6624326.510174954
116.0,3022259.9414999983,3025197.2009999976,3027377.2914999966,3029291.178499997,3031073.670999997,3032966.9149999977,3035383.4444999965,3039076.257249996,3043034.1827499955,3046769.936249996,3050488.2277499954,3054352.3907499937,3058130.6532499935,3062346.931249994,3066194.5952499933,3070064.212499992,3074420.872499991,3078998.8374999925,3083665.8324999926,3088158.947999994,3092547.2759999936,3097043.7999999933,3101216.668999993,3105061.3864999926
117.0,3022259.9414999983,3025197.2009999976,3027377.2914999966,3029291.178499997,3031073.670999997,3032966.9149999977,3035383.4444999965,3039076.257249996,3043034.1827499955,3046769.936249996,3050488.2277499954,3054352.3907499937,3058130.6532499935,3062346.931249994,3066194.5952499933,3070064.212499992,3074420.872499991,3078998.8374999925,3083665.8324999926,3088158.947999994,3092547.2759999936,3097043.7999999933,3101216.668999993,3105061.3864999926
118.0,9066779.824499995,9075591.602999993,9082131.87449999,9087873.535499992,9093221.012999991,9098900.744999994,9106150.33349999,9117228.771749988,9129102.548249986,9140309.808749989,9151464.683249986,9163057.17224998,9174391.95974998,9187040.79374998,9198583.78574998,9210192.637499977,9223262.617499974,9236996.512499977,9250997.497499978,9264476.843999982,9277641.827999981,9291131.39999998,9303650.006999979,9315184.159499977
119.0,9066779.824499995,9075591.602999993,9082131.87449999,9087873.535499992,9093221.012999991,9098900.744999994,9106150.33349999,9117228.771749988,9129102.548249986,9140309.808749989,9151464.683249986,9163057.17224998,9174391.95974998,9187040.79374998,9198583.78574998,9210192.637499977,9223262.617499974,9236996.512499977,9250997.497499978,9264476.843999982,9277641.827999981,9291131.39999998,9303650.006999979,9315184.159499977
120.0,2726216.603451769,2728080.477132269,2729699.9167672684,2731184.0225977683,2732550.405853268,2733907.032758768,2735567.6503142687,2738038.9053197685,2741292.72290027,2744352.1042257715,2747430.470323272,2750569.1484182742,2753797.217323775,2757485.3394792755,2760893.464134776,2764161.348140276,2767619.499030277,2771090.4327857774,2774754.846460777,2778148.898977777,2781492.3823082764,2784778.1834782767,2787722.3243837766,2790645.9091642755
121.0,2726216.603451769,2728080.477132269,2729699.9167672684,2731184.0225977683,2732550.405853268,2733907.032758768,2735567.6503142687,2738038.9053197685,2741292.72290027,2744352.1042257715,2747430.470323272,2750569.1484182742,2753797.217323775,2757485.3394792755,2760893.464134776,2764161.348140276,2767619.499030277,2771090.4327857774,2774754.846460777,2778148.898977777,2781492.3823082764,2784778.1834782767,2787722.3243837766,2790645.9091642755
122.0,8178649.810355307,8184241.431396808,8189099.750301805,8193552.067793305,8197651.217559805,8201721.098276304,8206702.950942806,8214116.715959305,8223878.1687008105,8233056.3126773145,8242291.410969816,8251707.445254823,8261391.651971325,8272456.018437827,8282680.392404328,8292484.044420828,8302858.497090831,8313271.298357332,8324264.539382331,8334446.696933331,8344477.146924829,8354334.55043483,8363166.97315133,8371937.727492826
123.0,8178649.810355307,8184241.431396808,8189099.750301805,8193552.067793305,8197651.217559805,8201721.098276304,8206702.950942806,8214116.715959305,8223878.1687008105,8233056.3126773145,8242291.410969816,8251707.445254823,8261391.651971325,8272456.018437827,8282680.392404328,8292484.044420828,8302858.497090831,8313271.298357332,8324264.539382331,8334446.696933331,8344477.146924829,8354334.55043483,8363166.97315133,8371937.727492826
124.0,79050627.74449998,79116739.16124998,79166553.15375,79211282.94999999,79252389.05124992,79294147.11724988,79347135.82599983,79428177.90174979,79530528.7354998,79635625.00624985,79743381.20049989,79848735.76574993,79956802.33574991,80069445.24149989,80181525.6977499,80290584.7024999,80399413.91449994,80510894.51774997,80625519.60374998,80732804.92274997,80834279.30674997,80930723.13299999,81019854.66274999,81104187.11749993
125.0,79050627.74449998,79116739.16124998,79166553.15375,79211282.94999999,79252389.05124992,79294147.11724988,79347135.82599983,79428177.90174979,79530528.7354998,79635625.00624985,79743381.20049989,79848735.76574993,79956802.33574991,80069445.24149989,80181525.6977499,80290584.7024999,80399413.91449994,80510894.51774997,80625519.60374998,80732804.92274997,80834279.30674997,80930723.13299999,81019854.66274999,81104187.11749993
126.0,237151883.23349994,237350217.48374993,237499659.46125,237633848.84999996,237757167.15374976,237882441.35174963,238041407.47799948,238284533.70524937,238591586.2064994,238906875.01874954,239230143.60149968,239546207.2972498,239870407.0072497,240208335.72449964,240544577.09324968,240871754.1074997,241198241.74349982,241532683.5532499,241876558.8112499,242198414.7682499,242502837.9202499,242792169.39899996,243059563.98824996,243312561.35249978
127.0,237151883.23349994,237350217.48374993,237499659.46125,237633848.84999996,237757167.15374976,237882441.35174963,238041407.47799948,238284533.70524937,238591586.2064994,238906875.01874954,239230143.60149968,239546207.2972498,239870407.0072497,240208335.72449964,240544577.09324968,240871754.1074997,241198241.74349982,241532683.5532499,241876558.8112499,242198414.7682499,242502837.9202499,242792169.39899996,243059563.98824996,243312561.35249978
128.0,5612698.8125000205,5617898.992500018,5622152.96750002,5626009.099750018,5629436.173750021,5632818.754750019,5636814.219000015,5642270.432750012,5649288.729500014,5656941.480750015,5664685.041750012,5672037.619000015,5679642.776750013,5687280.711500012,5694798.898000013,5702257.029250013,5709751.795250013,5717465.622250011,5725413.1910000155,5733229.171500014,5740998.948500017,5748528.165750013,5755497.299250014,5762767.070000015
129.0,5612698.8125000205,5617898.992500018,5622152.96750002,5626009.099750018,5629436.173750021,5632818.754750019,5636814.219000015,5642270.432750012,5649288.729500014,5656941.480750015,5664685.041750012,5672037.619000015,5679642.776750013,5687280.711500012,5694798.898000013,5702257.029250013,5709751.795250013,5717465.622250011,5725413.1910000155,5733229.171500014,5740998.948500017,5748528.165750013,5755497.299250014,5762767.070000015
130.0,16838096.43750006,16853696.977500055,16866458.90250006,16878027.29925005,16888308.52125006,16898456.264250055,16910442.657000046,16926811.298250034,16947866.188500043,16970824.442250043,16994055.125250034,17016112.857000045,17038928.33025004,17061842.134500038,17084396.69400004,17106771.08775004,17129255.385750037,17152396.86675003,17176239.573000047,17199687.514500044,17222996.845500052,17245584.49725004,17266491.897750042,17288301.210000046
131.0,16838096.43750006,16853696.977500055,16866458.90250006,16878027.29925005,16888308.52125006,16898456.264250055,16910442.657000046,16926811.298250034,16947866.188500043,16970824.442250043,16994055.125250034,17016112.857000045,17038928.33025004,17061842.134500038,17084396.69400004,17106771.08775004,17129255.385750037,17152396.86675003,17176239.573000047,17199687.514500044,17222996.845500052,17245584.49725004,17266491.897750042,17288301.210000046
132.0,949239.3056499946,950415.2441499945,950991.6038249945,951617.9379249946,952174.6574249946,952724.866349995,953332.7452749948,954283.5695749946,955458.6950249948,956734.5920749947,958030.0381999947,959293.711999995,960714.6283249954,962140.232349995,963467.5351499954,964748.9751749953,965972.3739749956,967211.7854749952,968422.071799995,969678.7392249955,970650.2133249956,971491.8775249957,972220.1796499958,972863.9597499958
133.0,949239.3056499946,950415.2441499945,950991.6038249945,951617.9379249946,952174.6574249946,952724.866349995,953332.7452749948,954283.5695749946,955458.6950249948,956734.5920749947,958030.0381999947,959293.711999995,960714.6283249954,962140.232349995,963467.5351499954,964748.9751749953,965972.3739749956,967211.7854749952,968422.071799995,969678.7392249955,970650.2133249956,971491.8775249957,972220.1796499958,972863.9597499958
134.0,2847717.9169499837,2851245.7324499832,2852974.8114749836,2854853.813774984,2856523.972274984,2858174.599049985,2859998.2358249845,2862850.708724984,2866376.0850749845,2870203.776224984,2874090.114599984,2877881.135999985,2882143.8849749863,2886420.697049985,2890402.605449986,2894246.925524986,2897917.1219249866,2901635.3564249855,2905266.215399985,2909036.2176749865,2911950.6399749867,2914475.632574987,2916660.5389499874,2918591.8792499877
135.0,2847717.9169499837,2851245.7324499832,2852974.8114749836,2854853.813774984,2856523.972274984,2858174.599049985,2859998.2358249845,2862850.708724984,2866376.0850749845,2870203.776224984,2874090.114599984,2877881.135999985,2882143.8849749863,2886420.697049985,2890402.605449986,2894246.925524986,2897917.1219249866,2901635.3564249855,2905266.215399985,2909036.2176749865,2911950.6399749867,2914475.632574987,2916660.5389499874,2918591.8792499877
136.0,2220828.5924999933,2223106.017249993,2224753.658249994,2226199.289249994,2227534.3767499933,2228854.4154999936,2230667.017249992,2233760.656249992,2237414.5494999913,2240666.5994999926,2243698.5519999927,2246681.264499993,2249504.9952499936,2252411.799999994,2255250.2334999945,2258011.4797499953,2260737.8994999956,2263704.2774999947,2266861.584999996,2270143.8179999944,2273216.7847499955,2276054.395499996,2278644.888499996,2281160.821749997
137.0,2220828.5924999933,2223106.017249993,2224753.658249994,2226199.289249994,2227534.3767499933,2228854.4154999936,2230667.017249992,2233760.656249992,2237414.5494999913,2240666.5994999926,2243698.5519999927,2246681.264499993,2249504.9952499936,2252411.799999994,2255250.2334999945,2258011.4797499953,2260737.8994999956,2263704.2774999947,2266861.584999996,2270143.8179999944,2273216.7847499955,2276054.395499996,2278644.888499996,2281160.821749997
138.0,6662485.777499979,6669318.051749979,6674260.974749981,6678597.867749982,6682603.13024998,6686563.246499981,6692001.051749976,6701281.968749976,6712243.648499974,6721999.798499977,6731095.655999978,6740043.793499979,6748514.98574998,6757235.399999983,6765750.7004999835,6774034.439249986,6782213.698499987,6791112.832499985,6800584.754999988,6810431.453999983,6819650.354249986,6828163.186499988,6835934.665499989,6843482.465249991
139.0,6662485.777499979,6669318.051749979,6674260.974749981,6678597.867749982,6682603.13024998,6686563.246499981,6692001.051749976,6701281.968749976,6712243.648499974,6721999.798499977,6731095.655999978,6740043.793499979,6748514.98574998,6757235.399999983,6765750.7004999835,6774034.439249986,6782213.698499987,6791112.832499985,6800584.754999988,6810431.453999983,6819650.354249986,6828163.186499988,6835934.665499989,6843482.465249991
140.0,1585024.0405250143,1585666.0837500137,1586214.0019750132,1586727.466000013,1587220.1502000133,1587787.9063250131,1588640.2922750125,1589840.898025013,1591419.220525013,1593346.2787750128,1595043.9372750137,1596650.9057750143,1598268.3967750145,1600082.5757750133,1601821.7630250133,1603456.4040250126,1605067.9430250123,1606604.0105250126,1608034.168775013,1609336.0627750128,1610529.2760250128,1611586.5162750129,1612630.7350750125,1613557.2437000128
141.0,1585024.0405250143,1585666.0837500137,1586214.0019750132,1586727.466000013,1587220.1502000133,1587787.9063250131,1588640.2922750125,1589840.898025013,1591419.220525013,1593346.2787750128,1595043.9372750137,1596650.9057750143,1598268.3967750145,1600082.5757750133,1601821.7630250133,1603456.4040250126,1605067.9430250123,1606604.0105250126,1608034.168775013,1609336.0627750128,1610529.2760250128,1611586.5162750129,1612630.7350750125,1613557.2437000128
142.0,4755072.121575043,4756998.251250042,4758642.00592504,4760182.398000039,4761660.45060004,4763363.718975039,4765920.876825037,4769522.694075039,4774257.661575039,4780038.836325038,4785131.811825041,4789952.717325043,4794805.190325043,4800247.72732504,4805465.289075039,4810369.212075038,4815203.829075037,4819812.031575038,4824102.506325039,4828008.188325038,4831587.828075038,4834759.548825039,4837892.205225037,4840671.731100039
143.0,4755072.121575043,4756998.251250042,4758642.00592504,4760182.398000039,4761660.45060004,4763363.718975039,4765920.876825037,4769522.694075039,4774257.661575039,4780038.836325038,4785131.811825041,4789952.717325043,4794805.190325043,4800247.72732504,4805465.289075039,4810369.212075038,4815203.829075037,4819812.031575038,4824102.506325039,4828008.188325038,4831587.828075038,4834759.548825039,4837892.205225037,4840671.731100039
144.0,9326112.780999992,9331442.607749986,9336104.55299998,9340299.472749976,9344083.02099997,9347869.684249977,9352374.975749971,9359456.045999967,9369824.680749968,9382012.258749966,9394605.079999967,9407367.80474997,9420648.18899997,9434808.937249975,9448652.77774997,9461612.830249969,9474415.751499966,9487069.041249977,9499633.254499981,9509996.483999975,9519577.773749972,9528548.143749971,9536903.277749974,9544967.527749967
145.0,9326112.780999992,9331442.607749986,9336104.55299998,9340299.472749976,9344083.02099997,9347869.684249977,9352374.975749971,9359456.045999967,9369824.680749968,9382012.258749966,9394605.079999967,9407367.80474997,9420648.18899997,9434808.937249975,9448652.77774997,9461612.830249969,9474415.751499966,9487069.041249977,9499633.254499981,9509996.483999975,9519577.773749972,9528548.143749971,9536903.277749974,9544967.527749967
146.0,27978338.342999976,27994327.82324996,28008313.658999942,28020898.418249927,28032249.06299991,28043609.05274993,28057124.927249916,28078368.1379999,28109474.042249903,28146036.776249897,28183815.239999898,28222103.41424991,28261944.56699991,28304426.811749928,28345958.33324991,28384838.490749907,28423247.254499897,28461207.123749934,28498899.763499945,28529989.451999925,28558733.321249917,28585644.431249913,28610709.833249923,28634902.5832499
147.0,27978338.342999976,27994327.82324996,28008313.658999942,28020898.418249927,28032249.06299991,28043609.05274993,28057124.927249916,28078368.1379999,28109474.042249903,28146036.776249897,28183815.239999898,28222103.41424991,28261944.56699991,28304426.811749928,28345958.33324991,28384838.490749907,28423247.254499897,28461207.123749934,28498899.763499945,28529989.451999925,28558733.321249917,28585644.431249913,28610709.833249923,28634902.5832499
148.0,1961900.7822499976,1963537.5622499976,1965033.4657499979,1966284.3074999978,1967538.5927499982,1968855.2802499975,1970753.431249998,1973189.6024999989,1975556.4229999988,1977849.859749999,1980261.0527499989,1982602.8199999987,1985100.5934999983,1987574.0032499984,1990047.482499999,1992566.0529999996,1995167.6639999996,1997809.8492499997,2000692.2147499996,2003863.0662499992,2006637.6954999992,2009485.9937499994,2012244.700749999,2015244.4662499991
149.0,1961900.7822499976,1963537.5622499976,1965033.4657499979,1966284.3074999978,1967538.5927499982,1968855.2802499975,1970753.431249998,1973189.6024999989,1975556.4229999988,1977849.859749999,1980261.0527499989,1982602.8199999987,1985100.5934999983,1987574.0032499984,1990047.482499999,1992566.0529999996,1995167.6639999996,1997809.8492499997,2000692.2147499996,2003863.0662499992,2006637.6954999992,2009485.9937499994,2012244.700749999,2015244.4662499991
150.0,5885702.346749993,5890612.686749993,5895100.397249994,5898852.922499994,5902615.778249995,5906565.840749992,5912260.293749994,5919568.807499996,5926669.268999997,5933549.579249997,5940783.158249997,5947808.459999996,5955301.780499995,5962722.009749996,5970142.447499997,5977698.158999999,5985502.991999999,5993429.547749999,6002076.644249999,6011589.198749998,6019913.086499997,6028457.981249998,6036734.102249997,6045733.398749998
151.0,5885702.346749993,5890612.686749993,5895100.397249994,5898852.922499994,5902615.778249995,5906565.840749992,5912260.293749994,5919568.807499996,5926669.268999997,5933549.579249997,5940783.158249997,5947808.459999996,5955301.780499995,5962722.009749996,5970142.447499997,5977698.158999999,5985502.991999999,5993429.547749999,6002076.644249999,6011589.198749998,6019913.086499997,6028457.981249998,6036734.102249997,6045733.398749998
152.0,7074312.49910748,7078832.492474981,7082806.592592482,7086337.234209985,7089560.526077484,7092768.278444979,7096412.855812481,7102009.602679979,7110356.928547478,7120492.571914983,7131004.298532485,7141657.987109984,7152440.626477483,7163717.892094985,7174989.08796249,7185404.704079991,7196068.489697494,7206134.814314994,7216003.795364995,7224878.899732492,7233327.570099993,7241187.666717497,7248627.055334997,7255811.733452495
153.0,7074312.49910748,7078832.492474981,7082806.592592482,7086337.234209985,7089560.526077484,7092768.278444979,7096412.855812481,7102009.602679979,7110356.928547478,7120492.571914983,7131004.298532485,7141657.987109984,7152440.626477483,7163717.892094985,7174989.08796249,7185404.704079991,7196068.489697494,7206134.814314994,7216003.795364995,7224878.899732492,7233327.570099993,7241187.666717497,7248627.055334997,7255811.733452495
154.0,21222937.49732244,21236497.477424942,21248419.77777745,21259011.702629954,21268681.578232452,21278304.835334938,21289238.56743744,21306028.808039937,21331070.785642434,21361477.71574495,21393012.895597454,21424973.961329952,21457321.879432447,21491153.676284954,21524967.26388747,21556214.11223997,21588205.46909248,21618404.44294498,21648011.386094984,21674636.699197475,21699982.710299976,21723563.00015249,21745881.166004993,21767435.200357486
155.0,21222937.49732244,21236497.477424942,21248419.77777745,21259011.702629954,21268681.578232452,21278304.835334938,21289238.56743744,21306028.808039937,21331070.785642434,21361477.71574495,21393012.895597454,21424973.961329952,21457321.879432447,21491153.676284954,21524967.26388747,21556214.11223997,21588205.46909248,21618404.44294498,21648011.386094984,21674636.699197475,21699982.710299976,21723563.00015249,21745881.166004993,21767435.200357486
156.0,4977673.668000001,4982003.07175,4985447.238250001,4988588.558750001,4991636.114250001,4994670.951499999,4998381.58975,5004468.872499998,5012068.986499996,5019787.447249995,5028001.457999993,5035418.5669999905,5043612.361749989,5051870.345499987,5059934.731999988,5067736.946999987,5074971.283249985,5082520.408749984,5090681.423249985,5098257.508749981,5104736.7384999795,5110792.716249977,5116656.908999979,5122267.338499979
157.0,4977673.668000001,4982003.07175,4985447.238250001,4988588.558750001,4991636.114250001,4994670.951499999,4998381.58975,5004468.872499998,5012068.986499996,5019787.447249995,5028001.457999993,5035418.5669999905,5043612.361749989,5051870.345499987,5059934.731999988,5067736.946999987,5074971.283249985,5082520.408749984,5090681.423249985,5098257.508749981,5104736.7384999795,5110792.716249977,5116656.908999979,5122267.338499979
158.0,14933021.004000004,14946009.21525,14956341.714750003,14965765.676250003,14974908.342750002,14984012.854499996,14995144.769250002,15013406.617499992,15036206.959499989,15059362.341749985,15084004.37399998,15106255.700999971,15130837.085249968,15155611.03649996,15179804.195999963,15203210.84099996,15224913.849749956,15247561.226249952,15272044.269749954,15294772.526249945,15314210.215499938,15332378.148749933,15349970.726999935,15366802.015499938
159.0,14933021.004000004,14946009.21525,14956341.714750003,14965765.676250003,14974908.342750002,14984012.854499996,14995144.769250002,15013406.617499992,15036206.959499989,15059362.341749985,15084004.37399998,15106255.700999971,15130837.085249968,15155611.03649996,15179804.195999963,15203210.84099996,15224913.849749956,15247561.226249952,15272044.269749954,15294772.526249945,15314210.215499938,15332378.148749933,15349970.726999935,15366802.015499938
160.0,2765407.270000003,2767257.213500003,2768838.657500002,2770308.965250002,2771667.9985000035,2773115.237250004,2774745.134250004,2777458.476250004,2780908.5425000037,2784442.6082500033,2787966.9142500036,2791525.2590000043,2795005.7955000033,2798593.027000004,2802116.4740000037,2805454.3152500032,2808784.818000004,2812003.733750005,2815444.9932500036,2818641.322750005,2821931.5912500047,2825098.5620000055,2828027.734000005,2830579.143250005
161.0,2765407.270000003,2767257.213500003,2768838.657500002,2770308.965250002,2771667.9985000035,2773115.237250004,2774745.134250004,2777458.476250004,2780908.5425000037,2784442.6082500033,2787966.9142500036,2791525.2590000043,2795005.7955000033,2798593.027000004,2802116.4740000037,2805454.3152500032,2808784.818000004,2812003.733750005,2815444.9932500036,2818641.322750005,2821931.5912500047,2825098.5620000055,2828027.734000005,2830579.143250005
162.0,8296221.810000008,8301771.640500009,8306515.972500006,8310926.895750007,8315003.99550001,8319345.711750012,8324235.4027500115,8332375.428750012,8342725.627500011,8353327.82475001,8363900.742750011,8374575.777000013,8385017.38650001,8395779.081000011,8406349.422000011,8416362.94575001,8426354.454000013,8436011.201250015,8446334.979750011,8455923.968250014,8465794.773750015,8475295.686000016,8484083.202000014,8491737.429750014
163.0,8296221.810000008,8301771.640500009,8306515.972500006,8310926.895750007,8315003.99550001,8319345.711750012,8324235.4027500115,8332375.428750012,8342725.627500011,8353327.82475001,8363900.742750011,8374575.777000013,8385017.38650001,8395779.081000011,8406349.422000011,8416362.94575001,8426354.454000013,8436011.201250015,8446334.979750011,8455923.968250014,8465794.773750015,8475295.686000016,8484083.202000014,8491737.429750014
164.0,2517385.2956249923,2519788.001874992,2521590.662124991,2523295.8453749907,2524933.7398749907,2526529.47912499,2528559.6991249914,2531345.21287499,2534255.996124988,2537139.1778749884,2539869.4546249886,2542415.822874989,2545235.385124988,2548382.6928749853,2551705.1506249853,2554950.3828749848,2558213.2313749846,2561539.445124984,2565136.2391249854,2568607.4413749874,2572443.7318749866,2575910.283374986,2579459.4501249846,2582759.4536249833
165.0,2517385.2956249923,2519788.001874992,2521590.662124991,2523295.8453749907,2524933.7398749907,2526529.47912499,2528559.6991249914,2531345.21287499,2534255.996124988,2537139.1778749884,2539869.4546249886,2542415.822874989,2545235.385124988,2548382.6928749853,2551705.1506249853,2554950.3828749848,2558213.2313749846,2561539.445124984,2565136.2391249854,2568607.4413749874,2572443.7318749866,2575910.283374986,2579459.4501249846,2582759.4536249833
166.0,7552155.8868749775,7559364.005624976,7564771.986374972,7569887.536124973,7574801.219624972,7579588.43737497,7585679.097374974,7594035.63862497,7602767.988374963,7611417.533624966,7619608.363874966,7627247.468624966,7635706.155374964,7645148.078624956,7655115.4518749565,7664851.148624955,7674639.694124954,7684618.335374951,7695408.717374956,7705822.324124962,7717331.19562496,7727730.850124959,7738378.350374954,7748278.36087495
167.0,7552155.8868749775,7559364.005624976,7564771.986374972,7569887.536124973,7574801.219624972,7579588.43737497,7585679.097374974,7594035.63862497,7602767.988374963,7611417.533624966,7619608.363874966,7627247.468624966,7635706.155374964,7645148.078624956,7655115.4518749565,7664851.148624955,7674639.694124954,7684618.335374951,7695408.717374956,7705822.324124962,7717331.19562496,7727730.850124959,7738378.350374954,7748278.36087495
168.0,86571774.17595014,86635867.74245013,86686988.00620013,86732570.68295014,86774603.20820014,86817955.63695014,86872445.50720015,86954435.05270018,87063531.9019502,87181411.71645023,87302430.76295023,87423314.68845023,87546667.4647002,87675994.17920022,87805070.6167002,87929440.9282002,88053863.75670019,88178889.5194502,88303927.63195017,88418513.12295017,88524157.35820015,88623188.47895013,88715771.43545014,88802481.62095012
169.0,86571774.17595014,86635867.74245013,86686988.00620013,86732570.68295014,86774603.20820014,86817955.63695014,86872445.50720015,86954435.05270018,87063531.9019502,87181411.71645023,87302430.76295023,87423314.68845023,87546667.4647002,87675994.17920022,87805070.6167002,87929440.9282002,88053863.75670019,88178889.5194502,88303927.63195017,88418513.12295017,88524157.35820015,88623188.47895013,88715771.43545014,88802481.62095012
170.0,259715322.52785042,259907603.2273504,260060964.0186004,260197712.04885042,260323809.6246004,260453866.9108504,260617336.52160046,260863305.15810055,261190595.7058506,261544235.1493507,261907292.28885067,262269944.0653507,262640002.3941006,263027982.53760064,263415211.8501006,263788322.78460062,264161591.27010056,264536668.55835062,264911782.8958505,265255539.3688505,265572472.07460046,265869565.43685037,266147314.3063504,266407444.86285037
171.0,259715322.52785042,259907603.2273504,260060964.0186004,260197712.04885042,260323809.6246004,260453866.9108504,260617336.52160046,260863305.15810055,261190595.7058506,261544235.1493507,261907292.28885067,262269944.0653507,262640002.3941006,263027982.53760064,263415211.8501006,263788322.78460062,264161591.27010056,264536668.55835062,264911782.8958505,265255539.3688505,265572472.07460046,265869565.43685037,266147314.3063504,266407444.86285037
172.0,9306889.570499988,9315229.892999992,9322176.845249988,9328304.79149999,9333672.31325,9338915.31175,9345196.594500005,9354188.297000002,9365950.774500001,9378526.25450001,9390946.498250023,9403350.60575002,9416099.321000017,9429023.718250018,9442211.140750024,9454806.57325002,9467334.417500025,9480014.392500022,9492976.282500014,9506131.357500013,9519366.955000015,9532590.502500014,9545462.43000001,9557972.465000007
173.0,9306889.570499988,9315229.892999992,9322176.845249988,9328304.79149999,9333672.31325,9338915.31175,9345196.594500005,9354188.297000002,9365950.774500001,9378526.25450001,9390946.498250023,9403350.60575002,9416099.321000017,9429023.718250018,9442211.140750024,9454806.57325002,9467334.417500025,9480014.392500022,9492976.282500014,9506131.357500013,9519366.955000015,9532590.502500014,9545462.43000001,9557972.465000007
174.0,27920668.711499967,27945689.678999975,27966530.535749964,27984914.37449997,28001016.93975,28016745.93525,28035589.783500016,28062564.891000006,28097852.323500004,28135578.763500027,28172839.494750068,28210051.81725006,28248297.96300005,28287071.154750053,28326633.422250073,28364419.71975006,28402003.252500072,28440043.17750007,28478928.84750004,28518394.07250004,28558100.865000047,28597771.507500045,28636387.290000033,28673917.395000022
175.0,27920668.711499967,27945689.678999975,27966530.535749964,27984914.37449997,28001016.93975,28016745.93525,28035589.783500016,28062564.891000006,28097852.323500004,28135578.763500027,28172839.494750068,28210051.81725006,28248297.96300005,28287071.154750053,28326633.422250073,28364419.71975006,28402003.252500072,28440043.17750007,28478928.84750004,28518394.07250004,28558100.865000047,28597771.507500045,28636387.290000033,28673917.395000022
176.0,3171203.2081249743,3173006.466624975,3174581.1298749745,3175975.0898749754,3177245.9413749753,3178544.037374977,3180115.977374977,3182504.720874977,3185903.8288749764,3189196.7146249763,3192851.401124976,3196077.973624977,3199396.3451249776,3202887.455624979,3206243.231624981,3209497.7641249825,3212723.049374981,3215753.465624981,3218933.0628749807,3221766.8553749803,3224406.381624979,3226986.7761249784,3229354.5246249796,3231814.3101249808
177.0,3171203.2081249743,3173006.466624975,3174581.1298749745,3175975.0898749754,3177245.9413749753,3178544.037374977,3180115.977374977,3182504.720874977,3185903.8288749764,3189196.7146249763,3192851.401124976,3196077.973624977,3199396.3451249776,3202887.455624979,3206243.231624981,3209497.7641249825,3212723.049374981,3215753.465624981,3218933.0628749807,3221766.8553749803,3224406.381624979,3226986.7761249784,3229354.5246249796,3231814.3101249808
178.0,9513609.624374922,9519019.399874926,9523743.389624923,9527925.269624926,9531737.824124925,9535632.112124931,9540347.932124931,9547514.162624931,9557711.48662493,9567590.143874928,9578554.203374928,9588233.92087493,9598189.035374932,9608662.366874937,9618729.694874942,9628493.292374948,9638169.148124943,9647260.396874944,9656799.188624943,9665300.56612494,9673219.144874938,9680960.328374935,9688063.57387494,9695442.930374943
179.0,9513609.624374922,9519019.399874926,9523743.389624923,9527925.269624926,9531737.824124925,9535632.112124931,9540347.932124931,9547514.162624931,9557711.48662493,9567590.143874928,9578554.203374928,9588233.92087493,9598189.035374932,9608662.366874937,9618729.694874942,9628493.292374948,9638169.148124943,9647260.396874944,9656799.188624943,9665300.56612494,9673219.144874938,9680960.328374935,9688063.57387494,9695442.930374943
180.0,2196721.754524991,2198406.504199991,2199594.4063499905,2200728.3505499894,2201816.37367499,2202829.60962499,2204176.8716249904,2206309.73812499,2209193.1031249887,2212652.469874989,2216541.1026249896,2220778.3573749904,2225488.227124992,2230480.263624992,2235961.5443749917,2241551.6213749917,2247208.0566249904,2252889.484874992,2258755.1261249916,2264393.534874991,2269278.02287499,2273698.72337499,2277421.615874991,2280133.437624992
181.0,2196721.754524991,2198406.504199991,2199594.4063499905,2200728.3505499894,2201816.37367499,2202829.60962499,2204176.8716249904,2206309.73812499,2209193.1031249887,2212652.469874989,2216541.1026249896,2220778.3573749904,2225488.227124992,2230480.263624992,2235961.5443749917,2241551.6213749917,2247208.0566249904,2252889.484874992,2258755.1261249916,2264393.534874991,2269278.02287499,2273698.72337499,2277421.615874991,2280133.437624992
182.0,6590165.263574973,6595219.512599973,6598783.219049972,6602185.051649968,6605449.12102497,6608488.82887497,6612530.614874971,6618929.21437497,6627579.309374966,6637957.409624966,6649623.307874968,6662335.072124971,6676464.6813749755,6691440.790874977,6707884.6331249755,6724654.864124975,6741624.169874972,6758668.454624977,6776265.378374975,6793180.604624974,6807834.06862497,6821096.170124969,6832264.847624972,6840400.312874976
183.0,6590165.263574973,6595219.512599973,6598783.219049972,6602185.051649968,6605449.12102497,6608488.82887497,6612530.614874971,6618929.21437497,6627579.309374966,6637957.409624966,6649623.307874968,6662335.072124971,6676464.6813749755,6691440.790874977,6707884.6331249755,6724654.864124975,6741624.169874972,6758668.454624977,6776265.378374975,6793180.604624974,6807834.06862497,6821096.170124969,6832264.847624972,6840400.312874976
184.0,94518295.7325003,94588221.28500031,94648359.5825003,94702084.9350003,94752157.0900003,94803124.72250028,94867038.88750027,94960932.61750026,95081683.54500026,95209934.91000026,95341878.32750027,95471925.33250028,95606964.8500003,95748041.50250031,95888386.3925003,96025031.72500028,96161983.48250027,96299138.00500028,96434422.23000029,96563754.1225003,96685421.46250029,96801492.64750029,96911524.33500029,97013184.21250029
185.0,94518295.7325003,94588221.28500031,94648359.5825003,94702084.9350003,94752157.0900003,94803124.72250028,94867038.88750027,94960932.61750026,95081683.54500026,95209934.91000026,95341878.32750027,95471925.33250028,95606964.8500003,95748041.50250031,95888386.3925003,96025031.72500028,96161983.48250027,96299138.00500028,96434422.23000029,96563754.1225003,96685421.46250029,96801492.64750029,96911524.33500029,97013184.21250029
186.0,283554887.1975009,283764663.8550009,283945078.7475009,284106254.8050009,284256471.27000093,284409374.16750085,284601116.6625008,284882797.8525008,285245050.63500077,285629804.7300008,286025634.9825008,286415775.99750084,286820894.5500009,287244124.50750095,287665159.1775009,288075095.17500085,288485950.4475008,288897414.0150008,289303266.6900009,289691262.3675009,290056264.3875009,290404477.9425009,290734573.0050009,291039552.6375009
187.0,283554887.1975009,283764663.8550009,283945078.7475009,284106254.8050009,284256471.27000093,284409374.16750085,284601116.6625008,284882797.8525008,285245050.63500077,285629804.7300008,286025634.9825008,286415775.99750084,286820894.5500009,287244124.50750095,287665159.1775009,288075095.17500085,288485950.4475008,288897414.0150008,289303266.6900009,289691262.3675009,290056264.3875009,290404477.9425009,290734573.0050009,291039552.6375009
188.0,2296171.959249991,2297917.0464999895,2299423.59099999,2300715.9107499905,2301999.0962499906,2303287.9799999893,2304816.021499989,2307098.2322499896,2309538.4384999885,2312084.2162499875,2314602.7069999874,2317080.7759999884,2319580.3249999876,2322331.161249988,2325048.806249987,2327730.1592499875,2330497.754999988,2333376.8344999873,2336219.3397499872,2339269.8304999867,2342352.9379999866,2345242.6954999873,2347989.816999988,2350636.8632499874
189.0,2296171.959249991,2297917.0464999895,2299423.59099999,2300715.9107499905,2301999.0962499906,2303287.9799999893,2304816.021499989,2307098.2322499896,2309538.4384999885,2312084.2162499875,2314602.7069999874,2317080.7759999884,2319580.3249999876,2322331.161249988,2325048.806249987,2327730.1592499875,2330497.754999988,2333376.8344999873,2336219.3397499872,2339269.8304999867,2342352.9379999866,2345242.6954999873,2347989.816999988,2350636.8632499874
190.0,6888515.877749973,6893751.139499968,6898270.772999969,6902147.7322499715,6905997.288749972,6909863.939999968,6914448.064499967,6921294.696749968,6928615.315499965,6936252.648749962,6943808.120999962,6951242.327999965,6958740.974999962,6966993.483749963,6975146.41874996,6983190.477749962,6991493.264999963,7000130.503499962,7008658.019249962,7017809.49149996,7027058.81399996,7035728.086499962,7043969.450999964,7051910.589749962
191.0,6888515.877749973,6893751.139499968,6898270.772999969,6902147.7322499715,6905997.288749972,6909863.939999968,6914448.064499967,6921294.696749968,6928615.315499965,6936252.648749962,6943808.120999962,6951242.327999965,6958740.974999962,6966993.483749963,6975146.41874996,6983190.477749962,6991493.264999963,7000130.503499962,7008658.019249962,7017809.49149996,7027058.81399996,7035728.086499962,7043969.450999964,7051910.589749962
192.0,631589.5623499998,632075.162525,632435.7214750001,632800.4894750003,633128.0521500004,633509.1035000004,634038.2046750006,634874.5751750007,635958.2703500009,636967.005175001,637948.2185250011,638857.424150001,639811.5332500011,640650.608550001,641554.322850001,642508.5463250009,643611.0223250008,644641.9495750009,645638.7798250011,646581.7438250013,647413.3608250014,648116.8878000015,648673.9650250016,649200.3457750011
193.0,631589.5623499998,632075.162525,632435.7214750001,632800.4894750003,633128.0521500004,633509.1035000004,634038.2046750006,634874.5751750007,635958.2703500009,636967.005175001,637948.2185250011,638857.424150001,639811.5332500011,640650.608550001,641554.322850001,642508.5463250009,643611.0223250008,644641.9495750009,645638.7798250011,646581.7438250013,647413.3608250014,648116.8878000015,648673.9650250016,649200.3457750011
194.0,1894768.6870499994,1896225.4875750002,1897307.1644250005,1898401.468425001,1899384.156450001,1900527.3105000013,1902114.6140250019,1904623.725525002,1907874.811050003,1910901.015525003,1913844.6555750032,1916572.272450003,1919434.5997500033,1921951.8256500033,1924662.9685500031,1927525.6389750028,1930833.0669750026,1933925.8487250027,1936916.3394750035,1939745.231475004,1942240.0824750043,1944350.6634000046,1946021.8950750045,1947601.0373250032
195.0,1894768.6870499994,1896225.4875750002,1897307.1644250005,1898401.468425001,1899384.156450001,1900527.3105000013,1902114.6140250019,1904623.725525002,1907874.811050003,1910901.015525003,1913844.6555750032,1916572.272450003,1919434.5997500033,1921951.8256500033,1924662.9685500031,1927525.6389750028,1930833.0669750026,1933925.8487250027,1936916.3394750035,1939745.231475004,1942240.0824750043,1944350.6634000046,1946021.8950750045,1947601.0373250032
196.0,1242442.1985749954,1243457.9423249962,1244337.2905499965,1245118.928424997,1245756.0451999966,1246405.2364749964,1247324.5236499966,1248721.2026499975,1250643.9546499979,1252593.5878749979,1254373.4881249988,1256128.8596249986,1257968.4753749992,1260056.903874999,1262265.8696249991,1264141.2423749992,1265928.6908749992,1267839.1128749992,1269736.9638749997,1271592.748125,1273257.1328750004,1274749.5598500005,1276165.5653500007,1277440.5788500004
197.0,1242442.1985749954,1243457.9423249962,1244337.2905499965,1245118.928424997,1245756.0451999966,1246405.2364749964,1247324.5236499966,1248721.2026499975,1250643.9546499979,1252593.5878749979,1254373.4881249988,1256128.8596249986,1257968.4753749992,1260056.903874999,1262265.8696249991,1264141.2423749992,1265928.6908749992,1267839.1128749992,1269736.9638749997,1271592.748125,1273257.1328750004,1274749.5598500005,1276165.5653500007,1277440.5788500004
198.0,3727326.595724986,3730373.826974989,3733011.87164999,3735356.785274991,3737268.1355999894,3739215.7094249893,3741973.57094999,3746163.6079499926,3751931.8639499936,3757780.7636249936,3763120.4643749963,3768386.578874996,3773905.4261249974,3780170.7116249967,3786797.608874997,3792423.7271249974,3797786.0726249972,3803517.3386249975,3809210.891624999,3814778.244375,3819771.3986250013,3824248.6795500014,3828496.6960500022,3832321.7365500014
199.0,3727326.595724986,3730373.826974989,3733011.87164999,3735356.785274991,3737268.1355999894,3739215.7094249893,3741973.57094999,3746163.6079499926,3751931.8639499936,3757780.7636249936,3763120.4643749963,3768386.578874996,3773905.4261249974,3780170.7116249967,3786797.608874997,3792423.7271249974,3797786.0726249972,3803517.3386249975,3809210.891624999,3814778.244375,3819771.3986250013,3824248.6795500014,3828496.6960500022,3832321.7365500014
200.0,2113383.211397474,2114949.4214474745,2116207.9364474746,2117074.9811724736,2117910.7143724747,2118785.8040974746,2119964.8856224753,2121965.609622477,2124424.6616224777,2127382.3016224783,2130498.573622478,2133640.227622478,2137048.0143724782,2140406.685872479,2143851.871122481,2147317.5088724834,2150712.195122483,2154074.270122483,2157455.5763724814,2160915.4361224794,2164324.466872479,2167508.970122479,2170884.685872478,2173193.6021224787
201.0,2113383.211397474,2114949.4214474745,2116207.9364474746,2117074.9811724736,2117910.7143724747,2118785.8040974746,2119964.8856224753,2121965.609622477,2124424.6616224777,2127382.3016224783,2130498.573622478,2133640.227622478,2137048.0143724782,2140406.685872479,2143851.871122481,2147317.5088724834,2150712.195122483,2154074.270122483,2157455.5763724814,2160915.4361224794,2164324.466872479,2167508.970122479,2170884.685872478,2173193.6021224787
202.0,6340149.634192422,6344848.2643424235,6348623.809342423,6351224.94351742,6353732.143117424,6356357.412292424,6359894.656867426,6365896.828867432,6373273.984867433,6382146.904867435,6391495.7208674345,6400920.682867434,6411144.043117435,6421220.057617437,6431555.613367442,6441952.526617451,6452136.58536745,6462222.810367448,6472366.729117444,6482746.308367439,6492973.4006174365,6502526.910367437,6512654.057617433,6519580.806367436
203.0,6340149.634192422,6344848.2643424235,6348623.809342423,6351224.94351742,6353732.143117424,6356357.412292424,6359894.656867426,6365896.828867432,6373273.984867433,6382146.904867435,6391495.7208674345,6400920.682867434,6411144.043117435,6421220.057617437,6431555.613367442,6441952.526617451,6452136.58536745,6462222.810367448,6472366.729117444,6482746.308367439,6492973.4006174365,6502526.910367437,6512654.057617433,6519580.806367436
204.0,2216054.006749999,2219024.156499998,2220602.8822499975,2222072.1934999977,2223373.070249997,2224695.1179999975,2226878.010999997,2229584.6594999963,2232069.7254999964,2234521.251499998,2236940.107999999,2239359.9169999994,2241726.904,2244117.866499999,2246770.8462499985,2249375.8752499977,2251999.931499997,2254841.9852499967,2258193.7737499964,2261255.711999996,2264913.704249996,2268081.6737499954,2270897.194749994,2273573.7504999954
205.0,2216054.006749999,2219024.156499998,2220602.8822499975,2222072.1934999977,2223373.070249997,2224695.1179999975,2226878.010999997,2229584.6594999963,2232069.7254999964,2234521.251499998,2236940.107999999,2239359.9169999994,2241726.904,2244117.866499999,2246770.8462499985,2249375.8752499977,2251999.931499997,2254841.9852499967,2258193.7737499964,2261255.711999996,2264913.704249996,2268081.6737499954,2270897.194749994,2273573.7504999954
206.0,6648162.020249996,6657072.469499994,6661808.646749992,6666216.580499994,6670119.210749991,6674085.353999993,6680634.032999991,6688753.978499989,6696209.176499989,6703563.754499994,6710820.323999997,6718079.750999998,6725180.712,6732353.599499997,6740312.538749996,6748127.625749993,6755999.794499991,6764525.95574999,6774581.32124999,6783767.135999989,6794741.112749988,6804245.021249986,6812691.584249983,6820721.251499986
207.0,6648162.020249996,6657072.469499994,6661808.646749992,6666216.580499994,6670119.210749991,6674085.353999993,6680634.032999991,6688753.978499989,6696209.176499989,6703563.754499994,6710820.323999997,6718079.750999998,6725180.712,6732353.599499997,6740312.538749996,6748127.625749993,6755999.794499991,6764525.95574999,6774581.32124999,6783767.135999989,6794741.112749988,6804245.021249986,6812691.584249983,6820721.251499986
