0.0,0.0,1.0,2.0,3.0,4.0,5.0,6.0,7.0,8.0,9.0,10.0,11.0,12.0,13.0,14.0,15.0,16.0,17.0,18.0,19.0,20.0,21.0,22.0,23.0
0.0,3538399.3662500177,3541349.695750017,3543756.3547500176,3545828.084750017,3547819.2515000156,3549734.3357500155,3551806.358750015,3554639.1542500155,3558360.1950000166,3563198.3117500152,3568630.155500016,3574003.6765000164,3579695.8217500183,3585054.8702500165,3590428.1785000153,3596090.789750015,3601763.688500015,3607556.863750016,3613255.326750017,3619221.9515000167,3625108.516250017,3630616.947250018,3635994.0020000166,3641373.897250017
1.0,3538399.3662500177,3541349.695750017,3543756.3547500176,3545828.084750017,3547819.2515000156,3549734.3357500155,3551806.358750015,3554639.1542500155,3558360.1950000166,3563198.3117500152,3568630.155500016,3574003.6765000164,3579695.8217500183,3585054.8702500165,3590428.1785000153,3596090.789750015,3601763.688500015,3607556.863750016,3613255.326750017,3619221.9515000167,3625108.516250017,3630616.947250018,3635994.0020000166,3641373.897250017
2.0,10615198.098750053,10624049.087250052,10631269.064250052,10637484.254250051,10643457.754500046,10649203.007250046,10655419.076250045,10663917.462750047,10675080.58500005,10689594.935250046,10705890.466500048,10722011.029500049,10739087.465250054,10755164.61075005,10771284.535500046,10788272.369250044,10805291.065500045,10822670.591250047,10839765.98025005,10857665.85450005,10875325.54875005,10891850.841750054,10907982.00600005,10924121.691750051
3.0,10615198.098750053,10624049.087250052,10631269.064250052,10637484.254250051,10643457.754500046,10649203.007250046,10655419.076250045,10663917.462750047,10675080.58500005,10689594.935250046,10705890.466500048,10722011.029500049,10739087.465250054,10755164.61075005,10771284.535500046,10788272.369250044,10805291.065500045,10822670.591250047,10839765.98025005,10857665.85450005,10875325.54875005,10891850.841750054,10907982.00600005,10924121.691750051
4.0,1797943.685525007,1799581.0674000073,1801108.9925750075,1802451.4317000078,1803730.0614500076,1804939.2811250074,1806267.414500007,1807916.525125007,1809937.3116250068,1812148.4758750075,1814679.3681250063,1817447.8998750069,1820473.2193750066,1823495.527875007,1827056.8651250063,1830194.7051250064,1833594.6231250055,1836970.909875006,1840538.7868750058,1843735.5453750053,1846911.5456250052,1849740.551625005,1852149.113875005,1854805.6075500045
5.0,1797943.685525007,1799581.0674000073,1801108.9925750075,1802451.4317000078,1803730.0614500076,1804939.2811250074,1806267.414500007,1807916.525125007,1809937.3116250068,1812148.4758750075,1814679.3681250063,1817447.8998750069,1820473.2193750066,1823495.527875007,1827056.8651250063,1830194.7051250064,1833594.6231250055,1836970.909875006,1840538.7868750058,1843735.5453750053,1846911.5456250052,1849740.551625005,1852149.113875005,1854805.6075500045
6.0,5393831.056575021,5398743.202200022,5403326.9777250225,5407354.295100023,5411190.184350023,5414817.8433750225,5418802.24350002,5423749.5753750205,5429811.934875021,5436445.427625023,5444038.104375019,5452343.699625021,5461419.65812502,5470486.58362502,5481170.595375019,5490584.11537502,5500783.869375017,5510912.729625018,5521616.360625017,5531206.636125016,5540734.636875016,5549221.654875015,5556447.341625014,5564416.8226500135
7.0,5393831.056575021,5398743.202200022,5403326.9777250225,5407354.295100023,5411190.184350023,5414817.8433750225,5418802.24350002,5423749.5753750205,5429811.934875021,5436445.427625023,5444038.104375019,5452343.699625021,5461419.65812502,5470486.58362502,5481170.595375019,5490584.11537502,5500783.869375017,5510912.729625018,5521616.360625017,5531206.636125016,5540734.636875016,5549221.654875015,5556447.341625014,5564416.8226500135
8.0,13877398.723000156,13890050.530500151,13900508.468000151,13909512.814750152,13917727.851250155,13924705.21600015,13931809.291750146,13940418.992750145,13951717.799250131,13966694.191750137,13984086.271750137,14002919.741750142,14022996.104250146,14043306.321750147,14063784.981750144,14085734.071750142,14108134.754250145,14130087.784250153,14151463.851750147,14171993.47175015,14190698.511750154,14209029.716750162,14227088.431750165,14245228.92675017
9.0,13877398.723000156,13890050.530500151,13900508.468000151,13909512.814750152,13917727.851250155,13924705.21600015,13931809.291750146,13940418.992750145,13951717.799250131,13966694.191750137,13984086.271750137,14002919.741750142,14022996.104250146,14043306.321750147,14063784.981750144,14085734.071750142,14108134.754250145,14130087.784250153,14151463.851750147,14171993.47175015,14190698.511750154,14209029.716750162,14227088.431750165,14245228.92675017
10.0,41632196.16900047,41670151.59150045,41701525.40400045,41728538.44425046,41753183.55375046,41774115.64800045,41795427.87525044,41821256.97825044,41855153.39775039,41900082.57525041,41952258.81525041,42008759.22525042,42068988.31275044,42129918.96525044,42191354.94525043,42257202.215250425,42324404.26275043,42390263.35275046,42454391.555250436,42515980.41525045,42572095.53525046,42627089.15025049,42681265.2952505,42735686.78025051
11.0,41632196.16900047,41670151.59150045,41701525.40400045,41728538.44425046,41753183.55375046,41774115.64800045,41795427.87525044,41821256.97825044,41855153.39775039,41900082.57525041,41952258.81525041,42008759.22525042,42068988.31275044,42129918.96525044,42191354.94525043,42257202.215250425,42324404.26275043,42390263.35275046,42454391.555250436,42515980.41525045,42572095.53525046,42627089.15025049,42681265.2952505,42735686.78025051
12.0,3237321.3142749984,3240713.437299999,3243416.9279500004,3245820.4921000013,3248154.891025002,3250464.0715250024,3253051.5140250027,3256130.562800003,3260108.307500003,3264887.191500003,3270388.727750003,3276132.1487500025,3281896.927250003,3287504.6260000034,3293361.033250002,3299276.7125000022,3305531.3667500014,3312151.380250001,3318455.2722500004,3324443.838749999,3329760.348999998,3334830.562999997,3339552.3197499975,3344682.5092499973
13.0,3237321.3142749984,3240713.437299999,3243416.9279500004,3245820.4921000013,3248154.891025002,3250464.0715250024,3253051.5140250027,3256130.562800003,3260108.307500003,3264887.191500003,3270388.727750003,3276132.1487500025,3281896.927250003,3287504.6260000034,3293361.033250002,3299276.7125000022,3305531.3667500014,3312151.380250001,3318455.2722500004,3324443.838749999,3329760.348999998,3334830.562999997,3339552.3197499975,3344682.5092499973
14.0,9711963.942824995,9722140.311899997,9730250.783850001,9737461.476300005,9744464.673075005,9751392.214575008,9759154.542075008,9768391.68840001,9780324.922500009,9794661.57450001,9811166.183250008,9828396.446250007,9845690.781750008,9862513.87800001,9880083.099750007,9897830.137500007,9916594.100250004,9936454.140750002,9955365.816750001,9973331.516249998,9989281.046999995,10004491.68899999,10018656.959249992,10034047.527749993
15.0,9711963.942824995,9722140.311899997,9730250.783850001,9737461.476300005,9744464.673075005,9751392.214575008,9759154.542075008,9768391.68840001,9780324.922500009,9794661.57450001,9811166.183250008,9828396.446250007,9845690.781750008,9862513.87800001,9880083.099750007,9897830.137500007,9916594.100250004,9936454.140750002,9955365.816750001,9973331.516249998,9989281.046999995,10004491.68899999,10018656.959249992,10034047.527749993
16.0,1870279.9158500056,1872059.091350006,1873770.6703500059,1875164.829850006,1876391.3368500064,1877689.6358500065,1879175.928100007,1880786.2123500067,1882678.7988500064,1884922.6126000057,1887464.468100005,1889979.9776000057,1892515.5838500052,1894953.3333500056,1897446.932350006,1899974.1511000057,1902484.478350005,1905099.3426000052,1907927.712600006,1910470.0626000063,1912976.2096000062,1915355.926100006,1917684.5541000066,1919898.554850006
17.0,1870279.9158500056,1872059.091350006,1873770.6703500059,1875164.829850006,1876391.3368500064,1877689.6358500065,1879175.928100007,1880786.2123500067,1882678.7988500064,1884922.6126000057,1887464.468100005,1889979.9776000057,1892515.5838500052,1894953.3333500056,1897446.932350006,1899974.1511000057,1902484.478350005,1905099.3426000052,1907927.712600006,1910470.0626000063,1912976.2096000062,1915355.926100006,1917684.5541000066,1919898.554850006
18.0,5610839.747550016,5616177.274050018,5621312.011050018,5625494.489550018,5629174.010550019,5633068.907550019,5637527.784300021,5642358.63705002,5648036.396550019,5654767.837800017,5662393.404300015,5669939.932800017,5677546.751550015,5684860.000050017,5692340.797050018,5699922.453300017,5707453.435050015,5715298.027800016,5723783.137800018,5731410.187800019,5738928.628800019,5746067.778300018,5753053.6623000195,5759695.664550018
19.0,5610839.747550016,5616177.274050018,5621312.011050018,5625494.489550018,5629174.010550019,5633068.907550019,5637527.784300021,5642358.63705002,5648036.396550019,5654767.837800017,5662393.404300015,5669939.932800017,5677546.751550015,5684860.000050017,5692340.797050018,5699922.453300017,5707453.435050015,5715298.027800016,5723783.137800018,5731410.187800019,5738928.628800019,5746067.778300018,5753053.6623000195,5759695.664550018
20.0,2535832.1459999955,2538135.0232499936,2540152.1907499963,2541938.579499997,2543686.758499996,2545640.3854999957,2547836.7957499954,2550322.0479999958,2553464.873999996,2557076.433499996,2560985.171999996,2564869.215749995,2568800.607249997,2572838.118249997,2576678.997249996,2580477.737999995,2584714.925249995,2588777.174999995,2592819.1512499955,2596897.659999994,2600940.9152499936,2604475.545249994,2608171.371999995,2612098.8562499946
21.0,2535832.1459999955,2538135.0232499936,2540152.1907499963,2541938.579499997,2543686.758499996,2545640.3854999957,2547836.7957499954,2550322.0479999958,2553464.873999996,2557076.433499996,2560985.171999996,2564869.215749995,2568800.607249997,2572838.118249997,2576678.997249996,2580477.737999995,2584714.925249995,2588777.174999995,2592819.1512499955,2596897.659999994,2600940.9152499936,2604475.545249994,2608171.371999995,2612098.8562499946
22.0,7607496.437999986,7614405.069749981,7620456.572249989,7625815.738499992,7631060.275499987,7636921.1564999875,7643510.387249986,7650966.143999987,7660394.621999988,7671229.300499989,7682955.515999988,7694607.647249985,7706401.821749991,7718514.354749991,7730036.991749987,7741433.213999985,7754144.775749985,7766331.5249999855,7778457.453749986,7790692.979999982,7802822.74574998,7813426.635749982,7824514.115999985,7836296.568749984
23.0,7607496.437999986,7614405.069749981,7620456.572249989,7625815.738499992,7631060.275499987,7636921.1564999875,7643510.387249986,7650966.143999987,7660394.621999988,7671229.300499989,7682955.515999988,7694607.647249985,7706401.821749991,7718514.354749991,7730036.991749987,7741433.213999985,7754144.775749985,7766331.5249999855,7778457.453749986,7790692.979999982,7802822.74574998,7813426.635749982,7824514.115999985,7836296.568749984
24.0,1658587.493499994,1660395.562749994,1661638.5022499934,1662779.115499993,1664328.1212499933,1665296.4864999931,1666430.7144999935,1667929.4232499932,1669921.4172499932,1672113.620999994,1674741.136249993,1677490.859749993,1680366.1219999937,1683145.7854999942,1685965.3629999936,1688795.5537499944,1691520.1434999949,1694498.9392499947,1697510.8314999947,1700396.6582499943,1703130.9212499948,1705506.0927499947,1707897.8789999955,1710709.6564999959
25.0,1658587.493499994,1660395.562749994,1661638.5022499934,1662779.115499993,1664328.1212499933,1665296.4864999931,1666430.7144999935,1667929.4232499932,1669921.4172499932,1672113.620999994,1674741.136249993,1677490.859749993,1680366.1219999937,1683145.7854999942,1685965.3629999936,1688795.5537499944,1691520.1434999949,1694498.9392499947,1697510.8314999947,1700396.6582499943,1703130.9212499948,1705506.0927499947,1707897.8789999955,1710709.6564999959
26.0,4975762.480499982,4981186.688249982,4984915.50674998,4988337.3464999795,4992984.36374998,4995889.459499979,4999292.143499981,5003788.2697499795,5009764.251749979,5016340.862999982,5024223.408749979,5032472.579249979,5041098.365999981,5049437.356499983,5057896.088999981,5066386.661249983,5074560.430499985,5083496.817749985,5092532.494499984,5101189.974749982,5109392.763749984,5116518.278249985,5123693.636999987,5132128.969499988
27.0,4975762.480499982,4981186.688249982,4984915.50674998,4988337.3464999795,4992984.36374998,4995889.459499979,4999292.143499981,5003788.2697499795,5009764.251749979,5016340.862999982,5024223.408749979,5032472.579249979,5041098.365999981,5049437.356499983,5057896.088999981,5066386.661249983,5074560.430499985,5083496.817749985,5092532.494499984,5101189.974749982,5109392.763749984,5116518.278249985,5123693.636999987,5132128.969499988
28.0,61477628.70715046,61535001.71890045,61584729.42940047,61627766.05515046,61669059.26835045,61707403.23385044,61748223.92985043,61799355.65210042,61865341.30910042,61944600.30885043,62032725.060350426,62126598.895850435,62220889.16785044,62314993.51210044,62409852.38735044,62504316.90710045,62601115.127850436,62698973.76485042,62797902.36585042,62896155.23860043,62989383.50735043,63082506.60010044,63173632.028850436,63266500.02485045
29.0,61477628.70715046,61535001.71890045,61584729.42940047,61627766.05515046,61669059.26835045,61707403.23385044,61748223.92985043,61799355.65210042,61865341.30910042,61944600.30885043,62032725.060350426,62126598.895850435,62220889.16785044,62314993.51210044,62409852.38735044,62504316.90710045,62601115.127850436,62698973.76485042,62797902.36585042,62896155.23860043,62989383.50735043,63082506.60010044,63173632.028850436,63266500.02485045
30.0,184432886.12145138,184605005.15670136,184754188.2882014,184883298.16545138,185007177.80505136,185122209.70155132,185244671.7895513,185398066.95630127,185596023.92730126,185833800.92655128,186098175.18105128,186379796.68755132,186662667.50355133,186944980.5363013,187229557.16205132,187512950.72130135,187803345.3835513,188096921.29455125,188393707.09755126,188688465.7158013,188968150.52205127,189247519.8003013,189520896.0865513,189799500.07455134
31.0,184432886.12145138,184605005.15670136,184754188.2882014,184883298.16545138,185007177.80505136,185122209.70155132,185244671.7895513,185398066.95630127,185596023.92730126,185833800.92655128,186098175.18105128,186379796.68755132,186662667.50355133,186944980.5363013,187229557.16205132,187512950.72130135,187803345.3835513,188096921.29455125,188393707.09755126,188688465.7158013,188968150.52205127,189247519.8003013,189520896.0865513,189799500.07455134
32.0,1667424.6376250118,1669009.6723750122,1670444.5802750126,1671727.202675013,1672892.4461250133,1674056.379525013,1675336.6360250136,1677036.1072750133,1679039.3130250138,1681438.3880250133,1683976.3215250133,1686697.842025013,1689392.711775013,1692227.582525013,1694928.456275013,1697556.6355250129,1700171.9267750122,1702973.998025012,1705814.7025250124,1708645.0752750123,1711205.749025012,1713765.5052750118,1716273.4280250114,1718948.8170250119
33.0,1667424.6376250118,1669009.6723750122,1670444.5802750126,1671727.202675013,1672892.4461250133,1674056.379525013,1675336.6360250136,1677036.1072750133,1679039.3130250138,1681438.3880250133,1683976.3215250133,1686697.842025013,1689392.711775013,1692227.582525013,1694928.456275013,1697556.6355250129,1700171.9267750122,1702973.998025012,1705814.7025250124,1708645.0752750123,1711205.749025012,1713765.5052750118,1716273.4280250114,1718948.8170250119
34.0,5002273.912875036,5007029.017125037,5011333.740825038,5015181.60802504,5018677.338375039,5022169.138575039,5026009.908075041,5031108.3218250405,5037117.939075042,5044315.164075039,5051928.96457504,5060093.526075039,5068178.135325039,5076682.747575039,5084785.368825039,5092669.906575039,5100515.7803250365,5108921.994075036,5117444.1075750375,5125935.225825037,5133617.247075036,5141296.515825035,5148820.284075035,5156846.451075036
35.0,5002273.912875036,5007029.017125037,5011333.740825038,5015181.60802504,5018677.338375039,5022169.138575039,5026009.908075041,5031108.3218250405,5037117.939075042,5044315.164075039,5051928.96457504,5060093.526075039,5068178.135325039,5076682.747575039,5084785.368825039,5092669.906575039,5100515.7803250365,5108921.994075036,5117444.1075750375,5125935.225825037,5133617.247075036,5141296.515825035,5148820.284075035,5156846.451075036
36.0,996336.513450001,997083.5459000014,997780.6475500017,998411.1297000019,999006.5197500017,999650.6416250018,1000379.3148500023,1001301.6591750022,1002373.3569750026,1003648.9757250022,1005040.0397750025,1006686.6693500025,1008374.6799500023,1009898.1082750025,1011675.9359000025,1013483.9576500026,1015421.8674500027,1017291.2534000027,1019042.4230750024,1020702.4090500025,1022144.6026750027,1023596.2723750024,1024724.3126000023,1025840.5521750028
37.0,996336.513450001,997083.5459000014,997780.6475500017,998411.1297000019,999006.5197500017,999650.6416250018,1000379.3148500023,1001301.6591750022,1002373.3569750026,1003648.9757250022,1005040.0397750025,1006686.6693500025,1008374.6799500023,1009898.1082750025,1011675.9359000025,1013483.9576500026,1015421.8674500027,1017291.2534000027,1019042.4230750024,1020702.4090500025,1022144.6026750027,1023596.2723750024,1024724.3126000023,1025840.5521750028
38.0,2989009.540350003,2991250.6377000045,2993341.942650005,2995233.389100006,2997019.559250005,2998951.924875005,3001137.9445500067,3003904.977525007,3007120.0709250076,3010946.927175007,3015120.1193250073,3020060.0080500077,3025124.039850007,3029694.3248250075,3035027.807700007,3040451.8729500077,3046265.602350008,3051873.7602000083,3057127.269225007,3062107.227150007,3066433.808025008,3070788.817125007,3074172.937800007,3077521.6565250084
39.0,2989009.540350003,2991250.6377000045,2993341.942650005,2995233.389100006,2997019.559250005,2998951.924875005,3001137.9445500067,3003904.977525007,3007120.0709250076,3010946.927175007,3015120.1193250073,3020060.0080500077,3025124.039850007,3029694.3248250075,3035027.807700007,3040451.8729500077,3046265.602350008,3051873.7602000083,3057127.269225007,3062107.227150007,3066433.808025008,3070788.817125007,3074172.937800007,3077521.6565250084
40.0,2292428.154974984,2294422.800224984,2296151.0924749845,2297698.250974985,2299106.827449985,2300605.3756749844,2302380.764924984,2304453.328174984,2307060.8549249843,2310092.722174984,2314115.206924984,2318306.423174983,2322239.297174982,2326252.4024249827,2330404.0574249816,2334614.176674982,2339009.391424983,2343609.6436749827,2348186.8251749827,2352437.344424984,2356323.964424983,2359927.3824249837,2363896.0796749853,2367963.757174986
41.0,2292428.154974984,2294422.800224984,2296151.0924749845,2297698.250974985,2299106.827449985,2300605.3756749844,2302380.764924984,2304453.328174984,2307060.8549249843,2310092.722174984,2314115.206924984,2318306.423174983,2322239.297174982,2326252.4024249827,2330404.0574249816,2334614.176674982,2339009.391424983,2343609.6436749827,2348186.8251749827,2352437.344424984,2356323.964424983,2359927.3824249837,2363896.0796749853,2367963.757174986
42.0,6877284.464924952,6883268.400674952,6888453.277424954,6893094.7529249545,6897320.482349955,6901816.127024953,6907142.294774951,6913359.984524952,6921182.564774953,6930278.166524952,6942345.620774953,6954919.269524949,6966717.891524945,6978757.207274948,6991212.172274945,7003842.530024946,7017028.174274948,7030828.931024948,7044560.475524948,7057312.033274952,7068971.89327495,7079782.1472749505,7091688.239024956,7103891.271524958
43.0,6877284.464924952,6883268.400674952,6888453.277424954,6893094.7529249545,6897320.482349955,6901816.127024953,6907142.294774951,6913359.984524952,6921182.564774953,6930278.166524952,6942345.620774953,6954919.269524949,6966717.891524945,6978757.207274948,6991212.172274945,7003842.530024946,7017028.174274948,7030828.931024948,7044560.475524948,7057312.033274952,7068971.89327495,7079782.1472749505,7091688.239024956,7103891.271524958
44.0,2171772.609399992,2173579.291449991,2175420.9045999916,2176842.1375999916,2178278.018949992,2179720.8289249903,2181167.4058749904,2182802.3620499913,2185063.1768499906,2187659.1935249907,2190655.8047749903,2193792.5110249915,2196940.31327499,2200065.5567749906,2203695.959899991,2206993.5864249915,2210311.96642499,2213440.47059999,2216513.522999991,2219460.85022499,2222345.0084749884,2225162.9768999894,2227932.0037249885,2230993.429674989
45.0,2171772.609399992,2173579.291449991,2175420.9045999916,2176842.1375999916,2178278.018949992,2179720.8289249903,2181167.4058749904,2182802.3620499913,2185063.1768499906,2187659.1935249907,2190655.8047749903,2193792.5110249915,2196940.31327499,2200065.5567749906,2203695.959899991,2206993.5864249915,2210311.96642499,2213440.47059999,2216513.522999991,2219460.85022499,2222345.0084749884,2225162.9768999894,2227932.0037249885,2230993.429674989
46.0,6515317.828199976,6520737.874349973,6526262.713799975,6530526.412799975,6534834.056849976,6539162.486774971,6543502.217624972,6548407.086149974,6555189.530549971,6562977.580574973,6571967.414324971,6581377.533074975,6590820.9398249695,6600196.670324972,6611087.879699972,6620980.759274974,6630935.8992749695,6640321.411799969,6649540.568999974,6658382.550674969,6667035.025424965,6675488.930699969,6683796.011174966,6692980.289024968
47.0,6515317.828199976,6520737.874349973,6526262.713799975,6530526.412799975,6534834.056849976,6539162.486774971,6543502.217624972,6548407.086149974,6555189.530549971,6562977.580574973,6571967.414324971,6581377.533074975,6590820.9398249695,6600196.670324972,6611087.879699972,6620980.759274974,6630935.8992749695,6640321.411799969,6649540.568999974,6658382.550674969,6667035.025424965,6675488.930699969,6683796.011174966,6692980.289024968
48.0,1800278.1963500015,1801760.9083500023,1802966.4908500025,1804205.5741000026,1805338.2403500036,1806738.594525004,1807974.6162750048,1809526.6525250042,1811535.947275004,1813673.6705250049,1816133.2720250043,1818463.4250250044,1820721.314275004,1823144.4040250033,1825527.5777750034,1827920.555525003,1830317.1655250024,1832705.221275003,1835198.4515250036,1837740.371025004,1839944.9152750042,1842121.9355250048,1844328.794025005,1846440.3065250046
49.0,1800278.1963500015,1801760.9083500023,1802966.4908500025,1804205.5741000026,1805338.2403500036,1806738.594525004,1807974.6162750048,1809526.6525250042,1811535.947275004,1813673.6705250049,1816133.2720250043,1818463.4250250044,1820721.314275004,1823144.4040250033,1825527.5777750034,1827920.555525003,1830317.1655250024,1832705.221275003,1835198.4515250036,1837740.371025004,1839944.9152750042,1842121.9355250048,1844328.794025005,1846440.3065250046
50.0,5400834.589050004,5405282.725050007,5408899.4725500075,5412616.722300008,5416014.721050011,5420215.783575012,5423923.848825014,5428579.957575013,5434607.841825012,5441021.011575014,5448399.816075013,5455390.275075013,5462163.942825012,5469433.21207501,5476582.73332501,5483761.666575009,5490951.496575007,5498115.663825009,5505595.354575011,5513221.113075012,5519834.745825013,5526365.806575014,5532986.382075015,5539320.919575013
51.0,5400834.589050004,5405282.725050007,5408899.4725500075,5412616.722300008,5416014.721050011,5420215.783575012,5423923.848825014,5428579.957575013,5434607.841825012,5441021.011575014,5448399.816075013,5455390.275075013,5462163.942825012,5469433.21207501,5476582.73332501,5483761.666575009,5490951.496575007,5498115.663825009,5505595.354575011,5513221.113075012,5519834.745825013,5526365.806575014,5532986.382075015,5539320.919575013
52.0,1984971.6823249913,1986586.9380749916,1987898.133074992,1989140.4450749925,1990306.6795749927,1991512.9762499933,1992958.1682499938,1994753.8219999939,1996964.345999994,1999445.7502499935,2002333.889499994,2005488.894749994,2008692.065249995,2011844.090999995,2014976.193749995,2018111.3512499942,2021789.002999994,2025672.137499994,2029303.5654999947,2032442.6407499944,2035383.9009999947,2038202.4894999953,2040784.6689999953,2043169.1772499958
53.0,1984971.6823249913,1986586.9380749916,1987898.133074992,1989140.4450749925,1990306.6795749927,1991512.9762499933,1992958.1682499938,1994753.8219999939,1996964.345999994,1999445.7502499935,2002333.889499994,2005488.894749994,2008692.065249995,2011844.090999995,2014976.193749995,2018111.3512499942,2021789.002999994,2025672.137499994,2029303.5654999947,2032442.6407499944,2035383.9009999947,2038202.4894999953,2040784.6689999953,2043169.1772499958
54.0,5954915.046974974,5959760.814224975,5963694.399224976,5967421.335224978,5970920.038724978,5974538.92874998,5978874.504749982,5984261.465999981,5990893.037999982,5998337.250749981,6007001.668499982,6016466.684249982,6026076.195749985,6035532.272999985,6044928.581249985,6054334.053749982,6065367.008999982,6077016.412499982,6087910.696499984,6097327.922249983,6106151.702999984,6114607.4684999855,6122354.006999986,6129507.531749987
55.0,5954915.046974974,5959760.814224975,5963694.399224976,5967421.335224978,5970920.038724978,5974538.92874998,5978874.504749982,5984261.465999981,5990893.037999982,5998337.250749981,6007001.668499982,6016466.684249982,6026076.195749985,6035532.272999985,6044928.581249985,6054334.053749982,6065367.008999982,6077016.412499982,6087910.696499984,6097327.922249983,6106151.702999984,6114607.4684999855,6122354.006999986,6129507.531749987
56.0,4362237.604825013,4365589.636225013,4368499.014800013,4371041.705050013,4373483.732775014,4375846.414450014,4378385.607075015,4381680.872800017,4385520.8027000185,4390066.786725018,4395405.557325016,4400758.439400016,4406395.479425011,4411608.479200012,4416981.74167501,4422237.51360001,4427612.290100013,4432972.87190001,4438374.576225011,4443702.795600012,4448718.355325012,4453909.080250014,4458908.779400008,4464079.709875006
57.0,4362237.604825013,4365589.636225013,4368499.014800013,4371041.705050013,4373483.732775014,4375846.414450014,4378385.607075015,4381680.872800017,4385520.8027000185,4390066.786725018,4395405.557325016,4400758.439400016,4406395.479425011,4411608.479200012,4416981.74167501,4422237.51360001,4427612.290100013,4432972.87190001,4438374.576225011,4443702.795600012,4448718.355325012,4453909.080250014,4458908.779400008,4464079.709875006
58.0,13086712.81447504,13096768.90867504,13105497.04440004,13113125.115150038,13120451.198325042,13127539.243350042,13135156.821225045,13145042.61840005,13156562.408100056,13170200.360175055,13186216.671975046,13202275.318200048,13219186.438275034,13234825.437600035,13250945.22502503,13266712.540800031,13282836.87030004,13298918.615700029,13315123.728675032,13331108.386800036,13346155.065975035,13361727.24075004,13376726.338200023,13392239.129625019
59.0,13086712.81447504,13096768.90867504,13105497.04440004,13113125.115150038,13120451.198325042,13127539.243350042,13135156.821225045,13145042.61840005,13156562.408100056,13170200.360175055,13186216.671975046,13202275.318200048,13219186.438275034,13234825.437600035,13250945.22502503,13266712.540800031,13282836.87030004,13298918.615700029,13315123.728675032,13331108.386800036,13346155.065975035,13361727.24075004,13376726.338200023,13392239.129625019
60.0,1857348.9359750035,1859000.6469000038,1860655.0978750044,1861840.8223250033,1862930.2523500025,1864056.4299000022,1865465.5851000021,1867076.315100003,1869266.8598500027,1871793.0093500023,1874281.2418500024,1877197.1301000023,1879925.9066000022,1882667.8568500024,1885157.5138500023,1887925.2138500018,1890634.411100002,1893659.2606000013,1896626.9961000008,1899342.4738500009,1902207.409850001,1904958.0053500012,1907726.6588500014,1910478.6048500007
61.0,1857348.9359750035,1859000.6469000038,1860655.0978750044,1861840.8223250033,1862930.2523500025,1864056.4299000022,1865465.5851000021,1867076.315100003,1869266.8598500027,1871793.0093500023,1874281.2418500024,1877197.1301000023,1879925.9066000022,1882667.8568500024,1885157.5138500023,1887925.2138500018,1890634.411100002,1893659.2606000013,1896626.9961000008,1899342.4738500009,1902207.409850001,1904958.0053500012,1907726.6588500014,1910478.6048500007
62.0,5572046.80792501,5577001.940700011,5581965.293625013,5585522.46697501,5588790.757050008,5592169.289700007,5596396.755300006,5601228.945300009,5607800.579550008,5615379.028050007,5622843.725550007,5631591.390300007,5639777.719800007,5648003.570550008,5655472.541550007,5663775.641550005,5671903.233300006,5680977.781800004,5689880.988300002,5698027.421550003,5706622.229550003,5714874.0160500035,5723179.976550004,5731435.814550002
63.0,5572046.80792501,5577001.940700011,5581965.293625013,5585522.46697501,5588790.757050008,5592169.289700007,5596396.755300006,5601228.945300009,5607800.579550008,5615379.028050007,5622843.725550007,5631591.390300007,5639777.719800007,5648003.570550008,5655472.541550007,5663775.641550005,5671903.233300006,5680977.781800004,5689880.988300002,5698027.421550003,5706622.229550003,5714874.0160500035,5723179.976550004,5731435.814550002
64.0,1084140.9978999947,1085155.7085249946,1086073.6801499948,1086942.485449995,1087776.2422749945,1088681.8336499948,1089674.9280749946,1090872.699324994,1092293.3235749938,1093853.9630749938,1095545.1373249933,1097232.8168249931,1098819.8205749935,1100506.873824994,1102178.6985749942,1103838.2755749947,1105493.0885749948,1107245.8285749948,1109099.2348249946,1110756.0123249944,1112500.673574994,1114208.5100749936,1115784.296074994,1117285.664324993
65.0,1084140.9978999947,1085155.7085249946,1086073.6801499948,1086942.485449995,1087776.2422749945,1088681.8336499948,1089674.9280749946,1090872.699324994,1092293.3235749938,1093853.9630749938,1095545.1373249933,1097232.8168249931,1098819.8205749935,1100506.873824994,1102178.6985749942,1103838.2755749947,1105493.0885749948,1107245.8285749948,1109099.2348249946,1110756.0123249944,1112500.673574994,1114208.5100749936,1115784.296074994,1117285.664324993
66.0,3252422.993699984,3255467.1255749837,3258221.0404499844,3260827.4563499847,3263328.7268249835,3266045.5009499844,3269024.784224984,3272618.097974982,3276879.9707249813,3281561.8892249814,3286635.4119749796,3291698.4504749794,3296459.4617249807,3301520.6214749822,3306536.0957249827,3311514.826724984,3316479.2657249845,3321737.4857249847,3327297.7044749837,3332268.0369749833,3337502.020724982,3342625.530224981,3347352.8882249817,3351856.992974979
67.0,3252422.993699984,3255467.1255749837,3258221.0404499844,3260827.4563499847,3263328.7268249835,3266045.5009499844,3269024.784224984,3272618.097974982,3276879.9707249813,3281561.8892249814,3286635.4119749796,3291698.4504749794,3296459.4617249807,3301520.6214749822,3306536.0957249827,3311514.826724984,3316479.2657249845,3321737.4857249847,3327297.7044749837,3332268.0369749833,3337502.020724982,3342625.530224981,3347352.8882249817,3351856.992974979
68.0,2174680.5882499944,2176825.210499995,2178640.886749995,2180304.7152499934,2181780.9667499936,2183175.637249993,2184727.794499994,2186880.9624999934,2189638.883499992,2192726.430999993,2195951.633499991,2199390.3177499925,2202820.999749993,2206312.020999994,2209884.814999993,2213507.8884999934,2217376.854749993,2221179.5709999925,2224889.0474999924,2228817.5079999925,2232143.5959999915,2235582.5884999917,2238709.351499991,2242413.416999991
69.0,2174680.5882499944,2176825.210499995,2178640.886749995,2180304.7152499934,2181780.9667499936,2183175.637249993,2184727.794499994,2186880.9624999934,2189638.883499992,2192726.430999993,2195951.633499991,2199390.3177499925,2202820.999749993,2206312.020999994,2209884.814999993,2213507.8884999934,2217376.854749993,2221179.5709999925,2224889.0474999924,2228817.5079999925,2232143.5959999915,2235582.5884999917,2238709.351499991,2242413.416999991
70.0,6524041.764749983,6530475.631499985,6535922.660249985,6540914.145749981,6545342.90024998,6549526.9117499795,6554183.383499982,6560642.887499981,6568916.650499976,6578179.292999979,6587854.900499973,6598170.953249978,6608462.999249979,6618936.062999982,6629654.444999979,6640523.66549998,6652130.564249979,6663538.712999977,6674667.142499978,6686452.523999978,6696430.787999975,6706747.7654999755,6716128.054499973,6727240.250999973
71.0,6524041.764749983,6530475.631499985,6535922.660249985,6540914.145749981,6545342.90024998,6549526.9117499795,6554183.383499982,6560642.887499981,6568916.650499976,6578179.292999979,6587854.900499973,6598170.953249978,6608462.999249979,6618936.062999982,6629654.444999979,6640523.66549998,6652130.564249979,6663538.712999977,6674667.142499978,6686452.523999978,6696430.787999975,6706747.7654999755,6716128.054499973,6727240.250999973
72.0,1527332.9222500047,1528750.5910000044,1530053.148000004,1531257.1595000043,1532313.0807500037,1533345.9297500032,1534508.8375000032,1536106.2325000025,1538136.7007500022,1540424.184000002,1542853.9742500014,1545420.7170000006,1547967.8775000006,1550498.4265000008,1552859.2497499997,1555459.6994999996,1558332.5570000003,1560928.883500001,1563384.1990000012,1565990.3850000016,1568275.2105000014,1570851.497000001,1573088.8500000013,1575379.9715
73.0,1527332.9222500047,1528750.5910000044,1530053.148000004,1531257.1595000043,1532313.0807500037,1533345.9297500032,1534508.8375000032,1536106.2325000025,1538136.7007500022,1540424.184000002,1542853.9742500014,1545420.7170000006,1547967.8775000006,1550498.4265000008,1552859.2497499997,1555459.6994999996,1558332.5570000003,1560928.883500001,1563384.1990000012,1565990.3850000016,1568275.2105000014,1570851.497000001,1573088.8500000013,1575379.9715
74.0,4581998.766750014,4586251.773000013,4590159.444000012,4593771.478500012,4596939.242250011,4600037.78925001,4603526.5125000095,4608318.697500007,4614410.102250006,4621272.552000006,4628561.922750004,4636262.151000002,4643903.632500002,4651495.279500002,4658577.749249999,4666379.098499998,4674997.671000001,4682786.650500003,4690152.597000004,4697971.155000005,4704825.631500004,4712554.491000002,4719266.550000004,4726139.9145
75.0,4581998.766750014,4586251.773000013,4590159.444000012,4593771.478500012,4596939.242250011,4600037.78925001,4603526.5125000095,4608318.697500007,4614410.102250006,4621272.552000006,4628561.922750004,4636262.151000002,4643903.632500002,4651495.279500002,4658577.749249999,4666379.098499998,4674997.671000001,4682786.650500003,4690152.597000004,4697971.155000005,4704825.631500004,4712554.491000002,4719266.550000004,4726139.9145
76.0,8555867.758749966,8564982.257249968,8572305.63949997,8578518.371999966,8584183.86349997,8589197.031999966,8594235.158499964,8600784.65149997,8608937.136749974,8619120.22049998,8630556.648249974,8642843.119499974,8655611.256999971,8668019.694249975,8680337.87649998,8692764.117499981,8705785.767749991,8718381.00899999,8730478.710499993,8743628.182249995,8755711.546499996,8768700.120749995,8780473.96574999,8793108.970749997
77.0,8555867.758749966,8564982.257249968,8572305.63949997,8578518.371999966,8584183.86349997,8589197.031999966,8594235.158499964,8600784.65149997,8608937.136749974,8619120.22049998,8630556.648249974,8642843.119499974,8655611.256999971,8668019.694249975,8680337.87649998,8692764.117499981,8705785.767749991,8718381.00899999,8730478.710499993,8743628.182249995,8755711.546499996,8768700.120749995,8780473.96574999,8793108.970749997
78.0,25667603.276249897,25694946.771749906,25716916.91849991,25735555.1159999,25752551.590499908,25767591.095999897,25782705.47549989,25802353.954499908,25826811.41024992,25857360.66149994,25891669.94474992,25928529.35849992,25966833.770999916,26004059.082749926,26041013.629499942,26078292.352499943,26117357.303249974,26155143.026999973,26191436.131499976,26230884.546749987,26267134.639499985,26306100.362249985,26341421.89724997,26379326.91224999
79.0,25667603.276249897,25694946.771749906,25716916.91849991,25735555.1159999,25752551.590499908,25767591.095999897,25782705.47549989,25802353.954499908,25826811.41024992,25857360.66149994,25891669.94474992,25928529.35849992,25966833.770999916,26004059.082749926,26041013.629499942,26078292.352499943,26117357.303249974,26155143.026999973,26191436.131499976,26230884.546749987,26267134.639499985,26306100.362249985,26341421.89724997,26379326.91224999
80.0,1427220.3362499934,1428618.0614999933,1429787.6397499929,1430736.2294999934,1431598.7117499933,1432441.7942499928,1433451.070999993,1434941.2457499928,1436548.821749993,1438325.0159999921,1440232.3339999916,1442472.8984999913,1444528.9022499917,1446626.7014999916,1448498.152249991,1450535.536749991,1452715.1397499917,1454913.7099999913,1456921.3187499905,1459041.0382499907,1460981.2394999901,1462932.1914999902,1464680.8834999902,1466531.4464999908
81.0,1427220.3362499934,1428618.0614999933,1429787.6397499929,1430736.2294999934,1431598.7117499933,1432441.7942499928,1433451.070999993,1434941.2457499928,1436548.821749993,1438325.0159999921,1440232.3339999916,1442472.8984999913,1444528.9022499917,1446626.7014999916,1448498.152249991,1450535.536749991,1452715.1397499917,1454913.7099999913,1456921.3187499905,1459041.0382499907,1460981.2394999901,1462932.1914999902,1464680.8834999902,1466531.4464999908
82.0,4281661.0087499805,4285854.18449998,4289362.919249979,4292208.68849998,4294796.13524998,4297325.382749978,4300353.212999979,4304823.737249978,4309646.465249979,4314975.047999976,4320697.001999975,4327418.695499973,4333586.706749975,4339880.104499975,4345494.456749973,4351606.610249973,4358145.419249975,4364741.129999974,4370763.956249972,4377123.114749972,4382943.718499971,4388796.57449997,4394042.650499971,4399594.339499973
83.0,4281661.0087499805,4285854.18449998,4289362.919249979,4292208.68849998,4294796.13524998,4297325.382749978,4300353.212999979,4304823.737249978,4309646.465249979,4314975.047999976,4320697.001999975,4327418.695499973,4333586.706749975,4339880.104499975,4345494.456749973,4351606.610249973,4358145.419249975,4364741.129999974,4370763.956249972,4377123.114749972,4382943.718499971,4388796.57449997,4394042.650499971,4399594.339499973
84.0,1205667.6587500037,1206913.6575000035,1207904.3812500034,1208823.5982500021,1209823.4350000015,1210597.7945000015,1211468.0217500012,1212675.2585000007,1214193.732250001,1215794.1585000006,1217618.9037499998,1219335.1249999993,1221036.3569999994,1222916.2462499994,1224683.2409999997,1226630.2559999994,1228429.4477499994,1230400.9379999987,1232225.1899999985,1233987.594249999,1235756.7577499994,1237500.7737499992,1239197.1517499995,1240916.460249999
85.0,1205667.6587500037,1206913.6575000035,1207904.3812500034,1208823.5982500021,1209823.4350000015,1210597.7945000015,1211468.0217500012,1212675.2585000007,1214193.732250001,1215794.1585000006,1217618.9037499998,1219335.1249999993,1221036.3569999994,1222916.2462499994,1224683.2409999997,1226630.2559999994,1228429.4477499994,1230400.9379999987,1232225.1899999985,1233987.594249999,1235756.7577499994,1237500.7737499992,1239197.1517499995,1240916.460249999
86.0,3617002.976250011,3620740.9725000104,3623713.14375001,3626470.7947500064,3629470.3050000044,3631793.383500004,3634404.0652500037,3638025.7755000023,3642581.196750003,3647382.4755000016,3652856.7112499997,3658005.374999998,3663109.070999998,3668748.738749998,3674049.7229999993,3679890.7679999983,3685288.343249998,3691202.813999996,3696675.5699999956,3701962.7827499965,3707270.273249998,3712502.3212499977,3717591.4552499987,3722749.380749997
87.0,3617002.976250011,3620740.9725000104,3623713.14375001,3626470.7947500064,3629470.3050000044,3631793.383500004,3634404.0652500037,3638025.7755000023,3642581.196750003,3647382.4755000016,3652856.7112499997,3658005.374999998,3663109.070999998,3668748.738749998,3674049.7229999993,3679890.7679999983,3685288.343249998,3691202.813999996,3696675.5699999956,3701962.7827499965,3707270.273249998,3712502.3212499977,3717591.4552499987,3722749.380749997
88.0,1423167.1984749988,1424166.057499998,1425051.525149998,1426016.1727499978,1426826.1507749981,1427599.0071749983,1428386.6730749987,1429587.8980499983,1430906.7153749983,1432548.0078749987,1434349.4313749985,1436267.5186249989,1438256.5258749991,1440267.861874999,1442114.7225749996,1443832.9077999995,1445608.5110499994,1447546.6713500002,1449400.3606250004,1451095.2639750007,1452555.3176250004,1453957.2037000004,1455377.3234250003,1457039.7057250005
89.0,1423167.1984749988,1424166.057499998,1425051.525149998,1426016.1727499978,1426826.1507749981,1427599.0071749983,1428386.6730749987,1429587.8980499983,1430906.7153749983,1432548.0078749987,1434349.4313749985,1436267.5186249989,1438256.5258749991,1440267.861874999,1442114.7225749996,1443832.9077999995,1445608.5110499994,1447546.6713500002,1449400.3606250004,1451095.2639750007,1452555.3176250004,1453957.2037000004,1455377.3234250003,1457039.7057250005
90.0,4269501.595424997,4272498.172499994,4275154.575449994,4278048.518249993,4280478.452324994,4282797.021524995,4285160.019224996,4288763.694149995,4292720.146124994,4297644.023624996,4303048.294124995,4308802.555874997,4314769.577624997,4320803.585624997,4326344.167724999,4331498.723399999,4336825.533149999,4342640.01405,4348201.081875001,4353285.791925002,4357665.952875001,4361871.611100001,4366131.970275001,4371119.117175002
91.0,4269501.595424997,4272498.172499994,4275154.575449994,4278048.518249993,4280478.452324994,4282797.021524995,4285160.019224996,4288763.694149995,4292720.146124994,4297644.023624996,4303048.294124995,4308802.555874997,4314769.577624997,4320803.585624997,4326344.167724999,4331498.723399999,4336825.533149999,4342640.01405,4348201.081875001,4353285.791925002,4357665.952875001,4361871.611100001,4366131.970275001,4371119.117175002
92.0,4507359.169169995,4510558.376319993,4513322.683627493,4515741.430862496,4517931.403394994,4520080.690554996,4522347.326704998,4524967.521104995,4528244.487229997,4532036.622954998,4536427.76938,4540910.103280001,4545347.937755001,4549927.48713,4554486.342405001,4558884.870480002,4563431.886880002,4568239.227655001,4573330.143404998,4578098.226904997,4582909.479454999,4587534.480279997,4592132.299154996,4596700.118955
93.0,4507359.169169995,4510558.376319993,4513322.683627493,4515741.430862496,4517931.403394994,4520080.690554996,4522347.326704998,4524967.521104995,4528244.487229997,4532036.622954998,4536427.76938,4540910.103280001,4545347.937755001,4549927.48713,4554486.342405001,4558884.870480002,4563431.886880002,4568239.227655001,4573330.143404998,4578098.226904997,4582909.479454999,4587534.480279997,4592132.299154996,4596700.118955
94.0,13522077.507509984,13531675.12895998,13539968.050882477,13547224.292587487,13553794.210184984,13560242.071664989,13567041.980114993,13574902.563314985,13584733.461689992,13596109.868864994,13609283.308140002,13622730.309840005,13636043.813265003,13649782.46139,13663459.027215002,13676654.611440007,13690295.660640005,13704717.682965003,13719990.430214994,13734294.680714991,13748728.438364998,13762603.440839991,13776396.897464987,13790100.356865
95.0,13522077.507509984,13531675.12895998,13539968.050882477,13547224.292587487,13553794.210184984,13560242.071664989,13567041.980114993,13574902.563314985,13584733.461689992,13596109.868864994,13609283.308140002,13622730.309840005,13636043.813265003,13649782.46139,13663459.027215002,13676654.611440007,13690295.660640005,13704717.682965003,13719990.430214994,13734294.680714991,13748728.438364998,13762603.440839991,13776396.897464987,13790100.356865
96.0,1362101.8355000045,1363337.0837500049,1364514.4465000045,1365555.2197500044,1366531.603000004,1367523.3390000043,1368572.1642500048,1369879.487750005,1371592.6182500047,1373595.6807500042,1375776.9900000044,1378083.7630000045,1380473.2547500047,1382633.6897500046,1384921.6310000042,1387298.5542500042,1389660.1937500047,1392141.354500005,1394580.7757500047,1396825.5482500049,1398914.3165000046,1400869.2005000045,1402726.0820000032,1404698.246250003
97.0,1362101.8355000045,1363337.0837500049,1364514.4465000045,1365555.2197500044,1366531.603000004,1367523.3390000043,1368572.1642500048,1369879.487750005,1371592.6182500047,1373595.6807500042,1375776.9900000044,1378083.7630000045,1380473.2547500047,1382633.6897500046,1384921.6310000042,1387298.5542500042,1389660.1937500047,1392141.354500005,1394580.7757500047,1396825.5482500049,1398914.3165000046,1400869.2005000045,1402726.0820000032,1404698.246250003
98.0,4086305.506500013,4090011.2512500146,4093543.3395000137,4096665.659250013,4099594.8090000125,4102570.017000013,4105716.492750014,4109638.463250015,4114777.854750014,4120787.042250013,4127330.9700000132,4134251.2890000134,4141419.764250014,4147901.0692500137,4154764.8930000127,4161895.6627500127,4168980.5812500142,4176424.063500015,4183742.327250014,4190476.644750015,4196742.949500014,4202607.601500014,4208178.24600001,4214094.738750009
99.0,4086305.506500013,4090011.2512500146,4093543.3395000137,4096665.659250013,4099594.8090000125,4102570.017000013,4105716.492750014,4109638.463250015,4114777.854750014,4120787.042250013,4127330.9700000132,4134251.2890000134,4141419.764250014,4147901.0692500137,4154764.8930000127,4161895.6627500127,4168980.5812500142,4176424.063500015,4183742.327250014,4190476.644750015,4196742.949500014,4202607.601500014,4208178.24600001,4214094.738750009
100.0,4822787.17913747,4827206.51286247,4830834.526162468,4834115.958412465,4837373.572312462,4840460.083762464,4844100.1414374625,4848867.900887462,4855041.430912461,4862480.08556246,4870137.172912463,4878278.060937464,4886414.633062465,4895009.114937466,4903262.327862465,4911635.869287465,4920179.74331247,4928740.689337471,4937096.8547874745,4945210.604787474,4952919.356312474,4959899.071512473,4967231.7371624755,4974273.854812474
101.0,4822787.17913747,4827206.51286247,4830834.526162468,4834115.958412465,4837373.572312462,4840460.083762464,4844100.1414374625,4848867.900887462,4855041.430912461,4862480.08556246,4870137.172912463,4878278.060937464,4886414.633062465,4895009.114937466,4903262.327862465,4911635.869287465,4920179.74331247,4928740.689337471,4937096.8547874745,4945210.604787474,4952919.356312474,4959899.071512473,4967231.7371624755,4974273.854812474
102.0,14468361.53741241,14481619.53858741,14492503.578487404,14502347.875237394,14512120.716937385,14521380.251287393,14532300.424312387,14546603.702662386,14565124.292737383,14587440.25668738,14610411.518737387,14634834.182812393,14659243.899187395,14685027.344812397,14709786.983587395,14734907.607862394,14760539.229937408,14786222.068012413,14811290.564362423,14835631.814362422,14858758.068937423,14879697.21453742,14901695.211487427,14922821.564437423
103.0,14468361.53741241,14481619.53858741,14492503.578487404,14502347.875237394,14512120.716937385,14521380.251287393,14532300.424312387,14546603.702662386,14565124.292737383,14587440.25668738,14610411.518737387,14634834.182812393,14659243.899187395,14685027.344812397,14709786.983587395,14734907.607862394,14760539.229937408,14786222.068012413,14811290.564362423,14835631.814362422,14858758.068937423,14879697.21453742,14901695.211487427,14922821.564437423
104.0,8463742.828750003,8470643.44925,8476594.653500002,8481775.194750002,8486594.996,8491303.41425,8496039.066249995,8502345.676749991,8510645.785499984,8521275.62299998,8532648.813999977,8545018.20249997,8557460.66699996,8569149.437249959,8580526.729249962,8591888.604749959,8603716.759749962,8615149.958249964,8626827.67199997,8638901.778499976,8650389.818749974,8661513.901499974,8672419.844749974,8683467.479249965
105.0,8463742.828750003,8470643.44925,8476594.653500002,8481775.194750002,8486594.996,8491303.41425,8496039.066249995,8502345.676749991,8510645.785499984,8521275.62299998,8532648.813999977,8545018.20249997,8557460.66699996,8569149.437249959,8580526.729249962,8591888.604749959,8603716.759749962,8615149.958249964,8626827.67199997,8638901.778499976,8650389.818749974,8661513.901499974,8672419.844749974,8683467.479249965
106.0,25391228.48625001,25411930.34775,25429783.960500006,25445325.584250003,25459784.987999998,25473910.242749996,25488117.19874998,25507037.030249976,25531937.356499955,25563826.868999936,25597946.44199993,25635054.607499912,25672382.000999883,25707448.311749876,25741580.187749885,25775665.814249877,25811150.279249884,25845449.87474989,25880483.015999913,25916705.335499927,25951169.456249923,25984541.704499923,26017259.534249924,26050402.437749896
107.0,25391228.48625001,25411930.34775,25429783.960500006,25445325.584250003,25459784.987999998,25473910.242749996,25488117.19874998,25507037.030249976,25531937.356499955,25563826.868999936,25597946.44199993,25635054.607499912,25672382.000999883,25707448.311749876,25741580.187749885,25775665.814249877,25811150.279249884,25845449.87474989,25880483.015999913,25916705.335499927,25951169.456249923,25984541.704499923,26017259.534249924,26050402.437749896
108.0,2675757.612300009,2678073.819550008,2680030.285050009,2681767.7560500083,2683872.146050009,2685502.2963000103,2687213.371050012,2689607.7215500125,2692810.386800013,2696726.688550012,2701377.929300012,2706243.1163000125,2711299.0825500125,2715872.953550011,2720532.5065500126,2725510.563050013,2730882.1533000134,2736597.408300014,2742226.5078000138,2746971.1970500136,2751642.4653000142,2755855.369550014,2760277.116800013,2764159.240050014
109.0,2675757.612300009,2678073.819550008,2680030.285050009,2681767.7560500083,2683872.146050009,2685502.2963000103,2687213.371050012,2689607.7215500125,2692810.386800013,2696726.688550012,2701377.929300012,2706243.1163000125,2711299.0825500125,2715872.953550011,2720532.5065500126,2725510.563050013,2730882.1533000134,2736597.408300014,2742226.5078000138,2746971.1970500136,2751642.4653000142,2755855.369550014,2760277.116800013,2764159.240050014
110.0,8027272.8369000275,8034221.458650025,8040090.855150027,8045303.268150025,8051616.438150027,8056506.88890003,8061640.113150036,8068823.164650038,8078431.160400039,8090180.065650037,8104133.787900036,8118729.348900037,8133897.2476500375,8147618.860650033,8161597.519650038,8176531.689150039,8192646.45990004,8209792.224900043,8226679.523400041,8240913.591150041,8254927.395900043,8267566.108650042,8280831.350400039,8292477.720150042
111.0,8027272.8369000275,8034221.458650025,8040090.855150027,8045303.268150025,8051616.438150027,8056506.88890003,8061640.113150036,8068823.164650038,8078431.160400039,8090180.065650037,8104133.787900036,8118729.348900037,8133897.2476500375,8147618.860650033,8161597.519650038,8176531.689150039,8192646.45990004,8209792.224900043,8226679.523400041,8240913.591150041,8254927.395900043,8267566.108650042,8280831.350400039,8292477.720150042
112.0,1958367.3140749973,1959530.0035749977,1960538.7020749978,1961558.344024998,1962475.4112749973,1963431.516599997,1964444.1073499974,1965704.7395999976,1967225.416849997,1968939.613849997,1970922.3048499972,1973090.708849996,1975115.1055999957,1977081.5335999958,1979068.0570999957,1981136.771849996,1983098.1678499968,1985173.7725999972,1987103.4965999967,1989119.6710999978,1990975.3398499987,1992945.772849999,1994798.491849998,1996686.0145999978
113.0,1958367.3140749973,1959530.0035749977,1960538.7020749978,1961558.344024998,1962475.4112749973,1963431.516599997,1964444.1073499974,1965704.7395999976,1967225.416849997,1968939.613849997,1970922.3048499972,1973090.708849996,1975115.1055999957,1977081.5335999958,1979068.0570999957,1981136.771849996,1983098.1678499968,1985173.7725999972,1987103.4965999967,1989119.6710999978,1990975.3398499987,1992945.772849999,1994798.491849998,1996686.0145999978
114.0,5875101.942224992,5878590.010724993,5881616.106224993,5884675.0320749935,5887426.233824992,5890294.549799991,5893332.322049992,5897114.218799993,5901676.250549991,5906818.841549991,5912766.9145499915,5919272.126549988,5925345.316799987,5931244.600799987,5937204.171299987,5943410.315549988,5949294.50354999,5955521.317799992,5961310.48979999,5967359.013299993,5972926.019549996,5978837.318549996,5984395.475549994,5990058.043799994
115.0,5875101.942224992,5878590.010724993,5881616.106224993,5884675.0320749935,5887426.233824992,5890294.549799991,5893332.322049992,5897114.218799993,5901676.250549991,5906818.841549991,5912766.9145499915,5919272.126549988,5925345.316799987,5931244.600799987,5937204.171299987,5943410.315549988,5949294.50354999,5955521.317799992,5961310.48979999,5967359.013299993,5972926.019549996,5978837.318549996,5984395.475549994,5990058.043799994
116.0,2582668.978749995,2585131.815499995,2587313.1397499954,2589270.610249996,2591129.060999997,2592854.497749997,2594919.624999998,2597470.1282499977,2600659.0429999977,2604428.028499997,2608532.5909999963,2613004.595249997,2617458.950249997,2621859.9677499966,2626252.5587499975,2630838.1304999976,2635134.0844999985,2639726.5570000005,2644278.777000001,2648909.4345,2653419.0970000005,2657701.864999999,2661963.310249999,2666454.985749999
117.0,2582668.978749995,2585131.815499995,2587313.1397499954,2589270.610249996,2591129.060999997,2592854.497749997,2594919.624999998,2597470.1282499977,2600659.0429999977,2604428.028499997,2608532.5909999963,2613004.595249997,2617458.950249997,2621859.9677499966,2626252.5587499975,2630838.1304999976,2635134.0844999985,2639726.5570000005,2644278.777000001,2648909.4345,2653419.0970000005,2657701.864999999,2661963.310249999,2666454.985749999
118.0,7748006.936249985,7755395.446499985,7761939.419249986,7767811.830749989,7773387.182999991,7778563.49324999,7784758.874999994,7792410.384749994,7801977.128999993,7813284.085499992,7825597.772999989,7839013.7857499905,7852376.850749991,7865579.90324999,7878757.676249992,7892514.391499992,7905402.253499996,7919179.671000002,7932836.331000004,7946728.3035,7960257.291000001,7973105.594999997,7985889.9307499975,7999364.957249997
119.0,7748006.936249985,7755395.446499985,7761939.419249986,7767811.830749989,7773387.182999991,7778563.49324999,7784758.874999994,7792410.384749994,7801977.128999993,7813284.085499992,7825597.772999989,7839013.7857499905,7852376.850749991,7865579.90324999,7878757.676249992,7892514.391499992,7905402.253499996,7919179.671000002,7932836.331000004,7946728.3035,7960257.291000001,7973105.594999997,7985889.9307499975,7999364.957249997
120.0,2392530.6856687465,2394523.8980924957,2396263.2370162443,2397765.5636399942,2399246.224113745,2401781.5529624945,2403337.6415612437,2405343.769959993,2407522.389383743,2410131.499066243,2413115.2613062435,2416002.8836462433,2418906.510019994,2421972.926243745,2424882.287767495,2427784.7749412456,2430564.2837399957,2433427.032653746,2436480.945477497,2439539.7144162483,2442617.4168212484,2445395.1655199984,2448236.4551187474,2451330.7048587473
121.0,2392530.6856687465,2394523.8980924957,2396263.2370162443,2397765.5636399942,2399246.224113745,2401781.5529624945,2403337.6415612437,2405343.769959993,2407522.389383743,2410131.499066243,2413115.2613062435,2416002.8836462433,2418906.510019994,2421972.926243745,2424882.287767495,2427784.7749412456,2430564.2837399957,2433427.032653746,2436480.945477497,2439539.7144162483,2442617.4168212484,2445395.1655199984,2448236.4551187474,2451330.7048587473
122.0,7177592.05700624,7183571.694277488,7188789.711048733,7193296.690919982,7197738.672341235,7205344.658887483,7210012.924683731,7216031.309879979,7222567.16815123,7230394.497198729,7239345.783918731,7248008.65093873,7256719.530059982,7265918.778731234,7274646.863302485,7283354.324823737,7291692.8512199875,7300281.097961239,7309442.8364324905,7318619.143248744,7327852.250463745,7336185.496559995,7344709.365356242,7353992.114576242
123.0,7177592.05700624,7183571.694277488,7188789.711048733,7193296.690919982,7197738.672341235,7205344.658887483,7210012.924683731,7216031.309879979,7222567.16815123,7230394.497198729,7239345.783918731,7248008.65093873,7256719.530059982,7265918.778731234,7274646.863302485,7283354.324823737,7291692.8512199875,7300281.097961239,7309442.8364324905,7318619.143248744,7327852.250463745,7336185.496559995,7344709.365356242,7353992.114576242
124.0,68689979.91742554,68749070.0874255,68799794.57867554,68844605.41392559,68887944.6849256,68928895.61732565,68973446.56607564,69029984.84482563,69101399.0673256,69186813.66307557,69281623.02982554,69381289.56732556,69481535.4713256,69581130.47307557,69680480.81707558,69780457.14732555,69882485.27107553,69987582.5245755,70091747.55257547,70192612.31232548,70290341.75582547,70385164.34282553,70477215.03307553,70571017.47482553
125.0,68689979.91742554,68749070.0874255,68799794.57867554,68844605.41392559,68887944.6849256,68928895.61732565,68973446.56607564,69029984.84482563,69101399.0673256,69186813.66307557,69281623.02982554,69381289.56732556,69481535.4713256,69581130.47307557,69680480.81707558,69780457.14732555,69882485.27107553,69987582.5245755,70091747.55257547,70192612.31232548,70290341.75582547,70385164.34282553,70477215.03307553,70571017.47482553
126.0,206069939.75227663,206247210.2622765,206399383.73602661,206533816.24177676,206663834.0547768,206786686.85197693,206920339.69822693,207089954.53447688,207304197.20197684,207560440.9892267,207844869.08947662,208143868.7019767,208444606.41397682,208743391.4192267,209041442.45122674,209341371.44197664,209647455.81322658,209962747.5737265,210275242.6577264,210577836.93697643,210871025.26747644,211155493.0284766,211431645.0992266,211713052.4244766
127.0,206069939.75227663,206247210.2622765,206399383.73602661,206533816.24177676,206663834.0547768,206786686.85197693,206920339.69822693,207089954.53447688,207304197.20197684,207560440.9892267,207844869.08947662,208143868.7019767,208444606.41397682,208743391.4192267,209041442.45122674,209341371.44197664,209647455.81322658,209962747.5737265,210275242.6577264,210577836.93697643,210871025.26747644,211155493.0284766,211431645.0992266,211713052.4244766
128.0,4843208.105500001,4848277.39675,4852827.967750002,4856723.066500001,4860177.11175,4863610.686000004,4866957.37075,4871359.8565,4876447.253250003,4882621.586250005,4889439.994500006,4896705.155500006,4904085.685250008,4911058.572000008,4918041.989000008,4925398.63075001,4932780.928000008,4940471.47400001,4948256.64650001,4955211.514750009,4962399.324250012,4969414.2465000115,4976528.024750008,4983782.669250011
129.0,4843208.105500001,4848277.39675,4852827.967750002,4856723.066500001,4860177.11175,4863610.686000004,4866957.37075,4871359.8565,4876447.253250003,4882621.586250005,4889439.994500006,4896705.155500006,4904085.685250008,4911058.572000008,4918041.989000008,4925398.63075001,4932780.928000008,4940471.47400001,4948256.64650001,4955211.514750009,4962399.324250012,4969414.2465000115,4976528.024750008,4983782.669250011
130.0,14529624.316500004,14544832.190250002,14558483.903250005,14570169.199500002,14580531.335250001,14590832.058000013,14600872.11225,14614079.5695,14629341.759750009,14647864.758750016,14668319.983500017,14690115.466500018,14712257.055750024,14733175.716000024,14754125.967000026,14776195.89225003,14798342.784000024,14821414.422000028,14844769.93950003,14865634.544250028,14887197.972750034,14908242.739500035,14929584.074250024,14951348.007750034
131.0,14529624.316500004,14544832.190250002,14558483.903250005,14570169.199500002,14580531.335250001,14590832.058000013,14600872.11225,14614079.5695,14629341.759750009,14647864.758750016,14668319.983500017,14690115.466500018,14712257.055750024,14733175.716000024,14754125.967000026,14776195.89225003,14798342.784000024,14821414.422000028,14844769.93950003,14865634.544250028,14887197.972750034,14908242.739500035,14929584.074250024,14951348.007750034
132.0,828944.5438999927,829519.3546499931,830022.2386249936,830542.7468999934,831137.4537249932,831658.064399993,832210.5083249931,832876.5150749933,833662.8412749929,834625.5152249932,835753.6085999929,837046.3926499927,838314.9476999926,839445.2411999925,840471.3897749925,841592.4755249927,842789.3929999926,843917.2756499925,845074.8763999925,846136.2663249921,847104.6595499917,848072.9123999918,848967.8915499913,849767.1076249917
133.0,828944.5438999927,829519.3546499931,830022.2386249936,830542.7468999934,831137.4537249932,831658.064399993,832210.5083249931,832876.5150749933,833662.8412749929,834625.5152249932,835753.6085999929,837046.3926499927,838314.9476999926,839445.2411999925,840471.3897749925,841592.4755249927,842789.3929999926,843917.2756499925,845074.8763999925,846136.2663249921,847104.6595499917,848072.9123999918,848967.8915499913,849767.1076249917
134.0,2486833.6316999784,2488558.0639499794,2490066.7158749807,2491628.2406999804,2493412.3611749792,2494974.193199979,2496631.5249749795,2498629.5452249795,2500988.5238249786,2503876.5456749797,2507260.825799979,2511139.177949978,2514944.843099978,2518335.7235999773,2521414.1693249773,2524777.426574978,2528368.1789999777,2531751.8269499773,2535224.6291999775,2538408.798974976,2541313.9786499753,2544218.737199975,2546903.674649974,2549301.322874975
135.0,2486833.6316999784,2488558.0639499794,2490066.7158749807,2491628.2406999804,2493412.3611749792,2494974.193199979,2496631.5249749795,2498629.5452249795,2500988.5238249786,2503876.5456749797,2507260.825799979,2511139.177949978,2514944.843099978,2518335.7235999773,2521414.1693249773,2524777.426574978,2528368.1789999777,2531751.8269499773,2535224.6291999775,2538408.798974976,2541313.9786499753,2544218.737199975,2546903.674649974,2549301.322874975
136.0,1906628.177999993,1908445.0074999926,1910258.0672499933,1911817.2969999933,1913316.6197499933,1914615.7572499933,1916174.0522499937,1918128.2534999934,1920634.3967499933,1923349.5102499933,1926293.5372499938,1929688.7859999938,1932828.4259999937,1935805.206749994,1938870.5529999945,1941821.377999994,1944641.9917499938,1947594.063749994,1950643.4332499935,1953503.993499993,1956471.6562499925,1959746.4949999927,1962535.8497499928,1965479.4109999929
137.0,1906628.177999993,1908445.0074999926,1910258.0672499933,1911817.2969999933,1913316.6197499933,1914615.7572499933,1916174.0522499937,1918128.2534999934,1920634.3967499933,1923349.5102499933,1926293.5372499938,1929688.7859999938,1932828.4259999937,1935805.206749994,1938870.5529999945,1941821.377999994,1944641.9917499938,1947594.063749994,1950643.4332499935,1953503.993499993,1956471.6562499925,1959746.4949999927,1962535.8497499928,1965479.4109999929
138.0,5719884.5339999795,5725335.022499978,5730774.20174998,5735451.89099998,5739949.85924998,5743847.27174998,5748522.1567499805,5754384.76049998,5761903.1902499795,5770048.53074998,5778880.6117499815,5789066.357999981,5798485.277999981,5807415.620249982,5816611.658999983,5825464.133999982,5833925.9752499815,5842782.1912499815,5851930.299749981,5860511.980499979,5869414.968749978,5879239.484999978,5887607.549249979,5896438.232999979
139.0,5719884.5339999795,5725335.022499978,5730774.20174998,5735451.89099998,5739949.85924998,5743847.27174998,5748522.1567499805,5754384.76049998,5761903.1902499795,5770048.53074998,5778880.6117499815,5789066.357999981,5798485.277999981,5807415.620249982,5816611.658999983,5825464.133999982,5833925.9752499815,5842782.1912499815,5851930.299749981,5860511.980499979,5869414.968749978,5879239.484999978,5887607.549249979,5896438.232999979
140.0,1445474.1363500087,1446162.2441750085,1446761.9881250088,1447333.641300009,1447910.9399250094,1448444.6762000099,1449013.4931000103,1449815.78435001,1450815.7643500103,1451956.04210001,1453245.3928500102,1454583.03010001,1455855.5453500093,1457088.6261000107,1458224.4576000106,1459494.9766000102,1460751.2928500103,1461890.6431000112,1463018.8753500117,1464251.621850013,1465227.1478500133,1466209.2201250135,1467138.034275014,1468047.7787250143
141.0,1445474.1363500087,1446162.2441750085,1446761.9881250088,1447333.641300009,1447910.9399250094,1448444.6762000099,1449013.4931000103,1449815.78435001,1450815.7643500103,1451956.04210001,1453245.3928500102,1454583.03010001,1455855.5453500093,1457088.6261000107,1458224.4576000106,1459494.9766000102,1460751.2928500103,1461890.6431000112,1463018.8753500117,1464251.621850013,1465227.1478500133,1466209.2201250135,1467138.034275014,1468047.7787250143
142.0,4336422.409050026,4338486.7325250255,4340285.9643750265,4342000.923900027,4343732.819775028,4345334.02860003,4347040.479300031,4349447.353050031,4352447.293050031,4355868.126300029,4359736.178550031,4363749.09030003,4367566.636050028,4371265.878300032,4374673.372800032,4378484.929800031,4382253.878550031,4385671.9293000335,4389056.6260500355,4392754.865550039,4395681.44355004,4398627.66037504,4401414.102825042,4404143.336175043
143.0,4336422.409050026,4338486.7325250255,4340285.9643750265,4342000.923900027,4343732.819775028,4345334.02860003,4347040.479300031,4349447.353050031,4352447.293050031,4355868.126300029,4359736.178550031,4363749.09030003,4367566.636050028,4371265.878300032,4374673.372800032,4378484.929800031,4382253.878550031,4385671.9293000335,4389056.6260500355,4392754.865550039,4395681.44355004,4398627.66037504,4401414.102825042,4404143.336175043
144.0,8202908.988250024,8209484.349250022,8214774.65350002,8219623.073750015,8223954.095000016,8228388.241250015,8232949.599250016,8238779.166250014,8246191.796750014,8254852.504500015,8264671.274250014,8274988.509500016,8285274.008500013,8295603.657750014,8305535.937750011,8315323.761500007,8325216.758750003,8335681.379250002,8346015.6657500025,8356220.181000001,8365801.208999998,8375129.414749996,8384565.010999993,8394178.474249989
145.0,8202908.988250024,8209484.349250022,8214774.65350002,8219623.073750015,8223954.095000016,8228388.241250015,8232949.599250016,8238779.166250014,8246191.796750014,8254852.504500015,8264671.274250014,8274988.509500016,8285274.008500013,8295603.657750014,8305535.937750011,8315323.761500007,8325216.758750003,8335681.379250002,8346015.6657500025,8356220.181000001,8365801.208999998,8375129.414749996,8384565.010999993,8394178.474249989
146.0,24608726.96475007,24628453.047750067,24644323.960500058,24658869.221250046,24671862.28500005,24685164.723750044,24698848.79775005,24716337.498750042,24738575.390250042,24764557.513500042,24794013.82275004,24824965.52850005,24855822.025500037,24886810.973250043,24916607.81325003,24945971.284500018,24975650.27625001,25007044.137750007,25038046.997250006,25068660.543,25097403.626999993,25125388.24424999,25153695.03299998,25182535.422749966
147.0,24608726.96475007,24628453.047750067,24644323.960500058,24658869.221250046,24671862.28500005,24685164.723750044,24698848.79775005,24716337.498750042,24738575.390250042,24764557.513500042,24794013.82275004,24824965.52850005,24855822.025500037,24886810.973250043,24916607.81325003,24945971.284500018,24975650.27625001,25007044.137750007,25038046.997250006,25068660.543,25097403.626999993,25125388.24424999,25153695.03299998,25182535.422749966
148.0,1676490.0064999925,1678493.6199999924,1680108.9409999934,1681414.1472499934,1682688.8634999937,1683952.8472499936,1685480.2109999936,1687355.4587499937,1689652.3257499936,1692408.3497499935,1695332.6914999934,1698446.3994999938,1701352.9749999943,1704561.6727499946,1707656.8917499946,1710505.607499995,1713583.0072499958,1716954.692749996,1719927.5202499956,1722831.1469999955,1725582.4734999952,1728260.425749995,1730959.9257499953,1734052.681249995
149.0,1676490.0064999925,1678493.6199999924,1680108.9409999934,1681414.1472499934,1682688.8634999937,1683952.8472499936,1685480.2109999936,1687355.4587499937,1689652.3257499936,1692408.3497499935,1695332.6914999934,1698446.3994999938,1701352.9749999943,1704561.6727499946,1707656.8917499946,1710505.607499995,1713583.0072499958,1716954.692749996,1719927.5202499956,1722831.1469999955,1725582.4734999952,1728260.425749995,1730959.9257499953,1734052.681249995
150.0,5029470.019499977,5035480.859999977,5040326.82299998,5044242.441749981,5048066.590499981,5051858.54174998,5056440.632999981,5062066.376249981,5068956.977249981,5077225.049249981,5085998.074499981,5095339.198499981,5104058.924999983,5113685.018249984,5122970.675249984,5131516.822499985,5140749.021749987,5150864.078249988,5159782.560749987,5168493.440999987,5176747.420499986,5184781.277249985,5192879.777249986,5202158.043749985
151.0,5029470.019499977,5035480.859999977,5040326.82299998,5044242.441749981,5048066.590499981,5051858.54174998,5056440.632999981,5062066.376249981,5068956.977249981,5077225.049249981,5085998.074499981,5095339.198499981,5104058.924999983,5113685.018249984,5122970.675249984,5131516.822499985,5140749.021749987,5150864.078249988,5159782.560749987,5168493.440999987,5176747.420499986,5184781.277249985,5192879.777249986,5202158.043749985
152.0,6158738.381874962,6163885.411899961,6168098.751424957,6171907.055699959,6175384.768474962,6178664.608499961,6182097.581774961,6186483.597799963,6192366.992324963,6200239.41184996,6208711.73587496,6217984.48864996,6227320.98292496,6236020.67794996,6244867.785724964,6254025.670824963,6263371.456174964,6272749.090774967,6282142.215024965,6291038.078874965,6299557.339474966,6307824.166574963,6315972.686824962,6323824.172174965
153.0,6158738.381874962,6163885.411899961,6168098.751424957,6171907.055699959,6175384.768474962,6178664.608499961,6182097.581774961,6186483.597799963,6192366.992324963,6200239.41184996,6208711.73587496,6217984.48864996,6227320.98292496,6236020.67794996,6244867.785724964,6254025.670824963,6263371.456174964,6272749.090774967,6282142.215024965,6291038.078874965,6299557.339474966,6307824.166574963,6315972.686824962,6323824.172174965
154.0,18476215.145624883,18491656.23569988,18504296.25427487,18515721.16709988,18526154.305424884,18535993.825499885,18546292.745324884,18559450.79339989,18577100.97697489,18600718.23554988,18626135.207624882,18653953.465949878,18681962.948774878,18708062.03384988,18734603.357174892,18762077.012474887,18790114.368524894,18818247.2723249,18846426.645074897,18873114.236624897,18898672.0184249,18923472.49972489,18947918.060474884,18971472.516524896
155.0,18476215.145624883,18491656.23569988,18504296.25427487,18515721.16709988,18526154.305424884,18535993.825499885,18546292.745324884,18559450.79339989,18577100.97697489,18600718.23554988,18626135.207624882,18653953.465949878,18681962.948774878,18708062.03384988,18734603.357174892,18762077.012474887,18790114.368524894,18818247.2723249,18846426.645074897,18873114.236624897,18898672.0184249,18923472.49972489,18947918.060474884,18971472.516524896
156.0,4263486.338749998,4267305.631749997,4270609.422999995,4273557.566999994,4276382.228499996,4278917.438499998,4281815.02025,4285414.329500003,4289968.390250001,4295750.632999999,4301994.964500002,4308261.963750005,4314825.033750004,4321279.926500004,4328022.509250004,4334251.814000003,4340811.862500001,4347534.8415,4354361.822000002,4360800.588999996,4367062.673749995,4373109.339999992,4378924.591749993,4384862.846999993
157.0,4263486.338749998,4267305.631749997,4270609.422999995,4273557.566999994,4276382.228499996,4278917.438499998,4281815.02025,4285414.329500003,4289968.390250001,4295750.632999999,4301994.964500002,4308261.963750005,4314825.033750004,4321279.926500004,4328022.509250004,4334251.814000003,4340811.862500001,4347534.8415,4354361.822000002,4360800.588999996,4367062.673749995,4373109.339999992,4378924.591749993,4384862.846999993
158.0,12790459.016249996,12801916.89524999,12811828.268999984,12820672.700999983,12829146.685499987,12836752.315499995,12845445.06075,12856242.988500008,12869905.170750003,12887251.898999998,12905984.893500004,12924785.891250014,12944475.101250011,12963839.779500011,12984067.527750012,13002755.44200001,13022435.587500002,13042604.524500001,13063085.466000006,13082401.766999988,13101188.021249987,13119328.019999977,13136773.77524998,13154588.540999979
159.0,12790459.016249996,12801916.89524999,12811828.268999984,12820672.700999983,12829146.685499987,12836752.315499995,12845445.06075,12856242.988500008,12869905.170750003,12887251.898999998,12905984.893500004,12924785.891250014,12944475.101250011,12963839.779500011,12984067.527750012,13002755.44200001,13022435.587500002,13042604.524500001,13063085.466000006,13082401.766999988,13101188.021249987,13119328.019999977,13136773.77524998,13154588.540999979
160.0,2445994.3434999986,2447730.391749998,2449300.391249997,2450784.9754999946,2452173.909999994,2453522.134499993,2454906.381999993,2456809.764749993,2459196.910249994,2461924.9469999936,2464844.336749993,2468074.531499992,2470916.5554999933,2473760.4364999947,2476506.017749993,2479242.8422499932,2481986.6914999895,2484746.795499989,2487824.96849999,2490774.3272499903,2493405.57599999,2495926.515499989,2498522.7012499897,2501145.473249989
161.0,2445994.3434999986,2447730.391749998,2449300.391249997,2450784.9754999946,2452173.909999994,2453522.134499993,2454906.381999993,2456809.764749993,2459196.910249994,2461924.9469999936,2464844.336749993,2468074.531499992,2470916.5554999933,2473760.4364999947,2476506.017749993,2479242.8422499932,2481986.6914999895,2484746.795499989,2487824.96849999,2490774.3272499903,2493405.57599999,2495926.515499989,2498522.7012499897,2501145.473249989
162.0,7337983.030499996,7343191.175249994,7347901.173749991,7352354.926499983,7356521.729999982,7360566.4034999795,7364719.145999979,7370429.29424998,7377590.730749982,7385774.840999981,7394533.010249978,7404223.594499976,7412749.66649998,7421281.309499985,7429518.053249979,7437728.52674998,7445960.074499968,7454240.3864999665,7463474.905499971,7472322.9817499705,7480216.72799997,7487779.546499968,7495568.103749969,7503436.419749968
163.0,7337983.030499996,7343191.175249994,7347901.173749991,7352354.926499983,7356521.729999982,7360566.4034999795,7364719.145999979,7370429.29424998,7377590.730749982,7385774.840999981,7394533.010249978,7404223.594499976,7412749.66649998,7421281.309499985,7429518.053249979,7437728.52674998,7445960.074499968,7454240.3864999665,7463474.905499971,7472322.9817499705,7480216.72799997,7487779.546499968,7495568.103749969,7503436.419749968
164.0,2164678.1483499976,2166771.512099996,2168686.735099995,2170316.920099996,2171787.2243499956,2173279.757599994,2175043.7973499936,2177273.3163499935,2180407.2773499945,2183497.4955999963,2186596.656599998,2189990.4478499996,2193623.298599998,2197217.0505999974,2200674.5898499996,2204295.1148499986,2207652.059599999,2211332.954349999,2214886.231099999,2218699.1638499955,2222537.346849996,2226432.400349997,2229854.8948499975,2233424.401849999
165.0,2164678.1483499976,2166771.512099996,2168686.735099995,2170316.920099996,2171787.2243499956,2173279.757599994,2175043.7973499936,2177273.3163499935,2180407.2773499945,2183497.4955999963,2186596.656599998,2189990.4478499996,2193623.298599998,2197217.0505999974,2200674.5898499996,2204295.1148499986,2207652.059599999,2211332.954349999,2214886.231099999,2218699.1638499955,2222537.346849996,2226432.400349997,2229854.8948499975,2233424.401849999
166.0,6494034.445049993,6500314.536299989,6506060.205299985,6510950.760299988,6515361.673049986,6519839.272799982,6525131.392049981,6531819.94904998,6541221.832049984,6550492.486799989,6559789.969799994,6569971.3435499985,6580869.8957999945,6591651.151799992,6602023.769549999,6612885.344549996,6622956.178799996,6633998.863049997,6644658.693299998,6656097.491549986,6667612.040549988,6679297.201049991,6689564.684549993,6700273.205549997
167.0,6494034.445049993,6500314.536299989,6506060.205299985,6510950.760299988,6515361.673049986,6519839.272799982,6525131.392049981,6531819.94904998,6541221.832049984,6550492.486799989,6559789.969799994,6569971.3435499985,6580869.8957999945,6591651.151799992,6602023.769549999,6612885.344549996,6622956.178799996,6633998.863049997,6644658.693299998,6656097.491549986,6667612.040549988,6679297.201049991,6689564.684549993,6700273.205549997
168.0,75364795.6887003,75429611.4217003,75484639.32870029,75533617.00320028,75578998.66120028,75623706.14320028,75669908.8552003,75729323.39895031,75802814.9997003,75891607.16170031,75991441.82870027,76096579.74545026,76203478.18620029,76307898.04695028,76412667.58695027,76520669.14045025,76630876.90145028,76742625.67495029,76852619.54170029,76959582.6949503,77060798.65570028,77159757.72270028,77255523.81320031,77353460.5147003
169.0,75364795.6887003,75429611.4217003,75484639.32870029,75533617.00320028,75578998.66120028,75623706.14320028,75669908.8552003,75729323.39895031,75802814.9997003,75891607.16170031,75991441.82870027,76096579.74545026,76203478.18620029,76307898.04695028,76412667.58695027,76520669.14045025,76630876.90145028,76742625.67495029,76852619.54170029,76959582.6949503,77060798.65570028,77159757.72270028,77255523.81320031,77353460.5147003
170.0,226094387.0661009,226288834.2651009,226453917.98610085,226600851.00960082,226736995.98360085,226871118.42960083,227009726.56560093,227187970.19685093,227408444.99910086,227674821.48510092,227974325.48610082,228289739.23635077,228610434.55860087,228923694.14085084,229238002.76085082,229562007.42135078,229892630.70435083,230227877.02485085,230557858.62510085,230878748.0848509,231182395.96710086,231479273.16810083,231766571.43960094,232060381.54410088
171.0,226094387.0661009,226288834.2651009,226453917.98610085,226600851.00960082,226736995.98360085,226871118.42960083,227009726.56560093,227187970.19685093,227408444.99910086,227674821.48510092,227974325.48610082,228289739.23635077,228610434.55860087,228923694.14085084,229238002.76085082,229562007.42135078,229892630.70435083,230227877.02485085,230557858.62510085,230878748.0848509,231182395.96710086,231479273.16810083,231766571.43960094,232060381.54410088
172.0,7995834.12924999,8005370.501499986,8013317.598749983,8019834.288499984,8025903.381499982,8031506.177999986,8037064.017499988,8043777.469249989,8052297.354249989,8062782.396749991,8074144.30174999,8086346.639249993,8098236.404249993,8110550.244249993,8122862.7342499895,8135089.36674999,8147083.926749988,8159590.371749992,8172478.839249995,8185474.821749995,8198543.274249996,8212450.054249996,8226675.886749999,8241979.54925
173.0,7995834.12924999,8005370.501499986,8013317.598749983,8019834.288499984,8025903.381499982,8031506.177999986,8037064.017499988,8043777.469249989,8052297.354249989,8062782.396749991,8074144.30174999,8086346.639249993,8098236.404249993,8110550.244249993,8122862.7342499895,8135089.36674999,8147083.926749988,8159590.371749992,8172478.839249995,8185474.821749995,8198543.274249996,8212450.054249996,8226675.886749999,8241979.54925
174.0,23987502.38774997,24016111.504499957,24039952.79624995,24059502.86549995,24077710.144499946,24094518.533999957,24111192.052499965,24131332.407749966,24156892.062749967,24188347.190249972,24222432.905249972,24259039.91774998,24294709.21274998,24331650.73274998,24368588.202749968,24405268.10024997,24441251.780249964,24478771.115249977,24517436.517749984,24556424.465249985,24595629.822749987,24637350.16274999,24680027.660249997,24725938.64775
175.0,23987502.38774997,24016111.504499957,24039952.79624995,24059502.86549995,24077710.144499946,24094518.533999957,24111192.052499965,24131332.407749966,24156892.062749967,24188347.190249972,24222432.905249972,24259039.91774998,24294709.21274998,24331650.73274998,24368588.202749968,24405268.10024997,24441251.780249964,24478771.115249977,24517436.517749984,24556424.465249985,24595629.822749987,24637350.16274999,24680027.660249997,24725938.64775
176.0,2880385.3224999993,2882186.644750001,2883611.1875,2885039.4827499995,2886391.2545,2887749.5902500004,2889204.3524999996,2890889.2852499993,2892872.4607499987,2895060.6032499974,2897516.8742499966,2899875.279749998,2902334.420499998,2904703.868249999,2907226.403749999,2909872.571499999,2912389.6927499976,2915064.0274999985,2917496.2309999987,2920126.9737499994,2922932.872249998,2925664.7277499996,2928256.4720000015,2930891.3560000006
177.0,2880385.3224999993,2882186.644750001,2883611.1875,2885039.4827499995,2886391.2545,2887749.5902500004,2889204.3524999996,2890889.2852499993,2892872.4607499987,2895060.6032499974,2897516.8742499966,2899875.279749998,2902334.420499998,2904703.868249999,2907226.403749999,2909872.571499999,2912389.6927499976,2915064.0274999985,2917496.2309999987,2920126.9737499994,2922932.872249998,2925664.7277499996,2928256.4720000015,2930891.3560000006
178.0,8641155.967499997,8646559.934250003,8650833.5625,8655118.44825,8659173.7635,8663248.770750001,8667613.0575,8672667.855749998,8678617.382249996,8685181.809749993,8692550.62274999,8699625.839249995,8707003.261499994,8714111.604749996,8721679.211249998,8729617.714499997,8737169.078249993,8745192.082499996,8752488.692999996,8760380.921249999,8768798.616749994,8776994.183249999,8784769.416000005,8792674.068000002
179.0,8641155.967499997,8646559.934250003,8650833.5625,8655118.44825,8659173.7635,8663248.770750001,8667613.0575,8672667.855749998,8678617.382249996,8685181.809749993,8692550.62274999,8699625.839249995,8707003.261499994,8714111.604749996,8721679.211249998,8729617.714499997,8737169.078249993,8745192.082499996,8752488.692999996,8760380.921249999,8768798.616749994,8776994.183249999,8784769.416000005,8792674.068000002
180.0,1782129.9359249903,1783498.462149991,1784696.9749749904,1785844.1566999897,1787058.4262749897,1788060.92067499,1789179.05504999,1790629.6562999894,1792500.6375499899,1795238.6647999897,1798872.1915499896,1803124.527049989,1807811.1530499891,1812871.9052999888,1818119.8850499883,1823791.9282999872,1829541.5420499875,1834864.2665499875,1839997.4990499872,1844738.3817999875,1849048.596299987,1853029.7068249865,1856597.1443249865,1859464.1658249865
181.0,1782129.9359249903,1783498.462149991,1784696.9749749904,1785844.1566999897,1787058.4262749897,1788060.92067499,1789179.05504999,1790629.6562999894,1792500.6375499899,1795238.6647999897,1798872.1915499896,1803124.527049989,1807811.1530499891,1812871.9052999888,1818119.8850499883,1823791.9282999872,1829541.5420499875,1834864.2665499875,1839997.4990499872,1844738.3817999875,1849048.596299987,1853029.7068249865,1856597.1443249865,1859464.1658249865
182.0,5346389.807774971,5350495.386449973,5354090.924924972,5357532.470099969,5361175.278824969,5364182.76202497,5367537.16514997,5371888.968899968,5377501.91264997,5385715.994399969,5396616.574649969,5409373.581149967,5423433.459149968,5438615.715899967,5454359.655149965,5471375.784899961,5488624.626149963,5504592.799649962,5519992.497149961,5534215.145399963,5547145.788899961,5559089.12047496,5569791.43297496,5578392.497474959
183.0,5346389.807774971,5350495.386449973,5354090.924924972,5357532.470099969,5361175.278824969,5364182.76202497,5367537.16514997,5371888.968899968,5377501.91264997,5385715.994399969,5396616.574649969,5409373.581149967,5423433.459149968,5438615.715899967,5454359.655149965,5471375.784899961,5488624.626149963,5504592.799649962,5519992.497149961,5534215.145399963,5547145.788899961,5559089.12047496,5569791.43297496,5578392.497474959
184.0,81727165.47750041,81802788.15250039,81867860.61000039,81924872.09000038,81977138.20250037,82029357.64750037,82083210.78000037,82150285.24500036,82235758.06000035,82338141.98750035,82452952.55500036,82574296.12750036,82697262.77000035,82818000.49250035,82940269.88250037,83064092.16750038,83193273.28000037,83320583.92250037,83448739.48500039,83575105.72000037,83695005.18500037,83813754.27250038,83927761.3625004,84044302.62500037
185.0,81727165.47750041,81802788.15250039,81867860.61000039,81924872.09000038,81977138.20250037,82029357.64750037,82083210.78000037,82150285.24500036,82235758.06000035,82338141.98750035,82452952.55500036,82574296.12750036,82697262.77000035,82818000.49250035,82940269.88250037,83064092.16750038,83193273.28000037,83320583.92250037,83448739.48500039,83575105.72000037,83695005.18500037,83813754.27250038,83927761.3625004,84044302.62500037
186.0,245181496.43250123,245408364.45750117,245603581.83000118,245774616.2700011,245931414.60750112,246088072.9425011,246249632.3400011,246450855.7350011,246707274.18000102,247014425.96250105,247358857.6650011,247722888.38250107,248091788.31000108,248454001.47750103,248820809.6475011,249192276.50250113,249579819.8400011,249961751.76750112,250346218.45500118,250725317.1600011,251085015.55500114,251441262.81750113,251783284.0875012,252132907.87500113
187.0,245181496.43250123,245408364.45750117,245603581.83000118,245774616.2700011,245931414.60750112,246088072.9425011,246249632.3400011,246450855.7350011,246707274.18000102,247014425.96250105,247358857.6650011,247722888.38250107,248091788.31000108,248454001.47750103,248820809.6475011,249192276.50250113,249579819.8400011,249961751.76750112,250346218.45500118,250725317.1600011,251085015.55500114,251441262.81750113,251783284.0875012,252132907.87500113
188.0,1991322.7612499814,1993091.5637499813,1994883.3017499817,1996294.1609999817,1997607.6577499816,1998921.8067499816,2000319.722749982,2002187.0862499822,2004474.881249982,2007199.886749981,2010393.839749981,2013464.2754999807,2016638.8269999807,2019673.0662499806,2022939.9952499804,2025892.9889999805,2028957.4557499804,2031772.7317499807,2035099.8164999806,2038290.086499981,2041322.39849998,2044661.1264999795,2047391.3849999798,2050324.38624998
189.0,1991322.7612499814,1993091.5637499813,1994883.3017499817,1996294.1609999817,1997607.6577499816,1998921.8067499816,2000319.722749982,2002187.0862499822,2004474.881249982,2007199.886749981,2010393.839749981,2013464.2754999807,2016638.8269999807,2019673.0662499806,2022939.9952499804,2025892.9889999805,2028957.4557499804,2031772.7317499807,2035099.8164999806,2038290.086499981,2041322.39849998,2044661.1264999795,2047391.3849999798,2050324.38624998
190.0,5973968.283749944,5979274.691249944,5984649.905249945,5988882.482999945,5992822.973249945,5996765.420249945,6000959.168249946,6006561.258749947,6013424.643749946,6021599.660249943,6031181.519249943,6040392.826499942,6049916.480999942,6059019.198749942,6068819.985749941,6077678.9669999415,6086872.367249941,6095318.195249942,6105299.449499942,6114870.259499943,6123967.19549994,6133983.379499938,6142174.15499994,6150973.15874994
191.0,5973968.283749944,5979274.691249944,5984649.905249945,5988882.482999945,5992822.973249945,5996765.420249945,6000959.168249946,6006561.258749947,6013424.643749946,6021599.660249943,6031181.519249943,6040392.826499942,6049916.480999942,6059019.198749942,6068819.985749941,6077678.9669999415,6086872.367249941,6095318.195249942,6105299.449499942,6114870.259499943,6123967.19549994,6133983.379499938,6142174.15499994,6150973.15874994
192.0,547881.4358500002,548206.4541249999,548488.5958250001,548744.5975750001,548996.6705,549268.53285,549607.8396500002,550063.7509500004,550674.7048000005,551404.3207500004,552373.2284000003,553313.059725,554204.0608750002,555189.5844750003,556020.3613000003,556801.8436,557679.179325,558559.817875,559402.6423750002,560291.9011000001,561051.4374749999,561661.76945,562475.3165500002,563161.4960000002
193.0,547881.4358500002,548206.4541249999,548488.5958250001,548744.5975750001,548996.6705,549268.53285,549607.8396500002,550063.7509500004,550674.7048000005,551404.3207500004,552373.2284000003,553313.059725,554204.0608750002,555189.5844750003,556020.3613000003,556801.8436,557679.179325,558559.817875,559402.6423750002,560291.9011000001,561051.4374749999,561661.76945,562475.3165500002,563161.4960000002
194.0,1643644.3075500007,1644619.3623749998,1645465.7874750001,1646233.7927250005,1646990.0115,1647805.5985499998,1648823.5189500006,1650191.2528500012,1652024.1144000017,1654212.9622500013,1657119.6852000006,1659939.1791750002,1662612.1826250006,1665568.7534250007,1668061.083900001,1670405.5308,1673037.5379750002,1675679.4536249998,1678207.9271250004,1680875.7033000004,1683154.3124249997,1684985.30835,1687425.9496500008,1689484.4880000004
195.0,1643644.3075500007,1644619.3623749998,1645465.7874750001,1646233.7927250005,1646990.0115,1647805.5985499998,1648823.5189500006,1650191.2528500012,1652024.1144000017,1654212.9622500013,1657119.6852000006,1659939.1791750002,1662612.1826250006,1665568.7534250007,1668061.083900001,1670405.5308,1673037.5379750002,1675679.4536249998,1678207.9271250004,1680875.7033000004,1683154.3124249997,1684985.30835,1687425.9496500008,1689484.4880000004
196.0,1063956.6719749982,1064905.1239749982,1065800.3807249982,1066465.7152999982,1067110.397924998,1067705.614199998,1068567.881349998,1069555.9173999983,1070675.0618999982,1072188.3503999982,1073948.6861499988,1075583.2521499984,1077236.0898999986,1078874.7963749983,1080538.3043749984,1082295.1333749986,1084010.1816249993,1085580.1358749988,1087335.092874998,1088869.586624998,1090373.922374998,1091984.4196249985,1093586.172124999,1095125.4988749991
197.0,1063956.6719749982,1064905.1239749982,1065800.3807249982,1066465.7152999982,1067110.397924998,1067705.614199998,1068567.881349998,1069555.9173999983,1070675.0618999982,1072188.3503999982,1073948.6861499988,1075583.2521499984,1077236.0898999986,1078874.7963749983,1080538.3043749984,1082295.1333749986,1084010.1816249993,1085580.1358749988,1087335.092874998,1088869.586624998,1090373.922374998,1091984.4196249985,1093586.172124999,1095125.4988749991
198.0,3191870.015924995,3194715.3719249945,3197401.1421749946,3199397.1458999943,3201331.1937749945,3203116.8425999945,3205703.644049994,3208667.752199995,3212025.1856999947,3216565.051199995,3221846.0584499966,3226749.7564499956,3231708.269699996,3236624.389124995,3241614.9131249953,3246885.400124996,3252030.544874998,3256740.4076249963,3262005.2786249937,3266608.759874994,3271121.7671249937,3275953.2588749956,3280758.5163749973,3285376.4966249974
199.0,3191870.015924995,3194715.3719249945,3197401.1421749946,3199397.1458999943,3201331.1937749945,3203116.8425999945,3205703.644049994,3208667.752199995,3212025.1856999947,3216565.051199995,3221846.0584499966,3226749.7564499956,3231708.269699996,3236624.389124995,3241614.9131249953,3246885.400124996,3252030.544874998,3256740.4076249963,3262005.2786249937,3266608.759874994,3271121.7671249937,3275953.2588749956,3280758.5163749973,3285376.4966249974
200.0,1816803.209077483,1818113.3888524822,1819235.2084524822,1820195.4958274825,1821041.2444774827,1822017.6550524833,1822932.0720774832,1824183.5741774833,1825820.7476774834,1827652.3048024834,1829863.0912524832,1832530.3795024832,1834925.5433774823,1837392.2235274822,1840154.541627482,1843313.5808774815,1847067.4436274823,1850843.964127482,1854591.5597524815,1858730.181002482,1861919.0137524824,1865395.8142524818,1868933.296002481,1871655.8647524805
201.0,1816803.209077483,1818113.3888524822,1819235.2084524822,1820195.4958274825,1821041.2444774827,1822017.6550524833,1822932.0720774832,1824183.5741774833,1825820.7476774834,1827652.3048024834,1829863.0912524832,1832530.3795024832,1834925.5433774823,1837392.2235274822,1840154.541627482,1843313.5808774815,1847067.4436274823,1850843.964127482,1854591.5597524815,1858730.181002482,1861919.0137524824,1865395.8142524818,1868933.296002481,1871655.8647524805
202.0,5450409.627232449,5454340.166557446,5457705.625357447,5460586.487482447,5463123.7334324485,5466052.96515745,5468796.21623245,5472550.72253245,5477462.24303245,5482956.914407451,5489589.273757449,5497591.13850745,5504776.630132447,5512176.670582447,5520463.624882447,5529940.742632445,5541202.330882447,5552531.892382446,5563774.679257445,5576190.543007446,5585757.041257447,5596187.442757445,5606799.8880074425,5614967.594257441
203.0,5450409.627232449,5454340.166557446,5457705.625357447,5460586.487482447,5463123.7334324485,5466052.96515745,5468796.21623245,5472550.72253245,5477462.24303245,5482956.914407451,5489589.273757449,5497591.13850745,5504776.630132447,5512176.670582447,5520463.624882447,5529940.742632445,5541202.330882447,5552531.892382446,5563774.679257445,5576190.543007446,5585757.041257447,5596187.442757445,5606799.8880074425,5614967.594257441
204.0,1924305.0877500002,1926014.2169999995,1927549.7534999992,1928907.81025,1930167.07025,1931443.9055000003,1932824.98775,1934611.1884999997,1936940.777,1939729.65575,1942749.8824999998,1945754.0104999996,1948880.029249999,1951848.2224999978,1954964.7059999974,1957994.3747499979,1961054.2454999983,1964483.863749998,1967740.8544999983,1970952.540749998,1974230.8272499978,1977383.6037499981,1980217.631499998,1983444.8257499984
205.0,1924305.0877500002,1926014.2169999995,1927549.7534999992,1928907.81025,1930167.07025,1931443.9055000003,1932824.98775,1934611.1884999997,1936940.777,1939729.65575,1942749.8824999998,1945754.0104999996,1948880.029249999,1951848.2224999978,1954964.7059999974,1957994.3747499979,1961054.2454999983,1964483.863749998,1967740.8544999983,1970952.540749998,1974230.8272499978,1977383.6037499981,1980217.631499998,1983444.8257499984
206.0,5772915.263250001,5778042.650999999,5782649.260499997,5786723.43075,5790501.210750001,5794331.716500001,5798474.96325,5803833.565499999,5810822.331,5819188.96725,5828249.647499999,5837262.031499999,5846640.087749997,5855544.667499993,5864894.117999992,5873983.124249994,5883162.736499995,5893451.591249994,5903222.563499995,5912857.622249994,5922692.481749993,5932150.811249995,5940652.894499994,5950334.477249995
207.0,5772915.263250001,5778042.650999999,5782649.260499997,5786723.43075,5790501.210750001,5794331.716500001,5798474.96325,5803833.565499999,5810822.331,5819188.96725,5828249.647499999,5837262.031499999,5846640.087749997,5855544.667499993,5864894.117999992,5873983.124249994,5883162.736499995,5893451.591249994,5903222.563499995,5912857.622249994,5922692.481749993,5932150.811249995,5940652.894499994,5950334.477249995
