0.0,0.0,1.0,2.0,3.0,4.0,5.0,6.0,7.0,8.0,9.0,10.0,11.0,12.0,13.0,14.0,15.0,16.0,17.0,18.0,19.0,20.0,21.0,22.0,23.0
0.0,2816567.745000028,2820785.974000028,2824055.0272500264,2826781.3877500277,2829137.799750028,2831223.762750029,2833160.475000029,2835243.748250027,2838116.702750026,2842016.376000025,2846795.077000025,2852297.524750025,2857817.959750024,2863227.6842500246,2868628.4990000236,2874656.173250022,2880534.765250024,2886420.9800000237,2892524.1632500226,2898428.585000022,2904654.374750022,2910505.512750021,2916057.791000024,2920652.470250024
1.0,2816567.745000028,2820785.974000028,2824055.0272500264,2826781.3877500277,2829137.799750028,2831223.762750029,2833160.475000029,2835243.748250027,2838116.702750026,2842016.376000025,2846795.077000025,2852297.524750025,2857817.959750024,2863227.6842500246,2868628.4990000236,2874656.173250022,2880534.765250024,2886420.9800000237,2892524.1632500226,2898428.585000022,2904654.374750022,2910505.512750021,2916057.791000024,2920652.470250024
2.0,8449703.235000085,8462357.922000084,8472165.08175008,8480344.163250083,8487413.399250085,8493671.288250087,8499481.425000086,8505731.244750082,8514350.108250078,8526049.128000075,8540385.231000075,8556892.574250076,8573453.879250072,8589683.052750073,8605885.49700007,8623968.519750066,8641604.295750072,8659262.940000072,8677572.489750069,8695285.755000066,8713963.124250066,8731516.538250063,8748173.373000072,8761957.410750072
3.0,8449703.235000085,8462357.922000084,8472165.08175008,8480344.163250083,8487413.399250085,8493671.288250087,8499481.425000086,8505731.244750082,8514350.108250078,8526049.128000075,8540385.231000075,8556892.574250076,8573453.879250072,8589683.052750073,8605885.49700007,8623968.519750066,8641604.295750072,8659262.940000072,8677572.489750069,8695285.755000066,8713963.124250066,8731516.538250063,8748173.373000072,8761957.410750072
4.0,1440503.6825500026,1442266.724300003,1443807.6943250026,1445209.832625003,1446611.9406250026,1448004.531550002,1449408.3789500026,1450927.2840000032,1452581.0932500032,1454871.6567500036,1457514.6190000034,1460474.7732500038,1464116.2182500039,1467613.536500003,1471112.838000003,1474785.100500003,1478511.7155000027,1482360.206750003,1486434.8515000031,1489634.259250003,1492820.4157500027,1495834.1142500027,1498610.4299500028,1500977.5379500024
5.0,1440503.6825500026,1442266.724300003,1443807.6943250026,1445209.832625003,1446611.9406250026,1448004.531550002,1449408.3789500026,1450927.2840000032,1452581.0932500032,1454871.6567500036,1457514.6190000034,1460474.7732500038,1464116.2182500039,1467613.536500003,1471112.838000003,1474785.100500003,1478511.7155000027,1482360.206750003,1486434.8515000031,1489634.259250003,1492820.4157500027,1495834.1142500027,1498610.4299500028,1500977.5379500024
6.0,4321511.0476500075,4326800.172900009,4331423.082975008,4335629.497875009,4339835.821875008,4344013.594650006,4348225.136850008,4352781.852000009,4357743.27975001,4364614.9702500105,4372543.85700001,4381424.319750011,4392348.654750012,4402840.609500009,4413338.514000009,4424355.301500009,4435535.146500008,4447080.620250009,4459304.55450001,4468902.777750009,4478461.247250008,4487502.342750008,4495831.289850009,4502932.613850007
7.0,4321511.0476500075,4326800.172900009,4331423.082975008,4335629.497875009,4339835.821875008,4344013.594650006,4348225.136850008,4352781.852000009,4357743.27975001,4364614.9702500105,4372543.85700001,4381424.319750011,4392348.654750012,4402840.609500009,4413338.514000009,4424355.301500009,4435535.146500008,4447080.620250009,4459304.55450001,4468902.777750009,4478461.247250008,4487502.342750008,4495831.289850009,4502932.613850007
8.0,10946787.305750137,10962930.780750144,10975619.95325014,10986945.392250147,10996016.468750142,11003227.130250148,11010147.426000148,11018037.618500141,11027541.092750138,11039079.042250142,11053714.926250134,11071500.780250134,11091258.000250135,11111715.762750136,11134028.101750137,11156872.14925014,11181544.451500146,11205597.411500145,11229304.604000151,11249492.776500149,11268203.655250153,11286254.561000153,11303864.004250156,11320178.93675015
9.0,10946787.305750137,10962930.780750144,10975619.95325014,10986945.392250147,10996016.468750142,11003227.130250148,11010147.426000148,11018037.618500141,11027541.092750138,11039079.042250142,11053714.926250134,11071500.780250134,11091258.000250135,11111715.762750136,11134028.101750137,11156872.14925014,11181544.451500146,11205597.411500145,11229304.604000151,11249492.776500149,11268203.655250153,11286254.561000153,11303864.004250156,11320178.93675015
10.0,32840361.91725041,32888792.342250433,32926859.85975042,32960836.17675044,32988049.406250425,33009681.390750445,33030442.278000444,33054112.855500422,33082623.27825041,33117237.126750425,33161144.7787504,33214502.340750404,33273774.000750404,33335147.28825041,33402084.305250414,33470616.44775042,33544633.354500435,33616792.23450044,33687913.81200045,33748478.329500444,33804610.965750456,33858763.68300046,33911592.01275047,33960536.810250446
11.0,32840361.91725041,32888792.342250433,32926859.85975042,32960836.17675044,32988049.406250425,33009681.390750445,33030442.278000444,33054112.855500422,33082623.27825041,33117237.126750425,33161144.7787504,33214502.340750404,33273774.000750404,33335147.28825041,33402084.305250414,33470616.44775042,33544633.354500435,33616792.23450044,33687913.81200045,33748478.329500444,33804610.965750456,33858763.68300046,33911592.01275047,33960536.810250446
12.0,2581251.9753750013,2584806.0000500013,2587678.453825,2590188.9918249995,2592287.131149999,2594478.813949999,2596745.94105,2599286.6511000004,2602901.7616000003,2607145.1135250004,2612347.159025,2617685.690525001,2623293.6717750006,2628474.570775,2634123.9590249998,2640213.094774999,2646338.1982749985,2652886.2132749977,2659159.6750249984,2665335.9720249986,2671185.067774998,2676247.480274997,2681099.8105249978,2685694.8912749975
13.0,2581251.9753750013,2584806.0000500013,2587678.453825,2590188.9918249995,2592287.131149999,2594478.813949999,2596745.94105,2599286.6511000004,2602901.7616000003,2607145.1135250004,2612347.159025,2617685.690525001,2623293.6717750006,2628474.570775,2634123.9590249998,2640213.094774999,2646338.1982749985,2652886.2132749977,2659159.6750249984,2665335.9720249986,2671185.067774998,2676247.480274997,2681099.8105249978,2685694.8912749975
14.0,7743755.926125004,7754418.000150004,7763035.361475,7770566.975474998,7776861.393449997,7783436.441849997,7790237.82315,7797859.953300001,7808705.2848000005,7821435.340575001,7837041.477074999,7853057.071575003,7869881.015325002,7885423.712324999,7902371.877075,7920639.284324998,7939014.594824996,7958658.639824993,7977479.025074995,7996007.916074996,8013555.203324994,8028742.440824991,8043299.431574993,8057084.673824992
15.0,7743755.926125004,7754418.000150004,7763035.361475,7770566.975474998,7776861.393449997,7783436.441849997,7790237.82315,7797859.953300001,7808705.2848000005,7821435.340575001,7837041.477074999,7853057.071575003,7869881.015325002,7885423.712324999,7902371.877075,7920639.284324998,7939014.594824996,7958658.639824993,7977479.025074995,7996007.916074996,8013555.203324994,8028742.440824991,8043299.431574993,8057084.673824992
16.0,1480594.0434000052,1483016.4221500047,1485068.0229000049,1486750.5934000055,1488178.7596500064,1489479.150000006,1490683.7408500065,1492031.041475008,1493717.726725008,1496237.9414750086,1498798.4714750084,1501685.2444750094,1504598.4704750094,1507518.6334750084,1510348.9684750084,1513673.502975008,1517408.6574750082,1520627.1834750078,1523923.1724750083,1527170.6794750085,1530059.7119750087,1532926.4077250084,1536067.374475009,1538365.426225009
17.0,1480594.0434000052,1483016.4221500047,1485068.0229000049,1486750.5934000055,1488178.7596500064,1489479.150000006,1490683.7408500065,1492031.041475008,1493717.726725008,1496237.9414750086,1498798.4714750084,1501685.2444750094,1504598.4704750094,1507518.6334750084,1510348.9684750084,1513673.502975008,1517408.6574750082,1520627.1834750078,1523923.1724750083,1527170.6794750085,1530059.7119750087,1532926.4077250084,1536067.374475009,1538365.426225009
18.0,4441782.130200015,4449049.266450014,4455204.068700015,4460251.780200017,4464536.278950019,4468437.450000018,4472051.22255002,4476093.124425024,4481153.180175024,4488713.824425026,4496395.414425025,4505055.733425029,4513795.411425028,4522555.900425025,4531046.905425025,4541020.508925024,4552225.972425025,4561881.550425023,4571769.517425025,4581512.0384250255,4590179.135925027,4598779.223175026,4608202.123425027,4615096.278675027
19.0,4441782.130200015,4449049.266450014,4455204.068700015,4460251.780200017,4464536.278950019,4468437.450000018,4472051.22255002,4476093.124425024,4481153.180175024,4488713.824425026,4496395.414425025,4505055.733425029,4513795.411425028,4522555.900425025,4531046.905425025,4541020.508925024,4552225.972425025,4561881.550425023,4571769.517425025,4581512.0384250255,4590179.135925027,4598779.223175026,4608202.123425027,4615096.278675027
20.0,2015269.8105000046,2017947.1225000042,2020148.8752500042,2022170.8785000048,2023964.7095000045,2025715.3392500046,2027533.5740000051,2029592.3702500048,2032091.7852500044,2035342.4977500055,2038996.5620000057,2042756.699500006,2046629.721250006,2050292.6617500056,2054108.238500006,2058354.6932500065,2062440.289000006,2066702.568250006,2070883.6210000063,2075270.0690000067,2079715.6845000067,2084066.1185000066,2087803.9277500059,2091186.1647500063
21.0,2015269.8105000046,2017947.1225000042,2020148.8752500042,2022170.8785000048,2023964.7095000045,2025715.3392500046,2027533.5740000051,2029592.3702500048,2032091.7852500044,2035342.4977500055,2038996.5620000057,2042756.699500006,2046629.721250006,2050292.6617500056,2054108.238500006,2058354.6932500065,2062440.289000006,2066702.568250006,2070883.6210000063,2075270.0690000067,2079715.6845000067,2084066.1185000066,2087803.9277500059,2091186.1647500063
22.0,6045809.431500014,6053841.367500013,6060446.625750013,6066512.635500014,6071894.128500014,6077146.017750014,6082600.722000016,6088777.110750014,6096275.355750013,6106027.493250016,6116989.686000017,6128270.098500018,6139889.163750018,6150877.985250017,6162324.715500018,6175064.07975002,6187320.867000017,6200107.704750018,6212650.8630000185,6225810.20700002,6239147.05350002,6252198.35550002,6263411.783250017,6273558.494250019
23.0,6045809.431500014,6053841.367500013,6060446.625750013,6066512.635500014,6071894.128500014,6077146.017750014,6082600.722000016,6088777.110750014,6096275.355750013,6106027.493250016,6116989.686000017,6128270.098500018,6139889.163750018,6150877.985250017,6162324.715500018,6175064.07975002,6187320.867000017,6200107.704750018,6212650.8630000185,6225810.20700002,6239147.05350002,6252198.35550002,6263411.783250017,6273558.494250019
24.0,1326211.801000001,1327816.1710000013,1329213.2055000006,1330481.7830000005,1331666.2522500006,1332656.6475000004,1333811.0589999997,1334992.3827499999,1336532.9302499997,1338526.9874999996,1341230.1794999996,1343951.9844999993,1346818.0744999999,1349520.3182499998,1352390.7052500003,1355151.4564999994,1358163.3147499992,1361380.2219999994,1364702.3972499992,1367796.4439999985,1370663.728999998,1373334.3544999987,1376104.2439999983,1378541.4337499985
25.0,1326211.801000001,1327816.1710000013,1329213.2055000006,1330481.7830000005,1331666.2522500006,1332656.6475000004,1333811.0589999997,1334992.3827499999,1336532.9302499997,1338526.9874999996,1341230.1794999996,1343951.9844999993,1346818.0744999999,1349520.3182499998,1352390.7052500003,1355151.4564999994,1358163.3147499992,1361380.2219999994,1364702.3972499992,1367796.4439999985,1370663.728999998,1373334.3544999987,1376104.2439999983,1378541.4337499985
26.0,3978635.4030000027,3983448.513000004,3987639.616500002,3991445.3490000013,3994998.7567500016,3997969.9425000013,4001433.176999999,4004977.1482499996,4009598.790749999,4015580.9624999985,4023690.538499999,4031855.953499998,4040454.2234999994,4048560.9547499996,4057172.115750001,4065454.369499998,4074489.944249998,4084140.6659999983,4094107.1917499974,4103389.3319999957,4111991.186999994,4120003.0634999964,4128312.731999995,4135624.3012499954
27.0,3978635.4030000027,3983448.513000004,3987639.616500002,3991445.3490000013,3994998.7567500016,3997969.9425000013,4001433.176999999,4004977.1482499996,4009598.790749999,4015580.9624999985,4023690.538499999,4031855.953499998,4040454.2234999994,4048560.9547499996,4057172.115750001,4065454.369499998,4074489.944249998,4084140.6659999983,4094107.1917499974,4103389.3319999957,4111991.186999994,4120003.0634999964,4128312.731999995,4135624.3012499954
28.0,49208383.14202532,49278727.552025326,49335788.798350334,49385692.11925033,49429941.25220033,49470639.97515034,49512130.01842534,49558182.004425324,49615797.08142532,49686788.97842533,49772625.65467533,49864752.99367532,49961198.71542533,50057845.01542533,50157364.255925335,50263183.69992532,50371433.80267532,50476995.338425316,50585535.98792532,50688837.20142533,50790499.15067533,50892440.83467534,50990559.296425335,51077587.23792533
29.0,49208383.14202532,49278727.552025326,49335788.798350334,49385692.11925033,49429941.25220033,49470639.97515034,49512130.01842534,49558182.004425324,49615797.08142532,49686788.97842533,49772625.65467533,49864752.99367532,49961198.71542533,50057845.01542533,50157364.255925335,50263183.69992532,50371433.80267532,50476995.338425316,50585535.98792532,50688837.20142533,50790499.15067533,50892440.83467534,50990559.296425335,51077587.23792533
30.0,147625149.42607597,147836182.65607598,148007366.395051,148157076.35775098,148289823.75660098,148411919.925451,148536390.055276,148674546.01327598,148847391.24427596,149060366.935276,149317876.96402597,149594258.98102596,149883596.146276,150173535.046276,150472092.767776,150789551.09977597,151114301.40802598,151430986.01527596,151756607.96377596,152066511.604276,152371497.45202598,152677322.50402603,152971677.889276,153232761.713776
31.0,147625149.42607597,147836182.65607598,148007366.395051,148157076.35775098,148289823.75660098,148411919.925451,148536390.055276,148674546.01327598,148847391.24427596,149060366.935276,149317876.96402597,149594258.98102596,149883596.146276,150173535.046276,150472092.767776,150789551.09977597,151114301.40802598,151430986.01527596,151756607.96377596,152066511.604276,152371497.45202598,152677322.50402603,152971677.889276,153232761.713776
32.0,1340248.3634250087,1342176.5619250087,1343699.8891750083,1345113.007775008,1346379.3198500078,1347569.2196250078,1348787.7773500073,1350281.8657250071,1352159.6327250076,1354582.4954750082,1357312.1634750082,1360275.4324750078,1363250.338225008,1365976.8442250078,1368731.1832250077,1371744.8994750069,1374741.9622250067,1377563.862225007,1380534.358225007,1383278.9767250074,1386235.350725008,1389291.583225008,1392168.513225008,1394579.6119750082
33.0,1340248.3634250087,1342176.5619250087,1343699.8891750083,1345113.007775008,1346379.3198500078,1347569.2196250078,1348787.7773500073,1350281.8657250071,1352159.6327250076,1354582.4954750082,1357312.1634750082,1360275.4324750078,1363250.338225008,1365976.8442250078,1368731.1832250077,1371744.8994750069,1374741.9622250067,1377563.862225007,1380534.358225007,1383278.9767250074,1386235.350725008,1389291.583225008,1392168.513225008,1394579.6119750082
34.0,4020745.090275026,4026529.6857750257,4031099.667525025,4035339.023325024,4039137.959550023,4042707.6588750235,4046363.3320500217,4050845.5971750217,4056478.8981750226,4063747.4864250245,4071936.4904250246,4080826.2974250233,4089751.014675024,4097930.532675023,4106193.549675023,4115234.6984250206,4124225.8866750197,4132691.586675021,4141603.074675021,4149836.930175022,4158706.0521750236,4167874.7496750243,4176505.5396750243,4183738.8359250245
35.0,4020745.090275026,4026529.6857750257,4031099.667525025,4035339.023325024,4039137.959550023,4042707.6588750235,4046363.3320500217,4050845.5971750217,4056478.8981750226,4063747.4864250245,4071936.4904250246,4080826.2974250233,4089751.014675024,4097930.532675023,4106193.549675023,4115234.6984250206,4124225.8866750197,4132691.586675021,4141603.074675021,4149836.930175022,4158706.0521750236,4167874.7496750243,4176505.5396750243,4183738.8359250245
36.0,798251.1269250022,799160.7986250023,799943.5420500023,800667.6626250026,801263.4040250027,801825.7756250029,802463.6693000031,803111.0370500027,803950.527550003,805147.9455500034,806659.4077000035,808348.9694000037,810006.9722250034,811739.7936000037,813480.9036750036,815647.7031750034,817976.4586750033,820454.4804250032,822831.4454250031,824832.3031750028,826382.7728500027,827814.519975003,829115.377725003,830308.0984750031
37.0,798251.1269250022,799160.7986250023,799943.5420500023,800667.6626250026,801263.4040250027,801825.7756250029,802463.6693000031,803111.0370500027,803950.527550003,805147.9455500034,806659.4077000035,808348.9694000037,810006.9722250034,811739.7936000037,813480.9036750036,815647.7031750034,817976.4586750033,820454.4804250032,822831.4454250031,824832.3031750028,826382.7728500027,827814.519975003,829115.377725003,830308.0984750031
38.0,2394753.3807750065,2397482.395875007,2399830.626150007,2402002.9878750076,2403790.212075008,2405477.3268750086,2407391.0079000094,2409333.111150008,2411851.582650009,2415443.83665001,2419978.2231000103,2425046.908200011,2430020.91667501,2435219.380800011,2440442.711025011,2446943.10952501,2453929.37602501,2461363.44127501,2468494.3362750094,2474496.9095250084,2479148.3185500083,2483443.559925009,2487346.133175009,2490924.2954250094
39.0,2394753.3807750065,2397482.395875007,2399830.626150007,2402002.9878750076,2403790.212075008,2405477.3268750086,2407391.0079000094,2409333.111150008,2411851.582650009,2415443.83665001,2419978.2231000103,2425046.908200011,2430020.91667501,2435219.380800011,2440442.711025011,2446943.10952501,2453929.37602501,2461363.44127501,2468494.3362750094,2474496.9095250084,2479148.3185500083,2483443.559925009,2487346.133175009,2490924.2954250094
40.0,1827730.7346749883,1830321.0854249883,1832344.353174988,1834061.8756749886,1835611.2726749885,1837037.9081749883,1838598.935924989,1840315.8011749885,1842682.3591749892,1845302.311424989,1848689.5239249896,1852265.0041749896,1856375.7614249897,1860163.9074249903,1864072.7294249898,1868684.1646749899,1873462.0681749901,1878099.6176749892,1882676.1951749893,1887264.3174249888,1891258.7526749892,1895197.8421749887,1898658.2976749886,1901670.0246749886
41.0,1827730.7346749883,1830321.0854249883,1832344.353174988,1834061.8756749886,1835611.2726749885,1837037.9081749883,1838598.935924989,1840315.8011749885,1842682.3591749892,1845302.311424989,1848689.5239249896,1852265.0041749896,1856375.7614249897,1860163.9074249903,1864072.7294249898,1868684.1646749899,1873462.0681749901,1878099.6176749892,1882676.1951749893,1887264.3174249888,1891258.7526749892,1895197.8421749887,1898658.2976749886,1901670.0246749886
42.0,5483192.204024965,5490963.256274965,5497033.059524964,5502185.627024965,5506833.818024965,5511113.7245249655,5515796.807774967,5520947.403524965,5528047.0775249675,5535906.934274967,5546068.571774969,5556795.012524969,5569127.284274969,5580491.722274971,5592218.188274969,5606052.49402497,5620386.204524971,5634298.853024967,5648028.585524968,5661792.952274967,5673776.258024967,5685593.526524967,5695974.893024966,5705010.074024966
43.0,5483192.204024965,5490963.256274965,5497033.059524964,5502185.627024965,5506833.818024965,5511113.7245249655,5515796.807774967,5520947.403524965,5528047.0775249675,5535906.934274967,5546068.571774969,5556795.012524969,5569127.284274969,5580491.722274971,5592218.188274969,5606052.49402497,5620386.204524971,5634298.853024967,5648028.585524968,5661792.952274967,5673776.258024967,5685593.526524967,5695974.893024966,5705010.074024966
44.0,1742934.3595249935,1744976.9762749942,1746781.1074499944,1748541.8915249938,1750046.139949994,1751452.1933499933,1752790.2282249935,1754292.113624994,1756289.7043499937,1758574.6889249934,1761742.682274993,1764639.943049992,1768119.288149992,1771520.2571499925,1774997.672999993,1778418.5692499934,1781859.8582499928,1785552.6632499932,1788848.297249993,1792111.3649249934,1795500.4183249923,1798505.3764499922,1801469.7832749933,1804313.8530749932
45.0,1742934.3595249935,1744976.9762749942,1746781.1074499944,1748541.8915249938,1750046.139949994,1751452.1933499933,1752790.2282249935,1754292.113624994,1756289.7043499937,1758574.6889249934,1761742.682274993,1764639.943049992,1768119.288149992,1771520.2571499925,1774997.672999993,1778418.5692499934,1781859.8582499928,1785552.6632499932,1788848.297249993,1792111.3649249934,1795500.4183249923,1798505.3764499922,1801469.7832749933,1804313.8530749932
46.0,5228803.078574981,5234930.928824983,5240343.322349983,5245625.674574981,5250138.419849982,5254356.58004998,5258370.68467498,5262876.340874982,5268869.113049981,5275724.06677498,5285228.046824979,5293919.829149976,5304357.864449976,5314560.7714499775,5324993.018999979,5335255.7077499805,5345579.574749978,5356657.989749979,5366544.891749979,5376334.09477498,5386501.254974977,5395516.129349977,5404409.34982498,5412941.55922498
47.0,5228803.078574981,5234930.928824983,5240343.322349983,5245625.674574981,5250138.419849982,5254356.58004998,5258370.68467498,5262876.340874982,5268869.113049981,5275724.06677498,5285228.046824979,5293919.829149976,5304357.864449976,5314560.7714499775,5324993.018999979,5335255.7077499805,5345579.574749978,5356657.989749979,5366544.891749979,5376334.09477498,5386501.254974977,5395516.129349977,5404409.34982498,5412941.55922498
48.0,1415032.7322000007,1416680.6987000005,1418071.8904500005,1419168.8839500009,1420155.5544499997,1421100.8254500004,1422176.07095,1423505.1261999991,1425011.5806999996,1426917.2151999997,1429093.3029499992,1431429.9031999991,1434242.5634499998,1436785.1144500005,1439373.5544500009,1441992.4257000012,1444613.247450001,1447302.7084500003,1450077.4834500009,1452668.6287000007,1455131.8369500008,1457578.4017000017,1460095.406200001,1462315.2679500007
49.0,1415032.7322000007,1416680.6987000005,1418071.8904500005,1419168.8839500009,1420155.5544499997,1421100.8254500004,1422176.07095,1423505.1261999991,1425011.5806999996,1426917.2151999997,1429093.3029499992,1431429.9031999991,1434242.5634499998,1436785.1144500005,1439373.5544500009,1441992.4257000012,1444613.247450001,1447302.7084500003,1450077.4834500009,1452668.6287000007,1455131.8369500008,1457578.4017000017,1460095.406200001,1462315.2679500007
50.0,4245098.196600002,4250042.096100002,4254215.671350001,4257506.651850003,4260466.663349999,4263302.476350001,4266528.212850001,4270515.378599998,4275034.7420999985,4280751.645599999,4287279.908849997,4294289.709599998,4302727.69035,4310355.343350002,4318120.663350003,4325977.277100003,4333839.742350003,4341908.12535,4350232.450350002,4358005.886100002,4365395.510850003,4372735.2051000055,4380286.218600003,4386945.803850003
51.0,4245098.196600002,4250042.096100002,4254215.671350001,4257506.651850003,4260466.663349999,4263302.476350001,4266528.212850001,4270515.378599998,4275034.7420999985,4280751.645599999,4287279.908849997,4294289.709599998,4302727.69035,4310355.343350002,4318120.663350003,4325977.277100003,4333839.742350003,4341908.12535,4350232.450350002,4358005.886100002,4365395.510850003,4372735.2051000055,4380286.218600003,4386945.803850003
52.0,1589853.2217750046,1591540.005275005,1593096.4220250044,1594521.5747750036,1595728.1396250036,1596942.0322500044,1598162.6930000035,1599605.854250003,1601784.7702500024,1604111.9337500026,1607047.996750003,1610202.216500003,1613536.1662500028,1616576.8275000022,1619982.605750002,1623698.039750002,1627504.3900000025,1631669.789250003,1636049.0027500028,1639650.8450000032,1642686.901750003,1645655.4945000035,1648170.464750002,1650526.9985000018
53.0,1589853.2217750046,1591540.005275005,1593096.4220250044,1594521.5747750036,1595728.1396250036,1596942.0322500044,1598162.6930000035,1599605.854250003,1601784.7702500024,1604111.9337500026,1607047.996750003,1610202.216500003,1613536.1662500028,1616576.8275000022,1619982.605750002,1623698.039750002,1627504.3900000025,1631669.789250003,1636049.0027500028,1639650.8450000032,1642686.901750003,1645655.4945000035,1648170.464750002,1650526.9985000018
54.0,4769559.665325014,4774620.015825015,4779289.266075013,4783564.724325011,4787184.418875011,4790826.0967500135,4794488.07900001,4798817.562750009,4805354.310750008,4812335.801250008,4821143.990250009,4830606.649500009,4840608.498750009,4849730.482500006,4859947.817250006,4871094.119250006,4882513.170000007,4895009.367750009,4908147.008250008,4918952.535000009,4928060.705250009,4936966.48350001,4944511.3942500055,4951580.995500006
55.0,4769559.665325014,4774620.015825015,4779289.266075013,4783564.724325011,4787184.418875011,4790826.0967500135,4794488.07900001,4798817.562750009,4805354.310750008,4812335.801250008,4821143.990250009,4830606.649500009,4840608.498750009,4849730.482500006,4859947.817250006,4871094.119250006,4882513.170000007,4895009.367750009,4908147.008250008,4918952.535000009,4928060.705250009,4936966.48350001,4944511.3942500055,4951580.995500006
56.0,3564425.912250012,3568665.8945000125,3572187.384750014,3575096.1085000136,3577874.654750013,3580404.446500012,3583048.445750011,3585731.2200000132,3588931.962250013,3593050.258250015,3597783.1170000145,3602916.938500015,3608350.936750016,3613550.116750017,3619075.505000017,3624793.2667500167,3630361.348750018,3635865.142500019,3641547.315000019,3647364.6055000196,3652969.6332500186,3658416.050250019,3664334.1342500187,3669350.7327500195
57.0,3564425.912250012,3568665.8945000125,3572187.384750014,3575096.1085000136,3577874.654750013,3580404.446500012,3583048.445750011,3585731.2200000132,3588931.962250013,3593050.258250015,3597783.1170000145,3602916.938500015,3608350.936750016,3613550.116750017,3619075.505000017,3624793.2667500167,3630361.348750018,3635865.142500019,3641547.315000019,3647364.6055000196,3652969.6332500186,3658416.050250019,3664334.1342500187,3669350.7327500195
58.0,10693277.736750036,10705997.683500037,10716562.154250043,10725288.325500041,10733623.96425004,10741213.339500036,10749145.337250033,10757193.66000004,10766795.886750039,10779150.774750045,10793349.351000044,10808750.815500045,10825052.810250048,10840650.35025005,10857226.51500005,10874379.80025005,10891084.046250055,10907595.427500058,10924641.945000056,10942093.816500058,10958908.899750056,10975248.150750056,10993002.402750056,11008052.198250059
59.0,10693277.736750036,10705997.683500037,10716562.154250043,10725288.325500041,10733623.96425004,10741213.339500036,10749145.337250033,10757193.66000004,10766795.886750039,10779150.774750045,10793349.351000044,10808750.815500045,10825052.810250048,10840650.35025005,10857226.51500005,10874379.80025005,10891084.046250055,10907595.427500058,10924641.945000056,10942093.816500058,10958908.899750056,10975248.150750056,10993002.402750056,11008052.198250059
60.0,1486305.5008249981,1488094.315574999,1489542.802699999,1490859.150074999,1492122.0362499987,1493257.411249998,1494458.983774998,1495899.5025249985,1497847.6900249987,1500156.732774999,1502732.055524999,1505456.599525,1508049.260024999,1510717.4295249998,1513721.388775,1516650.985775,1519856.263275,1523181.2895250004,1526205.7455250004,1529363.9085249999,1532772.1405250002,1535710.8752750002,1538422.5555250002,1540770.4527750008
61.0,1486305.5008249981,1488094.315574999,1489542.802699999,1490859.150074999,1492122.0362499987,1493257.411249998,1494458.983774998,1495899.5025249985,1497847.6900249987,1500156.732774999,1502732.055524999,1505456.599525,1508049.260024999,1510717.4295249998,1513721.388775,1516650.985775,1519856.263275,1523181.2895250004,1526205.7455250004,1529363.9085249999,1532772.1405250002,1535710.8752750002,1538422.5555250002,1540770.4527750008
62.0,4458916.502474994,4464282.946724997,4468628.408099997,4472577.4502249975,4476366.108749996,4479772.233749994,4483376.951324994,4487698.507574996,4493543.070074996,4500470.198324997,4508196.166574997,4516369.798575,4524147.780074997,4532152.288574999,4541164.166325,4549952.957325,4559568.789825,4569543.868575001,4578617.236575001,4588091.725575,4598316.4215750005,4607132.625825001,4615267.666575001,4622311.358325003
63.0,4458916.502474994,4464282.946724997,4468628.408099997,4472577.4502249975,4476366.108749996,4479772.233749994,4483376.951324994,4487698.507574996,4493543.070074996,4500470.198324997,4508196.166574997,4516369.798575,4524147.780074997,4532152.288574999,4541164.166325,4549952.957325,4559568.789825,4569543.868575001,4578617.236575001,4588091.725575,4598316.4215750005,4607132.625825001,4615267.666575001,4622311.358325003
64.0,863421.902599996,864494.5733749958,865412.5375999956,866270.9731499954,867079.6580999953,867920.9927249955,868803.3206999955,869671.959349996,870767.837599996,872164.1925999961,873636.5618499961,875188.8070999958,877125.9758499959,878733.2093499961,880523.1553499957,882318.5970999954,884165.2543499948,886088.3180999951,887930.2315999952,889735.8330999953,891577.2318499952,893239.2703499953,894721.1525999951,896238.9228499952
65.0,863421.902599996,864494.5733749958,865412.5375999956,866270.9731499954,867079.6580999953,867920.9927249955,868803.3206999955,869671.959349996,870767.837599996,872164.1925999961,873636.5618499961,875188.8070999958,877125.9758499959,878733.2093499961,880523.1553499957,882318.5970999954,884165.2543499948,886088.3180999951,887930.2315999952,889735.8330999953,891577.2318499952,893239.2703499953,894721.1525999951,896238.9228499952
66.0,2590265.707799988,2593483.7201249874,2596237.6127999867,2598812.9194499864,2601238.974299986,2603762.9781749863,2606409.9620999866,2609015.878049988,2612303.512799988,2616492.5777999884,2620909.6855499884,2625566.4212999875,2631377.9275499876,2636199.6280499883,2641569.466049987,2646955.791299986,2652495.7630499844,2658264.9542999854,2663790.6947999857,2669207.499299986,2674731.6955499854,2679717.811049986,2684163.4577999855,2688716.7685499857
67.0,2590265.707799988,2593483.7201249874,2596237.6127999867,2598812.9194499864,2601238.974299986,2603762.9781749863,2606409.9620999866,2609015.878049988,2612303.512799988,2616492.5777999884,2620909.6855499884,2625566.4212999875,2631377.9275499876,2636199.6280499883,2641569.466049987,2646955.791299986,2652495.7630499844,2658264.9542999854,2663790.6947999857,2669207.499299986,2674731.6955499854,2679717.811049986,2684163.4577999855,2688716.7685499857
68.0,1745698.1094999886,1747979.2004999889,1750041.7329999893,1751879.5369999895,1753454.16124999,1754839.1827499904,1756266.0284999898,1757987.4922499896,1760230.8122499897,1763702.91849999,1767303.8592499895,1770871.1824999899,1774576.9572499893,1778566.39924999,1782263.9249999903,1786115.37349999,1789997.00999999,1794143.8789999904,1798594.6534999905,1802553.3529999903,1806461.2154999909,1810099.2404999912,1813613.913749991,1816882.2052499913
69.0,1745698.1094999886,1747979.2004999889,1750041.7329999893,1751879.5369999895,1753454.16124999,1754839.1827499904,1756266.0284999898,1757987.4922499896,1760230.8122499897,1763702.91849999,1767303.8592499895,1770871.1824999899,1774576.9572499893,1778566.39924999,1782263.9249999903,1786115.37349999,1789997.00999999,1794143.8789999904,1798594.6534999905,1802553.3529999903,1806461.2154999909,1810099.2404999912,1813613.913749991,1816882.2052499913
70.0,5237094.328499965,5243937.601499966,5250125.198999967,5255638.610999969,5260362.483749971,5264517.548249971,5268798.085499969,5273962.476749969,5280692.436749969,5291108.75549997,5301911.5777499685,5312613.54749997,5323730.871749967,5335699.1977499705,5346791.774999971,5358346.12049997,5369991.0299999695,5382431.636999971,5395783.960499971,5407660.058999971,5419383.646499973,5430297.721499974,5440841.741249973,5450646.615749974
71.0,5237094.328499965,5243937.601499966,5250125.198999967,5255638.610999969,5260362.483749971,5264517.548249971,5268798.085499969,5273962.476749969,5280692.436749969,5291108.75549997,5301911.5777499685,5312613.54749997,5323730.871749967,5335699.1977499705,5346791.774999971,5358346.12049997,5369991.0299999695,5382431.636999971,5395783.960499971,5407660.058999971,5419383.646499973,5430297.721499974,5440841.741249973,5450646.615749974
72.0,1207905.7084999983,1209360.455499998,1210733.8617499983,1211930.7137499992,1212906.3774999988,1213853.567499999,1214834.826249998,1216003.4207499982,1217614.9112499978,1219561.262249998,1221712.6244999983,1224062.2267499976,1226452.1899999972,1228806.061499997,1231326.3219999967,1233923.916499997,1236401.2514999975,1238967.8682499977,1241490.8429999978,1244014.4357499983,1246487.0792499983,1249145.7107499985,1251589.1019999979,1253727.0124999974
73.0,1207905.7084999983,1209360.455499998,1210733.8617499983,1211930.7137499992,1212906.3774999988,1213853.567499999,1214834.826249998,1216003.4207499982,1217614.9112499978,1219561.262249998,1221712.6244999983,1224062.2267499976,1226452.1899999972,1228806.061499997,1231326.3219999967,1233923.916499997,1236401.2514999975,1238967.8682499977,1241490.8429999978,1244014.4357499983,1246487.0792499983,1249145.7107499985,1251589.1019999979,1253727.0124999974
74.0,3623717.125499995,3628081.366499994,3632201.585249995,3635792.1412499975,3638719.1324999966,3641560.702499997,3644504.478749994,3648010.2622499946,3652844.733749993,3658683.7867499944,3665137.873499995,3672186.6802499928,3679356.5699999915,3686418.184499991,3693978.96599999,3701771.749499991,3709203.7544999924,3716903.6047499934,3724472.5289999936,3732043.307249995,3739461.2377499947,3747437.132249995,3754767.3059999933,3761181.037499992
75.0,3623717.125499995,3628081.366499994,3632201.585249995,3635792.1412499975,3638719.1324999966,3641560.702499997,3644504.478749994,3648010.2622499946,3652844.733749993,3658683.7867499944,3665137.873499995,3672186.6802499928,3679356.5699999915,3686418.184499991,3693978.96599999,3701771.749499991,3709203.7544999924,3716903.6047499934,3724472.5289999936,3732043.307249995,3739461.2377499947,3747437.132249995,3754767.3059999933,3761181.037499992
76.0,6770260.286999993,6780819.724749994,6789171.955749998,6796352.761499995,6802560.914499991,6808224.298749988,6813377.88224999,6818833.124499989,6825447.185249989,6833167.04924999,6843048.318999984,6853578.362999986,6864576.8967499845,6875592.783749982,6886978.838749977,6899189.177749976,6911374.3362499755,6922834.390499976,6934501.4064999735,6946863.504999976,6959529.281999974,6972212.570749974,6985415.613249978,6996855.639999975
77.0,6770260.286999993,6780819.724749994,6789171.955749998,6796352.761499995,6802560.914499991,6808224.298749988,6813377.88224999,6818833.124499989,6825447.185249989,6833167.04924999,6843048.318999984,6853578.362999986,6864576.8967499845,6875592.783749982,6886978.838749977,6899189.177749976,6911374.3362499755,6922834.390499976,6934501.4064999735,6946863.504999976,6959529.281999974,6972212.570749974,6985415.613249978,6996855.639999975
78.0,20310780.86099998,20342459.174249984,20367515.867249995,20389058.284499988,20407682.743499972,20424672.896249965,20440133.64674997,20456499.373499967,20476341.555749968,20499501.147749968,20529144.956999954,20560735.088999957,20593730.690249953,20626778.351249944,20660936.516249932,20697567.533249926,20734123.008749925,20768503.17149993,20803504.21949992,20840590.514999926,20878587.84599992,20916637.71224992,20956246.839749932,20990566.919999927
79.0,20310780.86099998,20342459.174249984,20367515.867249995,20389058.284499988,20407682.743499972,20424672.896249965,20440133.64674997,20456499.373499967,20476341.555749968,20499501.147749968,20529144.956999954,20560735.088999957,20593730.690249953,20626778.351249944,20660936.516249932,20697567.533249926,20734123.008749925,20768503.17149993,20803504.21949992,20840590.514999926,20878587.84599992,20916637.71224992,20956246.839749932,20990566.919999927
80.0,1147959.3695000021,1149411.589250002,1150721.119500002,1151820.8680000023,1152786.735750003,1153664.985750003,1154562.7942500028,1155564.1430000027,1156778.3515000034,1158347.243750003,1160052.6512500027,1162026.4747500021,1164128.6817500028,1166231.912000003,1168353.2817500033,1170762.8875000032,1173107.793750003,1175446.9802500021,1177728.6697500022,1180082.1195000017,1182326.2312500016,1184341.8947500018,1186331.2495000015,1188103.090500002
81.0,1147959.3695000021,1149411.589250002,1150721.119500002,1151820.8680000023,1152786.735750003,1153664.985750003,1154562.7942500028,1155564.1430000027,1156778.3515000034,1158347.243750003,1160052.6512500027,1162026.4747500021,1164128.6817500028,1166231.912000003,1168353.2817500033,1170762.8875000032,1173107.793750003,1175446.9802500021,1177728.6697500022,1180082.1195000017,1182326.2312500016,1184341.8947500018,1186331.2495000015,1188103.090500002
82.0,3443878.1085000066,3448234.767750006,3452163.3585000057,3455462.604000007,3458360.2072500093,3460994.9572500093,3463688.3827500083,3466692.429000008,3470335.05450001,3475041.7312500086,3480157.953750008,3486079.4242500067,3492386.0452500083,3498695.736000009,3505059.84525001,3512288.66250001,3519323.381250009,3526340.9407500066,3533186.0092500066,3540246.3585000047,3546978.6937500047,3553025.6842500055,3558993.7485000044,3564309.2715000063
83.0,3443878.1085000066,3448234.767750006,3452163.3585000057,3455462.604000007,3458360.2072500093,3460994.9572500093,3463688.3827500083,3466692.429000008,3470335.05450001,3475041.7312500086,3480157.953750008,3486079.4242500067,3492386.0452500083,3498695.736000009,3505059.84525001,3512288.66250001,3519323.381250009,3526340.9407500066,3533186.0092500066,3540246.3585000047,3546978.6937500047,3553025.6842500055,3558993.7485000044,3564309.2715000063
84.0,980463.3957500086,981743.0852500089,982887.1415000086,983856.9472500086,984638.2682500086,985359.671000009,986193.5445000095,987101.7952500097,988420.1167500097,989860.4952500102,991581.2205000103,993176.31225001,995006.8100000098,996882.7132500098,998767.8690000097,1000754.8785000094,1002818.7492500092,1004760.1680000089,1007286.9415000089,1009458.4725000089,1011402.2447500085,1013496.0080000084,1015335.5652500083,1016965.9142500082
85.0,980463.3957500086,981743.0852500089,982887.1415000086,983856.9472500086,984638.2682500086,985359.671000009,986193.5445000095,987101.7952500097,988420.1167500097,989860.4952500102,991581.2205000103,993176.31225001,995006.8100000098,996882.7132500098,998767.8690000097,1000754.8785000094,1002818.7492500092,1004760.1680000089,1007286.9415000089,1009458.4725000089,1011402.2447500085,1013496.0080000084,1015335.5652500083,1016965.9142500082
86.0,2941390.187250026,2945229.2557500266,2948661.424500026,2951570.8417500257,2953914.8047500257,2956079.0130000273,2958580.6335000284,2961305.3857500292,2965260.350250029,2969581.4857500307,2974743.661500031,2979528.93675003,2985020.4300000295,2990648.1397500294,2996303.607000029,3002264.6355000283,3008456.2477500276,3014280.5040000267,3021860.8245000266,3028375.4175000265,3034206.7342500254,3040488.0240000254,3046006.6957500246,3050897.7427500244
87.0,2941390.187250026,2945229.2557500266,2948661.424500026,2951570.8417500257,2953914.8047500257,2956079.0130000273,2958580.6335000284,2961305.3857500292,2965260.350250029,2969581.4857500307,2974743.661500031,2979528.93675003,2985020.4300000295,2990648.1397500294,2996303.607000029,3002264.6355000283,3008456.2477500276,3014280.5040000267,3021860.8245000266,3028375.4175000265,3034206.7342500254,3040488.0240000254,3046006.6957500246,3050897.7427500244
88.0,1184167.9830499974,1185480.1389249978,1186521.2213249973,1187563.6128749968,1188400.4190249965,1189128.078299996,1189849.0054249961,1190659.8945999958,1191664.4409499958,1192858.6835749962,1194570.1637999963,1196431.2087999957,1198393.8697999958,1200148.788799997,1201884.2015499964,1203968.4005499966,1206272.2892999963,1208211.1317999954,1210108.8417999954,1211892.8998249948,1213593.8377499946,1215554.9840499952,1217494.8560749947,1218936.1238249955
89.0,1184167.9830499974,1185480.1389249978,1186521.2213249973,1187563.6128749968,1188400.4190249965,1189128.078299996,1189849.0054249961,1190659.8945999958,1191664.4409499958,1192858.6835749962,1194570.1637999963,1196431.2087999957,1198393.8697999958,1200148.788799997,1201884.2015499964,1203968.4005499966,1206272.2892999963,1208211.1317999954,1210108.8417999954,1211892.8998249948,1213593.8377499946,1215554.9840499952,1217494.8560749947,1218936.1238249955
90.0,3552503.9491499923,3556440.4167749933,3559563.663974992,3562690.8386249905,3565201.2570749894,3567384.234899988,3569547.0162749887,3571979.6837999877,3574993.322849987,3578576.050724989,3583710.4913999885,3589293.6263999874,3595181.6093999874,3600446.366399991,3605652.604649989,3611905.20164999,3618816.867899989,3624633.3953999863,3630326.525399986,3635678.699474985,3640781.513249984,3646664.9521499854,3652484.568224984,3656808.3714749864
91.0,3552503.9491499923,3556440.4167749933,3559563.663974992,3562690.8386249905,3565201.2570749894,3567384.234899988,3569547.0162749887,3571979.6837999877,3574993.322849987,3578576.050724989,3583710.4913999885,3589293.6263999874,3595181.6093999874,3600446.366399991,3605652.604649989,3611905.20164999,3618816.867899989,3624633.3953999863,3630326.525399986,3635678.699474985,3640781.513249984,3646664.9521499854,3652484.568224984,3656808.3714749864
92.0,3691421.4374000127,3696505.8714000117,3700806.650400011,3704809.545150011,3708075.450650012,3711020.204900012,3714132.402150012,3717455.0156500116,3721510.6261500125,3726321.058650012,3732491.4921500133,3739178.2396500115,3745979.18840001,3752803.233400012,3759876.1826500124,3766863.0046500126,3773504.2284000134,3780165.790900013,3787166.361650012,3794301.1861500107,3801632.211150011,3809254.6386500113,3816899.9754000115,3824463.7594000124
93.0,3691421.4374000127,3696505.8714000117,3700806.650400011,3704809.545150011,3708075.450650012,3711020.204900012,3714132.402150012,3717455.0156500116,3721510.6261500125,3726321.058650012,3732491.4921500133,3739178.2396500115,3745979.18840001,3752803.233400012,3759876.1826500124,3766863.0046500126,3773504.2284000134,3780165.790900013,3787166.361650012,3794301.1861500107,3801632.211150011,3809254.6386500113,3816899.9754000115,3824463.7594000124
94.0,11074264.312200038,11089517.614200035,11102419.951200033,11114428.635450032,11124226.351950036,11133060.614700036,11142397.206450036,11152365.046950035,11164531.878450038,11178963.175950035,11197474.476450041,11217534.718950035,11237937.56520003,11258409.700200036,11279628.547950037,11300589.013950039,11320512.68520004,11340497.37270004,11361499.084950035,11382903.558450032,11404896.633450033,11427763.915950034,11450699.926200034,11473391.278200038
95.0,11074264.312200038,11089517.614200035,11102419.951200033,11114428.635450032,11124226.351950036,11133060.614700036,11142397.206450036,11152365.046950035,11164531.878450038,11178963.175950035,11197474.476450041,11217534.718950035,11237937.56520003,11258409.700200036,11279628.547950037,11300589.013950039,11320512.68520004,11340497.37270004,11361499.084950035,11382903.558450032,11404896.633450033,11427763.915950034,11450699.926200034,11473391.278200038
96.0,1077007.390500001,1078368.5672500005,1079505.9112500001,1080487.98525,1081365.3219999997,1082230.5584999998,1083165.9134999993,1084192.586999999,1085565.4174999993,1087239.2264999994,1089197.9262499993,1091498.7934999992,1093745.3212499986,1095945.7297499985,1098262.2539999988,1100760.8729999987,1103317.3849999995,1105880.6002499994,1108472.4714999995,1110928.8512500003,1113378.752,1115612.5350000001,1117744.4857500005,1119668.3660000009
97.0,1077007.390500001,1078368.5672500005,1079505.9112500001,1080487.98525,1081365.3219999997,1082230.5584999998,1083165.9134999993,1084192.586999999,1085565.4174999993,1087239.2264999994,1089197.9262499993,1091498.7934999992,1093745.3212499986,1095945.7297499985,1098262.2539999988,1100760.8729999987,1103317.3849999995,1105880.6002499994,1108472.4714999995,1110928.8512500003,1113378.752,1115612.5350000001,1117744.4857500005,1119668.3660000009
98.0,3231022.171500003,3235105.701750002,3238517.7337500006,3241463.9557499997,3244095.965999999,3246691.6754999994,3249497.740499998,3252577.7609999967,3256696.2524999976,3261717.679499998,3267593.7787499977,3274496.3804999976,3281235.963749996,3287837.1892499956,3294786.7619999964,3302282.618999996,3309952.1549999984,3317641.8007499985,3325417.4144999986,3332786.553750001,3340136.256,3346837.6050000004,3353233.4572500014,3359005.0980000026
99.0,3231022.171500003,3235105.701750002,3238517.7337500006,3241463.9557499997,3244095.965999999,3246691.6754999994,3249497.740499998,3252577.7609999967,3256696.2524999976,3261717.679499998,3267593.7787499977,3274496.3804999976,3281235.963749996,3287837.1892499956,3294786.7619999964,3302282.618999996,3309952.1549999984,3317641.8007499985,3325417.4144999986,3332786.553750001,3340136.256,3346837.6050000004,3353233.4572500014,3359005.0980000026
100.0,3848250.8717499822,3853346.639349984,3857684.7729749843,3861323.340324984,3864423.565974982,3867395.6005799826,3870500.2759299814,3874347.43870498,3879177.6045299796,3885614.712329981,3893273.370679982,3901071.945304982,3909133.3748799823,3916826.029329982,3924915.08750498,3933226.6358549795,3941712.6099299802,3950278.0316299805,3960150.1374049815,3968206.4972299812,3975967.083904981,3983887.982004981,3991120.16125498,3997224.9141549794
101.0,3848250.8717499822,3853346.639349984,3857684.7729749843,3861323.340324984,3864423.565974982,3867395.6005799826,3870500.2759299814,3874347.43870498,3879177.6045299796,3885614.712329981,3893273.370679982,3901071.945304982,3909133.3748799823,3916826.029329982,3924915.08750498,3933226.6358549795,3941712.6099299802,3950278.0316299805,3960150.1374049815,3968206.4972299812,3975967.083904981,3983887.982004981,3991120.16125498,3997224.9141549794
102.0,11544752.615249947,11560039.918049952,11573054.318924952,11583970.020974953,11593270.697924946,11602186.801739948,11611500.827789944,11623042.31611494,11637532.813589938,11656844.136989944,11679820.112039946,11703215.835914945,11727400.124639947,11750478.087989947,11774745.262514941,11799679.907564938,11825137.82978994,11850834.094889943,11880450.412214944,11904619.491689943,11927901.251714943,11951663.946014943,11973360.48376494,11991674.742464937
103.0,11544752.615249947,11560039.918049952,11573054.318924952,11583970.020974953,11593270.697924946,11602186.801739948,11611500.827789944,11623042.31611494,11637532.813589938,11656844.136989944,11679820.112039946,11703215.835914945,11727400.124639947,11750478.087989947,11774745.262514941,11799679.907564938,11825137.82978994,11850834.094889943,11880450.412214944,11904619.491689943,11927901.251714943,11951663.946014943,11973360.48376494,11991674.742464937
104.0,6766747.849500044,6776302.579500048,6784394.447000046,6791166.762000048,6797464.48450005,6803561.260750048,6809933.278250049,6816634.206500048,6824892.629000049,6835129.44650005,6847260.081500047,6860484.814000045,6874126.059000049,6887563.299000048,6901705.524000048,6917561.509000044,6933709.286500044,6948791.0340000475,6964165.416500051,6978665.766500052,6992782.5990000535,7007505.349000051,7022039.689000052,7034848.044000055
105.0,6766747.849500044,6776302.579500048,6784394.447000046,6791166.762000048,6797464.48450005,6803561.260750048,6809933.278250049,6816634.206500048,6824892.629000049,6835129.44650005,6847260.081500047,6860484.814000045,6874126.059000049,6887563.299000048,6901705.524000048,6917561.509000044,6933709.286500044,6948791.0340000475,6964165.416500051,6978665.766500052,6992782.5990000535,7007505.349000051,7022039.689000052,7034848.044000055
106.0,20300243.54850013,20328907.738500144,20353183.34100014,20373500.286000144,20392393.453500148,20410683.782250144,20429799.834750146,20449902.619500145,20474677.887000147,20505388.33950015,20541780.24450014,20581454.442000136,20622378.177000146,20662689.897000145,20705116.572000142,20752684.527000133,20801127.859500133,20846373.102000143,20892496.24950015,20935997.299500156,20978347.797000162,21022516.04700015,21066119.067000158,21104544.132000163
107.0,20300243.54850013,20328907.738500144,20353183.34100014,20373500.286000144,20392393.453500148,20410683.782250144,20429799.834750146,20449902.619500145,20474677.887000147,20505388.33950015,20541780.24450014,20581454.442000136,20622378.177000146,20662689.897000145,20705116.572000142,20752684.527000133,20801127.859500133,20846373.102000143,20892496.24950015,20935997.299500156,20978347.797000162,21022516.04700015,21066119.067000158,21104544.132000163
108.0,2133465.203400005,2136346.9089000034,2138655.5966500035,2140785.8796500023,2142633.292425003,2144377.963350003,2146001.807250002,2148154.6890250007,2150713.3207750013,2153911.3132750024,2157942.177025001,2162232.4422749993,2166517.981274998,2170714.3165249974,2175593.215524998,2180592.015524999,2185782.585024999,2191027.407525,2196819.613775001,2201884.2760250033,2206524.091275003,2211096.4910250017,2215208.3912750017,2218882.1980250003
109.0,2133465.203400005,2136346.9089000034,2138655.5966500035,2140785.8796500023,2142633.292425003,2144377.963350003,2146001.807250002,2148154.6890250007,2150713.3207750013,2153911.3132750024,2157942.177025001,2162232.4422749993,2166517.981274998,2170714.3165249974,2175593.215524998,2180592.015524999,2185782.585024999,2191027.407525,2196819.613775001,2201884.2760250033,2206524.091275003,2211096.4910250017,2215208.3912750017,2218882.1980250003
110.0,6400395.610200016,6409040.72670001,6415966.78995001,6422357.638950007,6427899.877275009,6433133.890050009,6438005.421750005,6444464.067075002,6452139.962325004,6461733.939825008,6473826.531075003,6486697.3268249985,6499553.943824993,6512142.949574992,6526779.646574995,6541776.046574997,6557347.7550749965,6573082.2225750005,6590458.841325003,6605652.82807501,6619572.273825008,6633289.473075005,6645625.173825005,6656646.594075001
111.0,6400395.610200016,6409040.72670001,6415966.78995001,6422357.638950007,6427899.877275009,6433133.890050009,6438005.421750005,6444464.067075002,6452139.962325004,6461733.939825008,6473826.531075003,6486697.3268249985,6499553.943824993,6512142.949574992,6526779.646574995,6541776.046574997,6557347.7550749965,6573082.2225750005,6590458.841325003,6605652.82807501,6619572.273825008,6633289.473075005,6645625.173825005,6656646.594075001
112.0,1695151.3571249987,1696521.7089999982,1697712.6604249983,1698832.9501249988,1699841.5670999996,1701351.9791000003,1702903.7555000002,1704367.2320249998,1705583.205275,1707195.3087749996,1709284.8152749992,1711338.2010249996,1713454.4492749993,1715475.9735249989,1717507.0837749992,1720083.8495249993,1722548.2287749993,1724570.5650249994,1726719.5877750001,1728724.4087750006,1730785.133025001,1732881.6092750006,1734697.0800250003,1736343.1710250003
113.0,1695151.3571249987,1696521.7089999982,1697712.6604249983,1698832.9501249988,1699841.5670999996,1701351.9791000003,1702903.7555000002,1704367.2320249998,1705583.205275,1707195.3087749996,1709284.8152749992,1711338.2010249996,1713454.4492749993,1715475.9735249989,1717507.0837749992,1720083.8495249993,1722548.2287749993,1724570.5650249994,1726719.5877750001,1728724.4087750006,1730785.133025001,1732881.6092750006,1734697.0800250003,1736343.1710250003
114.0,5085454.071374996,5089565.126999995,5093137.981274995,5096498.850374997,5099524.701299999,5104055.937300001,5108711.266500001,5113101.696075,5116749.615825,5121585.926324999,5127854.4458249975,5134014.603074999,5140363.347824998,5146427.920574997,5152521.251324998,5160251.548574998,5167644.686324998,5173711.695074998,5180158.763325,5186173.226325002,5192355.399075003,5198644.827825002,5204091.240075001,5209029.513075001
115.0,5085454.071374996,5089565.126999995,5093137.981274995,5096498.850374997,5099524.701299999,5104055.937300001,5108711.266500001,5113101.696075,5116749.615825,5121585.926324999,5127854.4458249975,5134014.603074999,5140363.347824998,5146427.920574997,5152521.251324998,5160251.548574998,5167644.686324998,5173711.695074998,5180158.763325,5186173.226325002,5192355.399075003,5198644.827825002,5204091.240075001,5209029.513075001
116.0,2048246.704999994,2051154.9249999938,2053789.4622499945,2056377.9297499945,2058345.8959999946,2060035.5864999949,2061857.3819999949,2064004.3139999956,2067066.2227499958,2070697.262499996,2074982.357749996,2079220.437749996,2083505.287749996,2087934.5859999964,2092984.634499996,2098051.3604999958,2102982.015499995,2107890.3929999946,2112905.127999995,2117661.4129999946,2122621.0529999947,2127450.1004999946,2132346.552499995,2136192.8387499936
117.0,2048246.704999994,2051154.9249999938,2053789.4622499945,2056377.9297499945,2058345.8959999946,2060035.5864999949,2061857.3819999949,2064004.3139999956,2067066.2227499958,2070697.262499996,2074982.357749996,2079220.437749996,2083505.287749996,2087934.5859999964,2092984.634499996,2098051.3604999958,2102982.015499995,2107890.3929999946,2112905.127999995,2117661.4129999946,2122621.0529999947,2127450.1004999946,2132346.552499995,2136192.8387499936
118.0,6144740.114999982,6153464.774999982,6161368.386749984,6169133.789249984,6175037.687999984,6180106.759499985,6185572.145999985,6192012.941999987,6201198.668249987,6212091.787499988,6224947.073249988,6237661.3132499885,6250515.863249987,6263803.757999989,6278953.903499988,6294154.081499987,6308946.046499985,6323671.178999984,6338715.383999985,6352984.238999983,6367863.158999984,6382350.301499983,6397039.657499986,6408578.516249981
119.0,6144740.114999982,6153464.774999982,6161368.386749984,6169133.789249984,6175037.687999984,6180106.759499985,6185572.145999985,6192012.941999987,6201198.668249987,6212091.787499988,6224947.073249988,6237661.3132499885,6250515.863249987,6263803.757999989,6278953.903499988,6294154.081499987,6308946.046499985,6323671.178999984,6338715.383999985,6352984.238999983,6367863.158999984,6382350.301499983,6397039.657499986,6408578.516249981
120.0,1954259.2239250024,1956869.8865000026,1959197.8720750022,1961239.7193750017,1963125.4259750019,1964782.5802500015,1966349.2454750016,1968192.881600002,1970313.7587500012,1972815.549325002,1976335.5813000028,1979374.0428250027,1982396.599275002,1985578.4890500023,1989028.1154750027,1992489.0856000022,1995875.638475002,1999030.432600002,2002351.451275002,2005836.8225500018,2009371.8002500015,2012931.041700001,2016339.1688750014,2019594.4356500017
121.0,1954259.2239250024,1956869.8865000026,1959197.8720750022,1961239.7193750017,1963125.4259750019,1964782.5802500015,1966349.2454750016,1968192.881600002,1970313.7587500012,1972815.549325002,1976335.5813000028,1979374.0428250027,1982396.599275002,1985578.4890500023,1989028.1154750027,1992489.0856000022,1995875.638475002,1999030.432600002,2002351.451275002,2005836.8225500018,2009371.8002500015,2012931.041700001,2016339.1688750014,2019594.4356500017
122.0,5862777.671775008,5870609.6595000075,5877593.616225006,5883719.158125006,5889376.277925005,5894347.740750005,5899047.736425005,5904578.644800006,5910941.276250004,5918446.647975005,5929006.7439000085,5938122.1284750085,5947189.797825006,5956735.467150006,5967084.346425008,5977467.256800007,5987626.915425006,5997091.297800006,6007054.353825006,6017510.467650006,6028115.400750005,6038793.125100004,6049017.506625004,6058783.306950005
123.0,5862777.671775008,5870609.6595000075,5877593.616225006,5883719.158125006,5889376.277925005,5894347.740750005,5899047.736425005,5904578.644800006,5910941.276250004,5918446.647975005,5929006.7439000085,5938122.1284750085,5947189.797825006,5956735.467150006,5967084.346425008,5977467.256800007,5987626.915425006,5997091.297800006,6007054.353825006,6017510.467650006,6028115.400750005,6038793.125100004,6049017.506625004,6058783.306950005
124.0,55466722.30785023,55538496.885850236,55598403.83235025,55651633.57860028,55698585.61260028,55741191.77210029,55784103.22885029,55832232.42735028,55893031.639600284,55969974.96885028,56059433.605600305,56157783.442600295,56258864.489850275,56358620.89360029,56463193.0376003,56571187.12160029,56679736.37085028,56789632.34510029,56900961.40710029,57008622.63535029,57117221.6733503,57223195.93810031,57324783.20810032,57415353.2888503
125.0,55466722.30785023,55538496.885850236,55598403.83235025,55651633.57860028,55698585.61260028,55741191.77210029,55784103.22885029,55832232.42735028,55893031.639600284,55969974.96885028,56059433.605600305,56157783.442600295,56258864.489850275,56358620.89360029,56463193.0376003,56571187.12160029,56679736.37085028,56789632.34510029,56900961.40710029,57008622.63535029,57117221.6733503,57223195.93810031,57324783.20810032,57415353.2888503
126.0,166400166.92355067,166615490.6575507,166795211.49705073,166954900.73580083,167095756.83780086,167223575.31630087,167352309.68655086,167496697.28205085,167679094.91880086,167909924.90655082,168178300.81680092,168473350.32780087,168776593.46955082,169075862.68080088,169389579.1128009,169713561.36480087,170039209.11255085,170368897.03530088,170702884.22130087,171025867.90605086,171351665.02005088,171669587.81430092,171974349.62430096,172246059.8665509
127.0,166400166.92355067,166615490.6575507,166795211.49705073,166954900.73580083,167095756.83780086,167223575.31630087,167352309.68655086,167496697.28205085,167679094.91880086,167909924.90655082,168178300.81680092,168473350.32780087,168776593.46955082,169075862.68080088,169389579.1128009,169713561.36480087,170039209.11255085,170368897.03530088,170702884.22130087,171025867.90605086,171351665.02005088,171669587.81430092,171974349.62430096,172246059.8665509
128.0,3883105.9915000056,3889133.8010000032,3894035.9200000037,3898083.9137500036,3901795.0937500033,3905296.5392500022,3908607.900750003,3912290.649750001,3916434.3742500013,3921705.584500002,3927980.485500001,3934670.2269999995,3941979.1764999996,3949174.267749999,3956618.0712499986,3963968.404499998,3971416.6557499967,3978740.471999996,3986063.708249995,3993650.3844999946,4001517.911749995,4009595.7184999944,4017953.690249993,4024991.682499991
129.0,3883105.9915000056,3889133.8010000032,3894035.9200000037,3898083.9137500036,3901795.0937500033,3905296.5392500022,3908607.900750003,3912290.649750001,3916434.3742500013,3921705.584500002,3927980.485500001,3934670.2269999995,3941979.1764999996,3949174.267749999,3956618.0712499986,3963968.404499998,3971416.6557499967,3978740.471999996,3986063.708249995,3993650.3844999946,4001517.911749995,4009595.7184999944,4017953.690249993,4024991.682499991
130.0,11649317.974500017,11667401.40300001,11682107.760000011,11694251.74125001,11705385.28125001,11715889.617750008,11725823.702250008,11736871.949250001,11749303.122750003,11765116.753500007,11783941.456500003,11804010.680999998,11825937.529499998,11847522.803249998,11869854.213749995,11891905.213499993,11914249.96724999,11936221.415999988,11958191.124749985,11980951.153499983,12004553.735249985,12028787.155499984,12053861.07074998,12074975.047499973
131.0,11649317.974500017,11667401.40300001,11682107.760000011,11694251.74125001,11705385.28125001,11715889.617750008,11725823.702250008,11736871.949250001,11749303.122750003,11765116.753500007,11783941.456500003,11804010.680999998,11825937.529499998,11847522.803249998,11869854.213749995,11891905.213499993,11914249.96724999,11936221.415999988,11958191.124749985,11980951.153499983,12004553.735249985,12028787.155499984,12053861.07074998,12074975.047499973
132.0,689920.800974997,690651.8237999969,691206.1686249968,691743.1050999967,692278.8227999969,692776.516699997,693270.9344749966,693790.0115249964,694399.6423249962,695139.0681749963,696074.1254749964,697211.6979249961,698344.751724996,699500.004024996,700616.1100249961,701685.4342749962,702848.5200249964,704032.997024996,705242.1550249958,706288.3970249959,707301.642149996,708322.554399996,709519.8776499963,710353.8623499965
133.0,689920.800974997,690651.8237999969,691206.1686249968,691743.1050999967,692278.8227999969,692776.516699997,693270.9344749966,693790.0115249964,694399.6423249962,695139.0681749963,696074.1254749964,697211.6979249961,698344.751724996,699500.004024996,700616.1100249961,701685.4342749962,702848.5200249964,704032.997024996,705242.1550249958,706288.3970249959,707301.642149996,708322.554399996,709519.8776499963,710353.8623499965
134.0,2069762.402924991,2071955.4713999906,2073618.5058749905,2075229.3152999901,2076836.4683999908,2078329.550099991,2079812.8034249898,2081370.0345749892,2083198.9269749885,2085417.2045249888,2088222.3764249892,2091635.0937749883,2095034.255174988,2098500.012074988,2101848.3300749883,2105056.3028249885,2108545.560074989,2112098.9910749877,2115726.465074987,2118865.191074988,2121904.926449988,2124967.6631999877,2128559.632949989,2131061.5870499895
135.0,2069762.402924991,2071955.4713999906,2073618.5058749905,2075229.3152999901,2076836.4683999908,2078329.550099991,2079812.8034249898,2081370.0345749892,2083198.9269749885,2085417.2045249888,2088222.3764249892,2091635.0937749883,2095034.255174988,2098500.012074988,2101848.3300749883,2105056.3028249885,2108545.560074989,2112098.9910749877,2115726.465074987,2118865.191074988,2121904.926449988,2124967.6631999877,2128559.632949989,2131061.5870499895
136.0,1517267.5634999909,1519125.3409999905,1520826.5637499907,1522470.8409999907,1524161.3109999904,1525744.3557499903,1527184.5172499905,1528899.13799999,1531012.7902499905,1533603.6917499907,1536335.9604999903,1539365.1152499903,1542480.8214999903,1545338.90024999,1548507.19024999,1551897.07449999,1555038.86899999,1558359.7862499899,1561532.35099999,1564604.1179999895,1568046.0114999898,1571301.9682499894,1574381.5412499893,1577197.1829999893
137.0,1517267.5634999909,1519125.3409999905,1520826.5637499907,1522470.8409999907,1524161.3109999904,1525744.3557499903,1527184.5172499905,1528899.13799999,1531012.7902499905,1533603.6917499907,1536335.9604999903,1539365.1152499903,1542480.8214999903,1545338.90024999,1548507.19024999,1551897.07449999,1555038.86899999,1558359.7862499899,1561532.35099999,1564604.1179999895,1568046.0114999898,1571301.9682499894,1574381.5412499893,1577197.1829999893
138.0,4551802.690499973,4557376.022999971,4562479.691249972,4567412.522999972,4572483.932999971,4577233.0672499705,4581553.551749972,4586697.41399997,4593038.370749972,4600811.075249972,4609007.88149997,4618095.3457499705,4627442.464499971,4636016.70074997,4645521.57074997,4655691.2234999705,4665116.60699997,4675079.35874997,4684597.05299997,4693812.353999969,4704138.034499969,4713905.904749968,4723144.623749968,4731591.548999968
139.0,4551802.690499973,4557376.022999971,4562479.691249972,4567412.522999972,4572483.932999971,4577233.0672499705,4581553.551749972,4586697.41399997,4593038.370749972,4600811.075249972,4609007.88149997,4618095.3457499705,4627442.464499971,4636016.70074997,4645521.57074997,4655691.2234999705,4665116.60699997,4675079.35874997,4684597.05299997,4693812.353999969,4704138.034499969,4713905.904749968,4723144.623749968,4731591.548999968
140.0,1270926.615949998,1271620.3163249984,1272247.8381499986,1272811.2333499985,1273292.6066499979,1273715.0143249983,1274192.3352749983,1274711.8310499985,1275385.2219999987,1276295.318999999,1277272.0169999993,1278311.6952499996,1279372.1624999987,1280332.7275999985,1281371.7180999976,1282416.464099998,1283659.418849998,1284835.0975999977,1285963.567349998,1287004.237849998,1288217.5563499972,1289356.3363499963,1290445.3076249964,1291416.1216749968
141.0,1270926.615949998,1271620.3163249984,1272247.8381499986,1272811.2333499985,1273292.6066499979,1273715.0143249983,1274192.3352749983,1274711.8310499985,1275385.2219999987,1276295.318999999,1277272.0169999993,1278311.6952499996,1279372.1624999987,1280332.7275999985,1281371.7180999976,1282416.464099998,1283659.418849998,1284835.0975999977,1285963.567349998,1287004.237849998,1288217.5563499972,1289356.3363499963,1290445.3076249964,1291416.1216749968
142.0,3812779.847849994,3814860.948974995,3816743.514449996,3818433.7000499954,3819877.819949994,3821145.0429749945,3822577.005824995,3824135.493149996,3826155.665999996,3828885.9569999967,3831816.050999998,3834935.0857499987,3838116.487499996,3840998.1827999954,3844115.154299993,3847249.392299994,3850978.2565499935,3854505.292799993,3857890.702049994,3861012.713549994,3864652.6690499913,3868069.009049989,3871335.922874989,3874248.3650249904
143.0,3812779.847849994,3814860.948974995,3816743.514449996,3818433.7000499954,3819877.819949994,3821145.0429749945,3822577.005824995,3824135.493149996,3826155.665999996,3828885.9569999967,3831816.050999998,3834935.0857499987,3838116.487499996,3840998.1827999954,3844115.154299993,3847249.392299994,3850978.2565499935,3854505.292799993,3857890.702049994,3861012.713549994,3864652.6690499913,3868069.009049989,3871335.922874989,3874248.3650249904
144.0,6545301.289749981,6553890.639499979,6560405.379249985,6566053.702499986,6571085.93474999,6575629.901999993,6579774.641499999,6584546.949499992,6590701.478749991,6598519.856249995,6606988.093499995,6618007.782999997,6628204.700499998,6638598.165499998,6649716.135499999,6661602.3330000015,6673584.717999999,6685109.363,6696705.850499999,6707781.2705,6718956.2245000005,6730153.788250002,6740786.540750001,6750447.558249999
145.0,6545301.289749981,6553890.639499979,6560405.379249985,6566053.702499986,6571085.93474999,6575629.901999993,6579774.641499999,6584546.949499992,6590701.478749991,6598519.856249995,6606988.093499995,6618007.782999997,6628204.700499998,6638598.165499998,6649716.135499999,6661602.3330000015,6673584.717999999,6685109.363,6696705.850499999,6707781.2705,6718956.2245000005,6730153.788250002,6740786.540750001,6750447.558249999
146.0,19635903.869249944,19661671.91849994,19681216.137749955,19698161.107499957,19713257.80424997,19726889.705999978,19739323.924499996,19753640.848499976,19772104.436249975,19795559.568749983,19820964.280499984,19854023.348999992,19884614.101499997,19915794.496499993,19949148.406499997,19984806.999000005,20020754.154,20055328.089,20090117.551499996,20123343.811499998,20156868.6735,20190461.364750005,20222359.622250002,20251342.674749997
147.0,19635903.869249944,19661671.91849994,19681216.137749955,19698161.107499957,19713257.80424997,19726889.705999978,19739323.924499996,19753640.848499976,19772104.436249975,19795559.568749983,19820964.280499984,19854023.348999992,19884614.101499997,19915794.496499993,19949148.406499997,19984806.999000005,20020754.154,20055328.089,20090117.551499996,20123343.811499998,20156868.6735,20190461.364750005,20222359.622250002,20251342.674749997
148.0,1340303.0264999992,1342216.207499999,1343968.7349999992,1345298.2114999986,1346428.3847499986,1347623.7789999982,1348856.2542499981,1350424.5797499984,1352423.059249998,1354880.618999998,1357539.2339999978,1360540.4259999979,1363322.4139999973,1366088.7669999977,1369025.5617499975,1372155.7949999978,1375233.6239999977,1378539.0059999977,1381811.7522499978,1385167.724249998,1388384.6149999981,1391332.8622499977,1393863.0122499976,1396616.1824999976
149.0,1340303.0264999992,1342216.207499999,1343968.7349999992,1345298.2114999986,1346428.3847499986,1347623.7789999982,1348856.2542499981,1350424.5797499984,1352423.059249998,1354880.618999998,1357539.2339999978,1360540.4259999979,1363322.4139999973,1366088.7669999977,1369025.5617499975,1372155.7949999978,1375233.6239999977,1378539.0059999977,1381811.7522499978,1385167.724249998,1388384.6149999981,1391332.8622499977,1393863.0122499976,1396616.1824999976
150.0,4020909.0794999977,4026648.6224999973,4031906.2049999973,4035894.634499996,4039285.154249996,4042871.3369999947,4046568.762749994,4051273.739249995,4057269.177749994,4064641.8569999943,4072617.7019999935,4081621.2779999934,4089967.241999992,4098266.300999993,4107076.6852499926,4116467.3849999933,4125700.871999993,4135617.017999993,4145435.256749993,4155503.1727499943,4165153.844999994,4173998.5867499933,4181589.0367499925,4189848.547499993
151.0,4020909.0794999977,4026648.6224999973,4031906.2049999973,4035894.634499996,4039285.154249996,4042871.3369999947,4046568.762749994,4051273.739249995,4057269.177749994,4064641.8569999943,4072617.7019999935,4081621.2779999934,4089967.241999992,4098266.300999993,4107076.6852499926,4116467.3849999933,4125700.871999993,4135617.017999993,4145435.256749993,4155503.1727499943,4165153.844999994,4173998.5867499933,4181589.0367499925,4189848.547499993
152.0,4904062.97924997,4909923.892499967,4914731.224249966,4918943.7437499715,4922935.8177499715,4926568.537999966,4930067.907749967,4933984.725749966,4938592.8147499645,4944536.644749967,4951067.642749965,4959051.7849999685,4967222.391249967,4975381.3902499685,4983831.954499966,4992676.396499966,5001627.379499966,5011115.559499966,5020636.903999965,5029977.954499965,5038346.388999965,5047224.774749964,5055028.585499965,5062631.829499963
153.0,4904062.97924997,4909923.892499967,4914731.224249966,4918943.7437499715,4922935.8177499715,4926568.537999966,4930067.907749967,4933984.725749966,4938592.8147499645,4944536.644749967,4951067.642749965,4959051.7849999685,4967222.391249967,4975381.3902499685,4983831.954499966,4992676.396499966,5001627.379499966,5011115.559499966,5020636.903999965,5029977.954499965,5038346.388999965,5047224.774749964,5055028.585499965,5062631.829499963
154.0,14712188.937749911,14729771.6774999,14744193.6727499,14756831.231249914,14768807.453249915,14779705.6139999,14790203.723249901,14801954.177249897,14815778.444249894,14833609.934249902,14853202.928249896,14877155.354999905,14901667.173749901,14926144.170749906,14951495.863499898,14978029.1894999,15004882.138499899,15033346.678499898,15061910.711999893,15089933.863499895,15115039.166999895,15141674.32424989,15165085.756499894,15187895.488499887
155.0,14712188.937749911,14729771.6774999,14744193.6727499,14756831.231249914,14768807.453249915,14779705.6139999,14790203.723249901,14801954.177249897,14815778.444249894,14833609.934249902,14853202.928249896,14877155.354999905,14901667.173749901,14926144.170749906,14951495.863499898,14978029.1894999,15004882.138499899,15033346.678499898,15061910.711999893,15089933.863499895,15115039.166999895,15141674.32424989,15165085.756499894,15187895.488499887
156.0,3391544.266749984,3395927.0764999837,3399961.9682499846,3403346.7799999863,3406457.0447499864,3409125.902249988,3412013.195999988,3414967.0397499874,3419155.2702499866,3424170.9819999854,3430185.8989999862,3436630.377999987,3442520.532499987,3448924.414499987,3455332.3654999863,3462155.296749986,3468988.883999985,3475815.315749986,3482895.6339999856,3489859.552999985,3496579.1289999867,3503439.2577499873,3509946.474499988,3515424.760249988
157.0,3391544.266749984,3395927.0764999837,3399961.9682499846,3403346.7799999863,3406457.0447499864,3409125.902249988,3412013.195999988,3414967.0397499874,3419155.2702499866,3424170.9819999854,3430185.8989999862,3436630.377999987,3442520.532499987,3448924.414499987,3455332.3654999863,3462155.296749986,3468988.883999985,3475815.315749986,3482895.6339999856,3489859.552999985,3496579.1289999867,3503439.2577499873,3509946.474499988,3515424.760249988
158.0,10174632.800249953,10187781.229499951,10199885.904749954,10210040.339999959,10219371.13424996,10227377.706749965,10236039.587999964,10244901.119249962,10257465.81074996,10272512.945999956,10290557.69699996,10309891.13399996,10327561.597499961,10346773.24349996,10365997.096499959,10386465.890249956,10406966.651999956,10427445.947249958,10448686.901999958,10469578.658999955,10489737.386999961,10510317.773249961,10529839.423499964,10546274.280749965
159.0,10174632.800249953,10187781.229499951,10199885.904749954,10210040.339999959,10219371.13424996,10227377.706749965,10236039.587999964,10244901.119249962,10257465.81074996,10272512.945999956,10290557.69699996,10309891.13399996,10327561.597499961,10346773.24349996,10365997.096499959,10386465.890249956,10406966.651999956,10427445.947249958,10448686.901999958,10469578.658999955,10489737.386999961,10510317.773249961,10529839.423499964,10546274.280749965
160.0,2041892.7510000032,2043832.0445000038,2045685.957250004,2047173.5737500044,2048494.9270000039,2049789.7030000044,2051112.6335000035,2052514.1535000037,2054271.0442500045,2056335.6687500041,2058643.6020000041,2061219.0237500041,2063868.9772500037,2066601.5132500033,2069495.2155000034,2072375.9722500027,2075160.446250003,2077961.697250003,2080907.7570000023,2083824.0017500028,2086529.6625000022,2089675.754250003,2092554.847250003,2095018.3945000032
161.0,2041892.7510000032,2043832.0445000038,2045685.957250004,2047173.5737500044,2048494.9270000039,2049789.7030000044,2051112.6335000035,2052514.1535000037,2054271.0442500045,2056335.6687500041,2058643.6020000041,2061219.0237500041,2063868.9772500037,2066601.5132500033,2069495.2155000034,2072375.9722500027,2075160.446250003,2077961.697250003,2080907.7570000023,2083824.0017500028,2086529.6625000022,2089675.754250003,2092554.847250003,2095018.3945000032
162.0,6125678.25300001,6131496.133500012,6137057.871750012,6141520.721250013,6145484.781000012,6149369.109000013,6153337.900500011,6157542.460500011,6162813.132750014,6169007.006250013,6175930.806000013,6183657.071250012,6191606.931750011,6199804.53975001,6208485.64650001,6217127.916750008,6225481.338750009,6233885.091750009,6242723.271000007,6251472.005250009,6259588.987500006,6269027.262750009,6277664.541750008,6285055.18350001
163.0,6125678.25300001,6131496.133500012,6137057.871750012,6141520.721250013,6145484.781000012,6149369.109000013,6153337.900500011,6157542.460500011,6162813.132750014,6169007.006250013,6175930.806000013,6183657.071250012,6191606.931750011,6199804.53975001,6208485.64650001,6217127.916750008,6225481.338750009,6233885.091750009,6242723.271000007,6251472.005250009,6259588.987500006,6269027.262750009,6277664.541750008,6285055.18350001
164.0,1732922.0835999982,1735684.8775999984,1738043.223099999,1740016.8693499996,1741648.1908500001,1743297.154600001,1744976.4158500002,1746807.9866000006,1749079.8263500002,1752041.50285,1755800.0136000009,1759587.1248500003,1763253.1298500006,1766822.0558500008,1770692.1326000013,1774975.6153500015,1779356.9688500015,1783427.1291000028,1787510.1828500035,1791662.9401000035,1795630.3871000044,1799573.9311000037,1803204.8693500035,1806623.5431000034
165.0,1732922.0835999982,1735684.8775999984,1738043.223099999,1740016.8693499996,1741648.1908500001,1743297.154600001,1744976.4158500002,1746807.9866000006,1749079.8263500002,1752041.50285,1755800.0136000009,1759587.1248500003,1763253.1298500006,1766822.0558500008,1770692.1326000013,1774975.6153500015,1779356.9688500015,1783427.1291000028,1787510.1828500035,1791662.9401000035,1795630.3871000044,1799573.9311000037,1803204.8693500035,1806623.5431000034
166.0,5198766.250799995,5207054.632799995,5214129.669299996,5220050.608049999,5224944.572550001,5229891.463800003,5234929.24755,5240423.959800002,5247239.479050001,5256124.50855,5267400.040800002,5278761.374550001,5289759.389550002,5300466.167550002,5312076.397800004,5324926.8460500045,5338070.906550004,5350281.387300009,5362530.548550011,5374988.820300011,5386891.161300013,5398721.793300011,5409614.608050011,5419870.62930001
167.0,5198766.250799995,5207054.632799995,5214129.669299996,5220050.608049999,5224944.572550001,5229891.463800003,5234929.24755,5240423.959800002,5247239.479050001,5256124.50855,5267400.040800002,5278761.374550001,5289759.389550002,5300466.167550002,5312076.397800004,5324926.8460500045,5338070.906550004,5350281.387300009,5362530.548550011,5374988.820300011,5386891.161300013,5398721.793300011,5409614.608050011,5419870.62930001
168.0,60634605.58920006,60715266.373950064,60781617.25745005,60839160.13670006,60888787.48420006,60933816.61345005,60977595.98320006,61027137.39120006,61088616.16420006,61166392.206200056,61257932.20245006,61359873.83995005,61465310.101450026,61570098.513450034,61680671.65120003,61796658.74195004,61914545.237200044,62032033.65645005,62149965.20495005,62264038.40695005,62374665.21745005,62483614.65570006,62589183.96620005,62681841.789700046
169.0,60634605.58920006,60715266.373950064,60781617.25745005,60839160.13670006,60888787.48420006,60933816.61345005,60977595.98320006,61027137.39120006,61088616.16420006,61166392.206200056,61257932.20245006,61359873.83995005,61465310.101450026,61570098.513450034,61680671.65120003,61796658.74195004,61914545.237200044,62032033.65645005,62149965.20495005,62264038.40695005,62374665.21745005,62483614.65570006,62589183.96620005,62681841.789700046
170.0,181903816.76760018,182145799.1218502,182344851.77235016,182517480.41010016,182666362.45260018,182801449.84035015,182932787.94960016,183081412.17360017,183265848.49260017,183499176.61860016,183773796.60735017,184079621.51985013,184395930.30435008,184710295.5403501,185042014.9536001,185389976.22585014,185743635.71160012,186096100.96935016,186449895.61485016,186792115.22085014,187123995.65235016,187450843.96710017,187767551.89860016,188045525.36910015
171.0,181903816.76760018,182145799.1218502,182344851.77235016,182517480.41010016,182666362.45260018,182801449.84035015,182932787.94960016,183081412.17360017,183265848.49260017,183499176.61860016,183773796.60735017,184079621.51985013,184395930.30435008,184710295.5403501,185042014.9536001,185389976.22585014,185743635.71160012,186096100.96935016,186449895.61485016,186792115.22085014,187123995.65235016,187450843.96710017,187767551.89860016,188045525.36910015
172.0,6339225.3037500065,6351411.488750006,6360796.202250006,6368424.668250005,6374798.498500004,6380502.315250003,6385879.159500002,6391720.240500005,6399399.935000005,6408646.963250003,6419620.530750002,6431602.368250004,6444866.72825,6457951.388249998,6471584.9982499955,6485469.985749997,6499690.193249995,6513817.835749996,6527314.873249996,6541122.350749992,6555578.420749989,6570247.583249989,6584316.01074999,6597051.995749994
173.0,6339225.3037500065,6351411.488750006,6360796.202250006,6368424.668250005,6374798.498500004,6380502.315250003,6385879.159500002,6391720.240500005,6399399.935000005,6408646.963250003,6419620.530750002,6431602.368250004,6444866.72825,6457951.388249998,6471584.9982499955,6485469.985749997,6499690.193249995,6513817.835749996,6527314.873249996,6541122.350749992,6555578.420749989,6570247.583249989,6584316.01074999,6597051.995749994
174.0,19017675.911250018,19054234.466250017,19082388.60675002,19105274.004750013,19124395.495500013,19141506.94575001,19157637.478500005,19175160.721500017,19198199.805000015,19225940.889750008,19258861.592250004,19294807.10475001,19334600.18475,19373854.164749995,19414754.994749986,19456409.95724999,19499070.579749987,19541453.50724999,19581944.61974999,19623367.052249976,19666735.26224997,19710742.749749966,19752948.032249972,19791155.98724998
175.0,19017675.911250018,19054234.466250017,19082388.60675002,19105274.004750013,19124395.495500013,19141506.94575001,19157637.478500005,19175160.721500017,19198199.805000015,19225940.889750008,19258861.592250004,19294807.10475001,19334600.18475,19373854.164749995,19414754.994749986,19456409.95724999,19499070.579749987,19541453.50724999,19581944.61974999,19623367.052249976,19666735.26224997,19710742.749749966,19752948.032249972,19791155.98724998
176.0,2446807.238749993,2449394.0212499914,2451620.47699999,2453526.5212499914,2455213.1304999893,2456792.02849999,2458367.3349999897,2460095.998249991,2462216.614499991,2464897.70974999,2467851.7622499894,2471429.5387499896,2474826.139749989,2478405.437999989,2481846.079499988,2485377.85474999,2488760.9484999906,2492413.8902499913,2495978.3912499924,2499863.476249992,2503401.8674999913,2506932.595749991,2510526.6432499895,2513570.0277499883
177.0,2446807.238749993,2449394.0212499914,2451620.47699999,2453526.5212499914,2455213.1304999893,2456792.02849999,2458367.3349999897,2460095.998249991,2462216.614499991,2464897.70974999,2467851.7622499894,2471429.5387499896,2474826.139749989,2478405.437999989,2481846.079499988,2485377.85474999,2488760.9484999906,2492413.8902499913,2495978.3912499924,2499863.476249992,2503401.8674999913,2506932.595749991,2510526.6432499895,2513570.0277499883
178.0,7340421.716249979,7348182.063749975,7354861.43099997,7360579.563749975,7365639.391499968,7370376.085499969,7375102.004999969,7380287.994749973,7386649.8434999725,7394693.12924997,7403555.286749968,7414288.616249969,7424478.419249967,7435216.313999967,7445538.238499964,7456133.56424997,7466282.845499972,7477241.6707499735,7487935.173749978,7499590.428749976,7510205.602499974,7520797.787249973,7531579.929749968,7540710.083249965
179.0,7340421.716249979,7348182.063749975,7354861.43099997,7360579.563749975,7365639.391499968,7370376.085499969,7375102.004999969,7380287.994749973,7386649.8434999725,7394693.12924997,7403555.286749968,7414288.616249969,7424478.419249967,7435216.313999967,7445538.238499964,7456133.56424997,7466282.845499972,7477241.6707499735,7487935.173749978,7499590.428749976,7510205.602499974,7520797.787249973,7531579.929749968,7540710.083249965
180.0,1433328.7167999907,1434836.2755499904,1436021.8141249907,1437216.3729749909,1438178.102074991,1439051.6110499916,1439945.6301249906,1440932.9173749904,1442253.9470249903,1444106.9518499903,1446107.4845999898,1448202.0923499893,1450671.0068499905,1452773.4017999896,1454837.4478499896,1457101.1235999896,1459644.5570999896,1462441.2693499888,1464996.1853499878,1467274.9808499878,1469358.365624987,1471497.0064499867,1473799.3114499866,1475639.7859499862
181.0,1433328.7167999907,1434836.2755499904,1436021.8141249907,1437216.3729749909,1438178.102074991,1439051.6110499916,1439945.6301249906,1440932.9173749904,1442253.9470249903,1444106.9518499903,1446107.4845999898,1448202.0923499893,1450671.0068499905,1452773.4017999896,1454837.4478499896,1457101.1235999896,1459644.5570999896,1462441.2693499888,1464996.1853499878,1467274.9808499878,1469358.365624987,1471497.0064499867,1473799.3114499866,1475639.7859499862
182.0,4299986.150399972,4304508.826649971,4308065.442374973,4311649.118924973,4314534.306224973,4317154.833149975,4319836.890374972,4322798.752124971,4326761.8410749715,4332320.855549971,4338322.4537999695,4344606.277049968,4352013.020549972,4358320.205399969,4364512.343549969,4371303.370799969,4378933.671299969,4387323.808049967,4394988.556049963,4401824.9425499635,4408075.096874962,4414491.019349961,4421397.93434996,4426919.357849958
183.0,4299986.150399972,4304508.826649971,4308065.442374973,4311649.118924973,4314534.306224973,4317154.833149975,4319836.890374972,4322798.752124971,4326761.8410749715,4332320.855549971,4338322.4537999695,4344606.277049968,4352013.020549972,4358320.205399969,4364512.343549969,4371303.370799969,4378933.671299969,4387323.808049967,4394988.556049963,4401824.9425499635,4408075.096874962,4414491.019349961,4421397.93434996,4426919.357849958
184.0,65216012.24750014,65310166.01000014,65385362.62000014,65450701.27750014,65508593.54500014,65562171.777500145,65615039.86250015,65673830.35750016,65746242.26750016,65837043.54750016,65946305.04750016,66065343.43500017,66190942.36750016,66315235.52000017,66445095.37250017,66583557.592500165,66725417.69750016,66864103.16000017,67001540.39500017,67134709.07750015,67265829.01750016,67393374.74500015,67515630.06500015,67622995.92750014
185.0,65216012.24750014,65310166.01000014,65385362.62000014,65450701.27750014,65508593.54500014,65562171.777500145,65615039.86250015,65673830.35750016,65746242.26750016,65837043.54750016,65946305.04750016,66065343.43500017,66190942.36750016,66315235.52000017,66445095.37250017,66583557.592500165,66725417.69750016,66864103.16000017,67001540.39500017,67134709.07750015,67265829.01750016,67393374.74500015,67515630.06500015,67622995.92750014
186.0,195648036.74250042,195930498.03000042,196156087.86000043,196352103.8325004,196525780.63500044,196686515.33250043,196845119.58750045,197021491.07250047,197238726.8025005,197511130.6425005,197838915.1425005,198196030.30500048,198572827.1025005,198945706.5600005,199335286.11750048,199750672.7775005,200176253.09250048,200592309.4800005,201004621.1850005,201404127.23250043,201797487.0525005,202180124.23500046,202546890.19500044,202868987.78250045
187.0,195648036.74250042,195930498.03000042,196156087.86000043,196352103.8325004,196525780.63500044,196686515.33250043,196845119.58750045,197021491.07250047,197238726.8025005,197511130.6425005,197838915.1425005,198196030.30500048,198572827.1025005,198945706.5600005,199335286.11750048,199750672.7775005,200176253.09250048,200592309.4800005,201004621.1850005,201404127.23250043,201797487.0525005,202180124.23500046,202546890.19500044,202868987.78250045
188.0,1624989.3192499885,1627459.7134999884,1629088.1787499888,1630719.7734999887,1632152.6684999887,1633476.6134999888,1634754.2729999896,1636369.78499999,1638454.3299999894,1640863.0949999893,1644102.3299999896,1647092.7259999888,1650443.2327499879,1654213.432249988,1657626.9327499883,1661230.2787499884,1664972.468499989,1668312.332749989,1671993.879499989,1675254.8012499874,1678689.0064999864,1682115.8887499862,1685294.232499986,1688293.5234999864
189.0,1624989.3192499885,1627459.7134999884,1629088.1787499888,1630719.7734999887,1632152.6684999887,1633476.6134999888,1634754.2729999896,1636369.78499999,1638454.3299999894,1640863.0949999893,1644102.3299999896,1647092.7259999888,1650443.2327499879,1654213.432249988,1657626.9327499883,1661230.2787499884,1664972.468499989,1668312.332749989,1671993.879499989,1675254.8012499874,1678689.0064999864,1682115.8887499862,1685294.232499986,1688293.5234999864
190.0,4874967.957749966,4882379.140499965,4887264.536249966,4892159.320499966,4896458.005499966,4900429.840499966,4904262.8189999685,4909109.35499997,4915362.989999969,4922589.284999968,4932306.989999969,4941278.177999967,4951329.698249964,4962640.296749964,4972880.798249965,4983690.836249965,4994917.405499967,5004936.998249967,5015981.638499968,5025764.403749962,5036067.019499959,5046347.666249959,5055882.697499958,5064880.570499959
191.0,4874967.957749966,4882379.140499965,4887264.536249966,4892159.320499966,4896458.005499966,4900429.840499966,4904262.8189999685,4909109.35499997,4915362.989999969,4922589.284999968,4932306.989999969,4941278.177999967,4951329.698249964,4962640.296749964,4972880.798249965,4983690.836249965,4994917.405499967,5004936.998249967,5015981.638499968,5025764.403749962,5036067.019499959,5046347.666249959,5055882.697499958,5064880.570499959
192.0,443115.2753749981,443541.3675499982,443907.54207499814,444239.1676749982,444595.2102999981,444929.9831499982,445207.18904999824,445600.2315499983,446063.51422499825,446682.5880749983,447531.9004499985,448462.5209499984,449335.19119999855,450217.5052249985,450981.60092499846,451919.2498749986,452882.55809999845,454009.66052499844,454966.3822749985,455913.0762749984,456655.5791249984,457252.87209999835,457809.58899999835,458396.2172249983
193.0,443115.2753749981,443541.3675499982,443907.54207499814,444239.1676749982,444595.2102999981,444929.9831499982,445207.18904999824,445600.2315499983,446063.51422499825,446682.5880749983,447531.9004499985,448462.5209499984,449335.19119999855,450217.5052249985,450981.60092499846,451919.2498749986,452882.55809999845,454009.66052499844,454966.3822749985,455913.0762749984,456655.5791249984,457252.87209999835,457809.58899999835,458396.2172249983
194.0,1329345.8261249943,1330624.1026499947,1331722.6262249944,1332717.5030249946,1333785.6308999944,1334789.9494499946,1335621.5671499947,1336800.6946499948,1338190.5426749948,1340047.764224995,1342595.7013499956,1345387.5628499952,1348005.5735999956,1350652.5156749955,1352944.8027749953,1355757.7496249957,1358647.6742999954,1362028.9815749954,1364899.1468249955,1367739.2288249952,1369966.7373749954,1371758.616299995,1373428.766999995,1375188.6516749947
195.0,1329345.8261249943,1330624.1026499947,1331722.6262249944,1332717.5030249946,1333785.6308999944,1334789.9494499946,1335621.5671499947,1336800.6946499948,1338190.5426749948,1340047.764224995,1342595.7013499956,1345387.5628499952,1348005.5735999956,1350652.5156749955,1352944.8027749953,1355757.7496249957,1358647.6742999954,1362028.9815749954,1364899.1468249955,1367739.2288249952,1369966.7373749954,1371758.616299995,1373428.766999995,1375188.6516749947
196.0,849648.383949997,850892.8637999967,851932.743899997,852842.6806499969,853457.1810749971,854152.9598749969,854809.8205749968,855516.1954749965,856386.5843249967,857621.3783249966,859035.5883249964,860577.2835749965,862167.8648249966,863858.8768249966,865508.8485749967,867249.7180749967,869099.0925749968,871122.5330749967,872875.8878249968,874607.5373249968,876528.9380749967,878458.6438249964,879949.5880749964,881207.9333249965
197.0,849648.383949997,850892.8637999967,851932.743899997,852842.6806499969,853457.1810749971,854152.9598749969,854809.8205749968,855516.1954749965,856386.5843249967,857621.3783249966,859035.5883249964,860577.2835749965,862167.8648249966,863858.8768249966,865508.8485749967,867249.7180749967,869099.0925749968,871122.5330749967,872875.8878249968,874607.5373249968,876528.9380749967,878458.6438249964,879949.5880749964,881207.9333249965
198.0,2548945.151849991,2552678.59139999,2555798.231699991,2558528.0419499907,2560371.5432249913,2562458.8796249907,2564429.46172499,2566548.5864249896,2569159.75297499,2572864.1349749896,2577106.764974989,2581731.8507249895,2586503.59447499,2591576.63047499,2596526.54572499,2601749.15422499,2607297.27772499,2613367.5992249902,2618627.6634749905,2623822.6119749905,2629586.81422499,2635375.9314749893,2639848.7642249893,2643623.7999749896
199.0,2548945.151849991,2552678.59139999,2555798.231699991,2558528.0419499907,2560371.5432249913,2562458.8796249907,2564429.46172499,2566548.5864249896,2569159.75297499,2572864.1349749896,2577106.764974989,2581731.8507249895,2586503.59447499,2591576.63047499,2596526.54572499,2601749.15422499,2607297.27772499,2613367.5992249902,2618627.6634749905,2623822.6119749905,2629586.81422499,2635375.9314749893,2639848.7642249893,2643623.7999749896
200.0,1452280.6135774942,1454107.5464774938,1455514.0424524937,1456728.907627494,1457706.7926774942,1458540.5297024944,1459461.7229524942,1460586.4250524943,1462047.8360524941,1463879.1258274938,1466512.0351524937,1469038.3266524938,1471461.3637774936,1474118.7097274945,1476578.3638274937,1479423.1228274936,1482416.871327493,1486175.1840774934,1489938.7425774932,1493891.354827494,1497396.9639524943,1500581.3073524937,1503701.1826524942,1505728.500477494
201.0,1452280.6135774942,1454107.5464774938,1455514.0424524937,1456728.907627494,1457706.7926774942,1458540.5297024944,1459461.7229524942,1460586.4250524943,1462047.8360524941,1463879.1258274938,1466512.0351524937,1469038.3266524938,1471461.3637774936,1474118.7097274945,1476578.3638274937,1479423.1228274936,1482416.871327493,1486175.1840774934,1489938.7425774932,1493891.354827494,1497396.9639524943,1500581.3073524937,1503701.1826524942,1505728.500477494
202.0,4356841.840732482,4362322.6394324815,4366542.127357481,4370186.722882482,4373120.378032483,4375621.589107484,4378385.168857482,4381759.275157483,4386143.508157482,4391637.377482481,4399536.105457481,4407114.979957482,4414384.09133248,4422356.129182484,4429735.091482481,4438269.368482481,4447250.613982479,4458525.55223248,4469816.22773248,4481674.064482482,4492190.8918574825,4501743.9220574815,4511103.547957483,4517185.501432482
203.0,4356841.840732482,4362322.6394324815,4366542.127357481,4370186.722882482,4373120.378032483,4375621.589107484,4378385.168857482,4381759.275157483,4386143.508157482,4391637.377482481,4399536.105457481,4407114.979957482,4414384.09133248,4422356.129182484,4429735.091482481,4438269.368482481,4447250.613982479,4458525.55223248,4469816.22773248,4481674.064482482,4492190.8918574825,4501743.9220574815,4511103.547957483,4517185.501432482
204.0,1557959.8239999972,1560323.4357499974,1562405.4739999978,1563864.1994999975,1565366.841749998,1566680.7397499974,1567998.3962499965,1569603.9619999963,1571607.4724999971,1574420.065999997,1577603.4402499974,1580711.4222499977,1583881.8397499972,1586998.2637499974,1590501.8597499982,1594179.8422499984,1597456.1869999983,1601033.5207499983,1604866.2897499981,1608315.029999998,1611949.509999998,1615340.014499998,1618576.2482499979,1621504.6352499975
205.0,1557959.8239999972,1560323.4357499974,1562405.4739999978,1563864.1994999975,1565366.841749998,1566680.7397499974,1567998.3962499965,1569603.9619999963,1571607.4724999971,1574420.065999997,1577603.4402499974,1580711.4222499977,1583881.8397499972,1586998.2637499974,1590501.8597499982,1594179.8422499984,1597456.1869999983,1601033.5207499983,1604866.2897499981,1608315.029999998,1611949.509999998,1615340.014499998,1618576.2482499979,1621504.6352499975
206.0,4673879.471999992,4680970.307249992,4687216.421999994,4691592.598499993,4696100.525249994,4700042.219249992,4703995.1887499895,4708811.885999989,4714822.417499991,4723260.1979999915,4732810.3207499925,4742134.266749993,4751645.5192499915,4760994.791249992,4771505.579249995,4782539.526749995,4792368.560999995,4803100.562249995,4814598.869249994,4824945.089999994,4835848.529999994,4846020.043499994,4855728.744749993,4864513.9057499925
207.0,4673879.471999992,4680970.307249992,4687216.421999994,4691592.598499993,4696100.525249994,4700042.219249992,4703995.1887499895,4708811.885999989,4714822.417499991,4723260.1979999915,4732810.3207499925,4742134.266749993,4751645.5192499915,4760994.791249992,4771505.579249995,4782539.526749995,4792368.560999995,4803100.562249995,4814598.869249994,4824945.089999994,4835848.529999994,4846020.043499994,4855728.744749993,4864513.9057499925
