0.0,0.0,1.0,2.0,3.0,4.0,5.0,6.0,7.0,8.0,9.0,10.0,11.0,12.0,13.0,14.0,15.0,16.0,17.0,18.0,19.0,20.0,21.0,22.0,23.0
0.0,4502.961000000001,7966.656500000002,10818.639750000004,13106.050999999996,15156.568749999997,17136.906999999985,19399.885499999993,22215.45275,25626.190249999992,29918.59324999999,34333.56399999999,38940.18924999999,43565.57725,48689.820999999996,53661.74300000002,58745.13600000002,64109.07999999998,69221.18400000001,74751.16525,80432.20524999997,86042.54899999996,91856.90699999995,97355.96374999994,102258.27149999996
1.0,4502.961000000001,7966.656500000002,10818.639750000004,13106.050999999996,15156.568749999997,17136.906999999985,19399.885499999993,22215.45275,25626.190249999992,29918.59324999999,34333.56399999999,38940.18924999999,43565.57725,48689.820999999996,53661.74300000002,58745.13600000002,64109.07999999998,69221.18400000001,74751.16525,80432.20524999997,86042.54899999996,91856.90699999995,97355.96374999994,102258.27149999996
2.0,13508.883000000003,23899.969500000007,32455.919250000014,39318.15299999999,45469.70624999999,51410.720999999954,58199.65649999998,66646.35825,76878.57074999998,89755.77974999997,103000.69199999998,116820.56774999996,130696.73175,146069.463,160985.22900000005,176235.40800000005,192327.23999999993,207663.55200000003,224253.49575,241296.6157499999,258127.64699999988,275570.72099999984,292067.8912499998,306774.81449999986
3.0,13508.883000000003,23899.969500000007,32455.919250000014,39318.15299999999,45469.70624999999,51410.720999999954,58199.65649999998,66646.35825,76878.57074999998,89755.77974999997,103000.69199999998,116820.56774999996,130696.73175,146069.463,160985.22900000005,176235.40800000005,192327.23999999993,207663.55200000003,224253.49575,241296.6157499999,258127.64699999988,275570.72099999984,292067.8912499998,306774.81449999986
4.0,2035.261175,3673.2882999999993,5041.3029000000015,6360.52465,7609.640250000002,9029.101575,10380.430050000008,11837.80410000001,13732.947550000006,16130.231550000006,18758.940300000006,22000.91180000001,25316.78355,28293.62505,31425.450049999992,34697.492299999976,37710.40029999999,40865.67755,44245.09104999999,47209.30979999997,50222.25129999996,52817.737799999966,55096.44524999996,57272.106149999956
5.0,2035.261175,3673.2882999999993,5041.3029000000015,6360.52465,7609.640250000002,9029.101575,10380.430050000008,11837.80410000001,13732.947550000006,16130.231550000006,18758.940300000006,22000.91180000001,25316.78355,28293.62505,31425.450049999992,34697.492299999976,37710.40029999999,40865.67755,44245.09104999999,47209.30979999997,50222.25129999996,52817.737799999966,55096.44524999996,57272.106149999956
6.0,6105.783525000001,11019.864899999997,15123.908700000004,19081.57395,22828.920750000005,27087.304725,31141.290150000023,35513.41230000003,41198.84265000002,48390.69465000002,56276.82090000002,66002.73540000003,75950.35065000001,84880.87514999999,94276.35014999998,104092.47689999992,113131.20089999997,122597.03265000001,132735.27314999996,141627.9293999999,150666.7538999999,158453.2133999999,165289.33574999988,171816.31844999988
7.0,6105.783525000001,11019.864899999997,15123.908700000004,19081.57395,22828.920750000005,27087.304725,31141.290150000023,35513.41230000003,41198.84265000002,48390.69465000002,56276.82090000002,66002.73540000003,75950.35065000001,84880.87514999999,94276.35014999998,104092.47689999992,113131.20089999997,122597.03265000001,132735.27314999996,141627.9293999999,150666.7538999999,158453.2133999999,165289.33574999988,171816.31844999988
8.0,15972.027500000006,30198.184999999998,42613.840000000004,52764.700000000004,61540.43674999999,68762.99974999994,75766.00024999994,83483.27899999994,93387.65999999997,105238.89000000001,118979.14500000002,134216.25749999998,150505.8424999999,167608.31749999992,185680.62999999992,204128.60049999985,222659.64949999974,241394.3827499999,259564.25549999997,276762.25399999996,292808.9519999998,307927.836,322677.6287500001,336362.193
9.0,15972.027500000006,30198.184999999998,42613.840000000004,52764.700000000004,61540.43674999999,68762.99974999994,75766.00024999994,83483.27899999994,93387.65999999997,105238.89000000001,118979.14500000002,134216.25749999998,150505.8424999999,167608.31749999992,185680.62999999992,204128.60049999985,222659.64949999974,241394.3827499999,259564.25549999997,276762.25399999996,292808.9519999998,307927.836,322677.6287500001,336362.193
10.0,47916.08250000002,90594.555,127841.52000000002,158294.1,184621.31024999998,206288.99924999982,227298.00074999983,250449.83699999982,280162.9799999999,315716.67000000004,356937.43500000006,402648.77249999996,451517.52749999973,502824.9524999998,557041.8899999998,612385.8014999996,667978.9484999992,724183.1482499997,778692.7664999999,830286.7619999999,878426.8559999994,923783.508,968032.8862500002,1009086.5790000001
11.0,47916.08250000002,90594.555,127841.52000000002,158294.1,184621.31024999998,206288.99924999982,227298.00074999983,250449.83699999982,280162.9799999999,315716.67000000004,356937.43500000006,402648.77249999996,451517.52749999973,502824.9524999998,557041.8899999998,612385.8014999996,667978.9484999992,724183.1482499997,778692.7664999999,830286.7619999999,878426.8559999994,923783.508,968032.8862500002,1009086.5790000001
12.0,4097.011699999999,7675.49235,10435.380149999995,12962.181274999995,15323.373374999996,17462.199299999993,19847.001549999997,22662.29805,26502.657325,31202.52882499999,36889.479074999996,42701.222575000014,48194.670325,53089.32307499999,57957.05707499997,63067.894824999974,68541.69657500001,74226.06657500002,79840.98432500003,84842.64932500003,89646.25457500003,94466.47632499998,98719.92982499996,102903.84747499994
13.0,4097.011699999999,7675.49235,10435.380149999995,12962.181274999995,15323.373374999996,17462.199299999993,19847.001549999997,22662.29805,26502.657325,31202.52882499999,36889.479074999996,42701.222575000014,48194.670325,53089.32307499999,57957.05707499997,63067.894824999974,68541.69657500001,74226.06657500002,79840.98432500003,84842.64932500003,89646.25457500003,94466.47632499998,98719.92982499996,102903.84747499994
14.0,12291.035099999997,23026.47705,31306.140449999984,38886.543824999986,45970.12012499999,52386.59789999998,59541.00464999999,67986.89415000001,79507.971975,93607.58647499997,110668.43722499999,128103.66772500004,144584.01097499998,159267.96922499998,173871.1712249999,189203.68447499993,205625.08972500003,222678.19972500007,239522.95297500008,254527.9479750001,268938.7637250001,283399.42897499993,296159.7894749999,308711.5424249998
15.0,12291.035099999997,23026.47705,31306.140449999984,38886.543824999986,45970.12012499999,52386.59789999998,59541.00464999999,67986.89415000001,79507.971975,93607.58647499997,110668.43722499999,128103.66772500004,144584.01097499998,159267.96922499998,173871.1712249999,189203.68447499993,205625.08972500003,222678.19972500007,239522.95297500008,254527.9479750001,268938.7637250001,283399.42897499993,296159.7894749999,308711.5424249998
16.0,3101.93925,6606.014000000001,9683.048499999997,12273.093750000002,14405.788250000009,16089.951000000005,17854.654000000006,19526.339750000017,21666.53150000002,24391.967500000017,27289.343250000024,30259.85350000003,33047.792250000035,35677.21200000002,38008.94474999999,40843.03274999998,43502.43699999995,45639.61349999996,47735.86124999996,50006.30274999999,51965.791499999985,54034.725499999964,56236.41274999995,57887.41474999997
17.0,3101.93925,6606.014000000001,9683.048499999997,12273.093750000002,14405.788250000009,16089.951000000005,17854.654000000006,19526.339750000017,21666.53150000002,24391.967500000017,27289.343250000024,30259.85350000003,33047.792250000035,35677.21200000002,38008.94474999999,40843.03274999998,43502.43699999995,45639.61349999996,47735.86124999996,50006.30274999999,51965.791499999985,54034.725499999964,56236.41274999995,57887.41474999997
18.0,9305.81775,19818.042,29049.14549999999,36819.28125000001,43217.36475000002,48269.85300000002,53563.962000000014,58579.019250000056,64999.59450000006,73175.90250000005,81868.02975000007,90779.5605000001,99143.37675000011,107031.63600000006,114026.83424999996,122529.09824999992,130507.31099999984,136918.84049999987,143207.58374999987,150018.90824999998,155897.37449999995,162104.17649999988,168709.23824999985,173662.2442499999
19.0,9305.81775,19818.042,29049.14549999999,36819.28125000001,43217.36475000002,48269.85300000002,53563.962000000014,58579.019250000056,64999.59450000006,73175.90250000005,81868.02975000007,90779.5605000001,99143.37675000011,107031.63600000006,114026.83424999996,122529.09824999992,130507.31099999984,136918.84049999987,143207.58374999987,150018.90824999998,155897.37449999995,162104.17649999988,168709.23824999985,173662.2442499999
20.0,3006.0807500000005,5606.615000000002,7747.683000000001,9560.58875,11369.042500000009,13254.225000000011,15209.139750000011,17708.29250000002,20401.303500000035,23793.178250000044,27929.933750000047,31741.23050000004,35609.338500000034,39210.90425000002,42916.11675000002,46553.20325000003,50527.26500000002,53954.21850000002,57834.97275000001,61617.16775000003,64961.67650000006,68492.24400000006,71827.18675000007,74883.33200000008
21.0,3006.0807500000005,5606.615000000002,7747.683000000001,9560.58875,11369.042500000009,13254.225000000011,15209.139750000011,17708.29250000002,20401.303500000035,23793.178250000044,27929.933750000047,31741.23050000004,35609.338500000034,39210.90425000002,42916.11675000002,46553.20325000003,50527.26500000002,53954.21850000002,57834.97275000001,61617.16775000003,64961.67650000006,68492.24400000006,71827.18675000007,74883.33200000008
22.0,9018.242250000001,16819.845000000005,23243.049000000003,28681.76625,34107.127500000024,39762.67500000003,45627.419250000035,53124.87750000006,61203.9105000001,71379.53475000014,83789.80125000014,95223.69150000013,106828.0155000001,117632.71275000006,128748.35025000008,139659.6097500001,151581.79500000007,161862.65550000005,173504.91825000002,184851.5032500001,194885.02950000018,205476.7320000002,215481.5602500002,224649.99600000025
23.0,9018.242250000001,16819.845000000005,23243.049000000003,28681.76625,34107.127500000024,39762.67500000003,45627.419250000035,53124.87750000006,61203.9105000001,71379.53475000014,83789.80125000014,95223.69150000013,106828.0155000001,117632.71275000006,128748.35025000008,139659.6097500001,151581.79500000007,161862.65550000005,173504.91825000002,184851.5032500001,194885.02950000018,205476.7320000002,215481.5602500002,224649.99600000025
24.0,2036.702,3610.41225,4840.0605,6041.267249999999,7213.400000000001,8277.708499999999,9424.081499999997,10776.057,12517.971750000004,14983.439750000003,17852.640249999997,20530.287000000008,23147.078000000005,25420.982750000032,27893.686000000023,30843.92350000003,33688.202750000026,36246.779,39198.653249999996,41769.872249999986,44284.927500000005,46655.77325000003,48615.62725000005,50444.22550000007
25.0,2036.702,3610.41225,4840.0605,6041.267249999999,7213.400000000001,8277.708499999999,9424.081499999997,10776.057,12517.971750000004,14983.439750000003,17852.640249999997,20530.287000000008,23147.078000000005,25420.982750000032,27893.686000000023,30843.92350000003,33688.202750000026,36246.779,39198.653249999996,41769.872249999986,44284.927500000005,46655.77325000003,48615.62725000005,50444.22550000007
26.0,6110.106,10831.23675,14520.181499999999,18123.80175,21640.2,24833.125499999995,28272.24449999999,32328.171000000002,37553.91525000001,44950.31925000001,53557.92074999999,61590.86100000002,69441.23400000001,76262.9482500001,83681.05800000008,92531.77050000009,101064.60825000008,108740.337,117595.95974999998,125309.61674999996,132854.78250000003,139967.31975000008,145846.88175000015,151332.67650000023
27.0,6110.106,10831.23675,14520.181499999999,18123.80175,21640.2,24833.125499999995,28272.24449999999,32328.171000000002,37553.91525000001,44950.31925000001,53557.92074999999,61590.86100000002,69441.23400000001,76262.9482500001,83681.05800000008,92531.77050000009,101064.60825000008,108740.337,117595.95974999998,125309.61674999996,132854.78250000003,139967.31975000008,145846.88175000015,151332.67650000023
28.0,78892.85949999999,145501.511,201793.63025,250582.87825000004,295589.788,338056.88425,381126.88225,432127.36075000017,494167.35350000014,570940.1980000002,658384.649,749890.2807499999,840925.6860000001,925241.4005000001,1013497.8232500002,1102052.0302500003,1191012.9474999998,1280332.0472499996,1372117.6989999996,1462398.6282499998,1553385.58525,1643289.5905,1727466.32225,1806824.13875
29.0,78892.85949999999,145501.511,201793.63025,250582.87825000004,295589.788,338056.88425,381126.88225,432127.36075000017,494167.35350000014,570940.1980000002,658384.649,749890.2807499999,840925.6860000001,925241.4005000001,1013497.8232500002,1102052.0302500003,1191012.9474999998,1280332.0472499996,1372117.6989999996,1462398.6282499998,1553385.58525,1643289.5905,1727466.32225,1806824.13875
30.0,236678.57849999997,436504.533,605380.89075,751748.6347500001,886769.3640000001,1014170.65275,1143380.64675,1296382.0822500004,1482502.0605000004,1712820.5940000005,1975153.947,2249670.8422499998,2522777.058,2775724.2015000004,3040493.4697500006,3306156.090750001,3573038.8424999993,3840996.1417499986,4116353.0969999987,4387195.884749999,4660156.7557500005,4929868.7715,5182398.96675,5420472.41625
31.0,236678.57849999997,436504.533,605380.89075,751748.6347500001,886769.3640000001,1014170.65275,1143380.64675,1296382.0822500004,1482502.0605000004,1712820.5940000005,1975153.947,2249670.8422499998,2522777.058,2775724.2015000004,3040493.4697500006,3306156.090750001,3573038.8424999993,3840996.1417499986,4116353.0969999987,4387195.884749999,4660156.7557500005,4929868.7715,5182398.96675,5420472.41625
32.0,2161.6585,4042.458775,5716.212275,7108.1300249999995,8362.367075000004,9709.435474999998,10990.901474999997,12746.016224999996,14841.519224999995,17295.595724999996,20278.126225,23725.08997499999,26850.110724999995,30507.293474999995,33394.30297499999,36474.799475,39129.181475,41914.66297499999,44799.311225000005,47726.565725,50864.344725,53585.662475,55974.50697500001,58681.241725
33.0,2161.6585,4042.458775,5716.212275,7108.1300249999995,8362.367075000004,9709.435474999998,10990.901474999997,12746.016224999996,14841.519224999995,17295.595724999996,20278.126225,23725.08997499999,26850.110724999995,30507.293474999995,33394.30297499999,36474.799475,39129.181475,41914.66297499999,44799.311225000005,47726.565725,50864.344725,53585.662475,55974.50697500001,58681.241725
34.0,6484.9755000000005,12127.376325000001,17148.636825,21324.390075,25087.101225000013,29128.306424999995,32972.70442499999,38238.04867499998,44524.55767499998,51886.78717499999,60834.378675,71175.26992499997,80550.33217499999,91521.88042499998,100182.90892499997,109424.39842499999,117387.544425,125743.98892499998,134397.933675,143179.697175,152593.034175,160756.987425,167923.52092500002,176043.725175
35.0,6484.9755000000005,12127.376325000001,17148.636825,21324.390075,25087.101225000013,29128.306424999995,32972.70442499999,38238.04867499998,44524.55767499998,51886.78717499999,60834.378675,71175.26992499997,80550.33217499999,91521.88042499998,100182.90892499997,109424.39842499999,117387.544425,125743.98892499998,134397.933675,143179.697175,152593.034175,160756.987425,167923.52092500002,176043.725175
36.0,901.3782000000001,1633.632525000001,2328.0510000000013,2974.031750000001,3514.9762499999997,4125.3886999999995,4798.053274999999,5677.526275000004,6902.801775000006,8422.993525000009,10331.537775000013,12944.829525000017,14887.585025000017,16371.879175000015,18182.97792500002,19960.369425000026,21918.90642500003,23989.386425000033,26000.93342500003,27603.42907500003,29016.884575000026,30269.447325000023,31372.30115000002,32341.883250000014
37.0,901.3782000000001,1633.632525000001,2328.0510000000013,2974.031750000001,3514.9762499999997,4125.3886999999995,4798.053274999999,5677.526275000004,6902.801775000006,8422.993525000009,10331.537775000013,12944.829525000017,14887.585025000017,16371.879175000015,18182.97792500002,19960.369425000026,21918.90642500003,23989.386425000033,26000.93342500003,27603.42907500003,29016.884575000026,30269.447325000023,31372.30115000002,32341.883250000014
38.0,2704.1346000000003,4900.897575000003,6984.153000000004,8922.095250000002,10544.92875,12376.166099999999,14394.159824999999,17032.57882500001,20708.405325000018,25268.980575000027,30994.613325000042,38834.488575000054,44662.75507500005,49115.63752500004,54548.93377500006,59881.10827500008,65756.7192750001,71968.1592750001,78002.80027500009,82810.2872250001,87050.65372500007,90808.34197500008,94116.90345000007,97025.64975000004
39.0,2704.1346000000003,4900.897575000003,6984.153000000004,8922.095250000002,10544.92875,12376.166099999999,14394.159824999999,17032.57882500001,20708.405325000018,25268.980575000027,30994.613325000042,38834.488575000054,44662.75507500005,49115.63752500004,54548.93377500006,59881.10827500008,65756.7192750001,71968.1592750001,78002.80027500009,82810.2872250001,87050.65372500007,90808.34197500008,94116.90345000007,97025.64975000004
40.0,2734.95525,4829.473250000001,6482.769000000001,8065.485000000001,9587.109000000002,11021.601000000002,12538.973250000001,14595.0335,16935.0785,19999.445,23264.391000000007,26903.491500000004,31236.11950000001,34914.5,38948.39525000001,42831.75150000002,47192.03025000001,51904.47900000001,56430.88950000002,60577.76225000001,64647.88374999999,68577.7215,72121.81649999999,75074.18899999998
41.0,2734.95525,4829.473250000001,6482.769000000001,8065.485000000001,9587.109000000002,11021.601000000002,12538.973250000001,14595.0335,16935.0785,19999.445,23264.391000000007,26903.491500000004,31236.11950000001,34914.5,38948.39525000001,42831.75150000002,47192.03025000001,51904.47900000001,56430.88950000002,60577.76225000001,64647.88374999999,68577.7215,72121.81649999999,75074.18899999998
42.0,8204.86575,14488.419750000003,19448.307000000004,24196.455,28761.327000000005,33064.80300000001,37616.91975,43785.1005,50805.235499999995,59998.335,69793.17300000002,80710.47450000001,93708.35850000003,104743.5,116845.18575000003,128495.25450000007,141576.09075000003,155713.43700000003,169292.66850000006,181733.28675000003,193943.65125,205733.1645,216365.44949999996,225222.56699999995
43.0,8204.86575,14488.419750000003,19448.307000000004,24196.455,28761.327000000005,33064.80300000001,37616.91975,43785.1005,50805.235499999995,59998.335,69793.17300000002,80710.47450000001,93708.35850000003,104743.5,116845.18575000003,128495.25450000007,141576.09075000003,155713.43700000003,169292.66850000006,181733.28675000003,193943.65125,205733.1645,216365.44949999996,225222.56699999995
44.0,2599.662325,4727.786325000002,6792.098800000001,8983.942425,10651.492724999998,12239.341749999996,13966.189299999993,15840.114799999994,18225.922299999995,20992.696625,23955.247374999995,27045.592374999997,29799.916625,32624.929375000007,35504.048374999984,38543.55987499997,41540.956624999955,44892.27912499995,48119.473124999946,51186.732124999944,54125.447874999925,56772.28247499989,59308.91152499989,61833.367449999874
45.0,2599.662325,4727.786325000002,6792.098800000001,8983.942425,10651.492724999998,12239.341749999996,13966.189299999993,15840.114799999994,18225.922299999995,20992.696625,23955.247374999995,27045.592374999997,29799.916625,32624.929375000007,35504.048374999984,38543.55987499997,41540.956624999955,44892.27912499995,48119.473124999946,51186.732124999944,54125.447874999925,56772.28247499989,59308.91152499989,61833.367449999874
46.0,7798.986975,14183.358975000006,20376.296400000003,26951.827274999996,31954.478174999997,36718.02524999999,41898.56789999998,47520.34439999998,54677.76689999999,62978.089875000005,71865.74212499999,81136.777125,89399.74987500001,97874.78812500002,106512.14512499995,115630.6796249999,124622.86987499986,134676.83737499986,144358.41937499982,153560.19637499982,162376.34362499978,170316.84742499967,177926.73457499966,185500.10234999962
47.0,7798.986975,14183.358975000006,20376.296400000003,26951.827274999996,31954.478174999997,36718.02524999999,41898.56789999998,47520.34439999998,54677.76689999999,62978.089875000005,71865.74212499999,81136.777125,89399.74987500001,97874.78812500002,106512.14512499995,115630.6796249999,124622.86987499986,134676.83737499986,144358.41937499982,153560.19637499982,162376.34362499978,170316.84742499967,177926.73457499966,185500.10234999962
48.0,1592.8519999999994,2910.7677499999977,4034.3864999999964,5246.364025,6512.832525000002,7713.536524999999,8923.418774999998,10369.482274999993,12096.83127499999,14157.40652499999,16424.44052499999,18552.796524999994,20688.681524999985,22596.40027499998,24679.39952499999,26640.961774999985,28786.540774999983,30709.81902499998,32784.72427499998,34781.94227499999,37107.70227499999,39014.364775,40766.357025,42784.68652499998
49.0,1592.8519999999994,2910.7677499999977,4034.3864999999964,5246.364025,6512.832525000002,7713.536524999999,8923.418774999998,10369.482274999993,12096.83127499999,14157.40652499999,16424.44052499999,18552.796524999994,20688.681524999985,22596.40027499998,24679.39952499999,26640.961774999985,28786.540774999983,30709.81902499998,32784.72427499998,34781.94227499999,37107.70227499999,39014.364775,40766.357025,42784.68652499998
50.0,4778.555999999999,8732.303249999994,12103.159499999989,15739.092075,19538.497575000005,23140.609574999995,26770.256324999995,31108.446824999977,36290.49382499997,42472.21957499997,49273.32157499997,55658.38957499998,62066.044574999956,67789.20082499995,74038.19857499997,79922.88532499995,86359.62232499995,92129.45707499994,98354.17282499993,104345.82682499997,111323.10682499997,117043.09432500001,122299.07107499999,128354.05957499995
51.0,4778.555999999999,8732.303249999994,12103.159499999989,15739.092075,19538.497575000005,23140.609574999995,26770.256324999995,31108.446824999977,36290.49382499997,42472.21957499997,49273.32157499997,55658.38957499998,62066.044574999956,67789.20082499995,74038.19857499997,79922.88532499995,86359.62232499995,92129.45707499994,98354.17282499993,104345.82682499997,111323.10682499997,117043.09432500001,122299.07107499999,128354.05957499995
52.0,1965.6365000000005,3696.2137500000017,5324.008250000001,6762.95525,7979.494750000003,9209.792500000003,10597.045500000004,12193.13875000001,14307.202500000003,16677.82175,20273.68775000001,23724.21875000001,26887.38275000002,29856.48125000002,33253.482500000006,36306.93825000001,39583.84975,43225.21374999998,46730.68824999999,49967.09849999999,52654.00899999998,55340.49349999995,57639.16574999996,59793.49674999994
53.0,1965.6365000000005,3696.2137500000017,5324.008250000001,6762.95525,7979.494750000003,9209.792500000003,10597.045500000004,12193.13875000001,14307.202500000003,16677.82175,20273.68775000001,23724.21875000001,26887.38275000002,29856.48125000002,33253.482500000006,36306.93825000001,39583.84975,43225.21374999998,46730.68824999999,49967.09849999999,52654.00899999998,55340.49349999995,57639.16574999996,59793.49674999994
54.0,5896.909500000002,11088.641250000004,15972.024750000002,20288.86575,23938.48425000001,27629.37750000001,31791.13650000001,36579.416250000024,42921.60750000001,50033.465249999994,60821.06325000002,71172.65625000003,80662.14825000006,89569.44375000006,99760.44750000001,108920.81475000002,118751.54925000001,129675.64124999994,140192.06474999996,149901.29549999998,157962.02699999994,166021.48049999986,172917.49724999987,179380.49024999983
55.0,5896.909500000002,11088.641250000004,15972.024750000002,20288.86575,23938.48425000001,27629.37750000001,31791.13650000001,36579.416250000024,42921.60750000001,50033.465249999994,60821.06325000002,71172.65625000003,80662.14825000006,89569.44375000006,99760.44750000001,108920.81475000002,118751.54925000001,129675.64124999994,140192.06474999996,149901.29549999998,157962.02699999994,166021.48049999986,172917.49724999987,179380.49024999983
56.0,6068.0905,10956.456500000004,15290.90100000001,18986.006750000015,22566.281750000013,26027.32775000003,29597.39975000002,33618.28225000002,38701.83600000001,44225.05675000003,50687.259000000005,57293.10375000001,63908.64650000001,69753.94275000002,75994.56950000003,82283.06974999998,88464.12374999988,94505.99074999994,100844.6594999999,107022.6494999999,113161.58774999986,119208.59574999986,125238.53424999982,130858.59574999983
57.0,6068.0905,10956.456500000004,15290.90100000001,18986.006750000015,22566.281750000013,26027.32775000003,29597.39975000002,33618.28225000002,38701.83600000001,44225.05675000003,50687.259000000005,57293.10375000001,63908.64650000001,69753.94275000002,75994.56950000003,82283.06974999998,88464.12374999988,94505.99074999994,100844.6594999999,107022.6494999999,113161.58774999986,119208.59574999986,125238.53424999982,130858.59574999983
58.0,18204.271500000003,32869.369500000015,45872.70300000003,56958.020250000045,67698.84525000004,78081.98325000009,88792.19925000006,100854.84675000006,116105.50800000003,132675.17025000008,152061.777,171879.31125000003,191725.93950000004,209261.82825000005,227983.70850000007,246849.20924999996,265392.3712499996,283517.9722499998,302533.97849999974,321067.9484999997,339484.7632499996,357625.7872499996,375715.6027499995,392575.78724999947
59.0,18204.271500000003,32869.369500000015,45872.70300000003,56958.020250000045,67698.84525000004,78081.98325000009,88792.19925000006,100854.84675000006,116105.50800000003,132675.17025000008,152061.777,171879.31125000003,191725.93950000004,209261.82825000005,227983.70850000007,246849.20924999996,265392.3712499996,283517.9722499998,302533.97849999974,321067.9484999997,339484.7632499996,357625.7872499996,375715.6027499995,392575.78724999947
60.0,2231.4729999999995,3989.8782500000007,5623.571500000002,6988.865,8294.731249999999,9740.685749999999,11231.095999999996,12994.149999999992,15141.172249999992,18060.113500000003,21325.641750000003,24769.546250000003,27904.004249999994,30711.29474999999,33447.66574999999,36324.065999999984,39258.01199999995,42173.72124999998,45193.85249999998,48131.415999999976,50923.55499999998,53875.899499999956,56591.041999999936,59148.189749999925
61.0,2231.4729999999995,3989.8782500000007,5623.571500000002,6988.865,8294.731249999999,9740.685749999999,11231.095999999996,12994.149999999992,15141.172249999992,18060.113500000003,21325.641750000003,24769.546250000003,27904.004249999994,30711.29474999999,33447.66574999999,36324.065999999984,39258.01199999995,42173.72124999998,45193.85249999998,48131.415999999976,50923.55499999998,53875.899499999956,56591.041999999936,59148.189749999925
62.0,6694.418999999998,11969.634750000001,16870.714500000006,20966.595,24884.19375,29222.057249999998,33693.287999999986,38982.449999999975,45423.51674999998,54180.340500000006,63976.92525000001,74308.63875000001,83712.01274999998,92133.88424999997,100342.99724999999,108972.19799999995,117774.03599999985,126521.16374999995,135581.55749999994,144394.24799999993,152770.66499999992,161627.69849999988,169773.12599999981,177444.56924999977
63.0,6694.418999999998,11969.634750000001,16870.714500000006,20966.595,24884.19375,29222.057249999998,33693.287999999986,38982.449999999975,45423.51674999998,54180.340500000006,63976.92525000001,74308.63875000001,83712.01274999998,92133.88424999997,100342.99724999999,108972.19799999995,117774.03599999985,126521.16374999995,135581.55749999994,144394.24799999993,152770.66499999992,161627.69849999988,169773.12599999981,177444.56924999977
64.0,1545.1915000000004,2905.966575,4082.255075000001,5113.416825,6024.05895,6903.590200000001,7794.733324999999,8923.018175,10651.55915,12275.902649999995,14230.898399999993,16291.728399999993,18316.325399999987,20056.466649999984,21826.052149999978,23627.286649999973,25587.27889999997,27368.985899999967,29200.33489999997,31035.26514999996,32747.18264999997,34695.10589999997,36137.05764999997,37557.92614999996
65.0,1545.1915000000004,2905.966575,4082.255075000001,5113.416825,6024.05895,6903.590200000001,7794.733324999999,8923.018175,10651.55915,12275.902649999995,14230.898399999993,16291.728399999993,18316.325399999987,20056.466649999984,21826.052149999978,23627.286649999973,25587.27889999997,27368.985899999967,29200.33489999997,31035.26514999996,32747.18264999997,34695.10589999997,36137.05764999997,37557.92614999996
66.0,4635.574500000001,8717.899725,12246.765225000003,15340.250475,18072.17685,20710.770600000003,23384.199974999996,26769.054525,31954.677449999996,36827.70794999998,42692.69519999998,48875.18519999998,54948.97619999996,60169.39994999995,65478.15644999994,70881.85994999993,76761.8366999999,82106.9576999999,87601.0046999999,93105.79544999987,98241.5479499999,104085.31769999993,108411.17294999992,112673.7784499999
67.0,4635.574500000001,8717.899725,12246.765225000003,15340.250475,18072.17685,20710.770600000003,23384.199974999996,26769.054525,31954.677449999996,36827.70794999998,42692.69519999998,48875.18519999998,54948.97619999996,60169.39994999995,65478.15644999994,70881.85994999993,76761.8366999999,82106.9576999999,87601.0046999999,93105.79544999987,98241.5479499999,104085.31769999993,108411.17294999992,112673.7784499999
68.0,2871.711750000001,5117.3245000000015,7225.809250000002,9120.78525,10779.864500000001,12341.950499999999,13979.861750000007,16138.764250000013,18708.537750000014,21793.78825000001,25256.49275000001,29256.951500000017,32766.118000000013,36036.75050000001,39251.60875,42957.983250000005,46582.654750000016,50139.770500000006,53911.81824999998,57495.26750000001,61049.17749999998,64393.365749999975,67937.91174999993,71003.58024999994
69.0,2871.711750000001,5117.3245000000015,7225.809250000002,9120.78525,10779.864500000001,12341.950499999999,13979.861750000007,16138.764250000013,18708.537750000014,21793.78825000001,25256.49275000001,29256.951500000017,32766.118000000013,36036.75050000001,39251.60875,42957.983250000005,46582.654750000016,50139.770500000006,53911.81824999998,57495.26750000001,61049.17749999998,64393.365749999975,67937.91174999993,71003.58024999994
70.0,8615.135250000003,15351.973500000004,21677.427750000006,27362.355750000002,32339.593500000003,37025.8515,41939.58525000002,48416.29275000004,56125.61325000004,65381.36475000002,75769.47825000003,87770.85450000004,98298.35400000004,108110.25150000003,117754.82625,128873.94975000001,139747.96425000005,150419.3115,161735.45474999995,172485.80250000002,183147.53249999994,193180.09724999993,203813.7352499998,213010.74074999982
71.0,8615.135250000003,15351.973500000004,21677.427750000006,27362.355750000002,32339.593500000003,37025.8515,41939.58525000002,48416.29275000004,56125.61325000004,65381.36475000002,75769.47825000003,87770.85450000004,98298.35400000004,108110.25150000003,117754.82625,128873.94975000001,139747.96425000005,150419.3115,161735.45474999995,172485.80250000002,183147.53249999994,193180.09724999993,203813.7352499998,213010.74074999982
72.0,1607.6622499999999,2958.5737500000005,3998.3367500000018,5079.124,6018.069750000001,6977.829250000003,8028.543500000003,9339.115750000008,10976.29925000001,12975.958500000008,15104.817750000007,17360.34600000001,19484.979000000018,21524.30225000001,23590.57075000001,25616.576500000006,27697.62075000001,29834.455750000016,32145.247500000023,34538.06200000004,36680.01875000002,38761.13724999999,40829.615750000004,42748.471
73.0,1607.6622499999999,2958.5737500000005,3998.3367500000018,5079.124,6018.069750000001,6977.829250000003,8028.543500000003,9339.115750000008,10976.29925000001,12975.958500000008,15104.817750000007,17360.34600000001,19484.979000000018,21524.30225000001,23590.57075000001,25616.576500000006,27697.62075000001,29834.455750000016,32145.247500000023,34538.06200000004,36680.01875000002,38761.13724999999,40829.615750000004,42748.471
74.0,4822.98675,8875.721250000002,11995.010250000005,15237.372,18054.20925,20933.48775000001,24085.63050000001,28017.347250000024,32928.897750000026,38927.875500000024,45314.45325000002,52081.03800000003,58454.93700000005,64572.90675000004,70771.71225000003,76849.72950000002,83092.86225000003,89503.36725000004,96435.74250000007,103614.18600000013,110040.05625000005,116283.41174999997,122488.84725000002,128245.413
75.0,4822.98675,8875.721250000002,11995.010250000005,15237.372,18054.20925,20933.48775000001,24085.63050000001,28017.347250000024,32928.897750000026,38927.875500000024,45314.45325000002,52081.03800000003,58454.93700000005,64572.90675000004,70771.71225000003,76849.72950000002,83092.86225000003,89503.36725000004,96435.74250000007,103614.18600000013,110040.05625000005,116283.41174999997,122488.84725000002,128245.413
76.0,11510.667500000001,21426.00249999999,29272.69249999999,36753.500999999975,43215.60074999994,48707.22899999992,54042.13324999991,59649.576249999904,66403.09274999991,74501.71274999988,83477.37124999992,93367.37374999993,102609.97624999988,112135.21249999982,121485.51024999979,130980.68599999977,140276.01724999968,149943.9449999997,159370.52824999957,168731.3057499996,178308.9142499996,187894.43549999964,197659.64299999963,206937.88749999955
77.0,11510.667500000001,21426.00249999999,29272.69249999999,36753.500999999975,43215.60074999994,48707.22899999992,54042.13324999991,59649.576249999904,66403.09274999991,74501.71274999988,83477.37124999992,93367.37374999993,102609.97624999988,112135.21249999982,121485.51024999979,130980.68599999977,140276.01724999968,149943.9449999997,159370.52824999957,168731.3057499996,178308.9142499996,187894.43549999964,197659.64299999963,206937.88749999955
78.0,34532.0025,64278.00749999998,87818.07749999997,110260.50299999992,129646.80224999982,146121.68699999974,162126.39974999975,178948.72874999972,199209.27824999974,223505.1382499996,250432.1137499998,280102.1212499998,307829.9287499996,336405.6374999995,364456.53074999934,392942.0579999993,420828.05174999905,449831.83499999903,478111.5847499987,506193.9172499988,534926.7427499988,563683.3064999989,592978.9289999988,620813.6624999987
79.0,34532.0025,64278.00749999998,87818.07749999997,110260.50299999992,129646.80224999982,146121.68699999974,162126.39974999975,178948.72874999972,199209.27824999974,223505.1382499996,250432.1137499998,280102.1212499998,307829.9287499996,336405.6374999995,364456.53074999934,392942.0579999993,420828.05174999905,449831.83499999903,478111.5847499987,506193.9172499988,534926.7427499988,563683.3064999989,592978.9289999988,620813.6624999987
80.0,1999.2869999999996,3658.665749999999,5249.12,6451.601750000002,7526.674499999998,8650.604249999997,9722.062999999995,11077.118249999998,12611.894999999995,14527.533749999995,16585.61124999999,18731.117499999997,20708.280500000004,22872.700499999995,25331.204999999998,27455.01149999998,29336.36624999999,31319.441249999996,33211.60774999998,35155.15649999998,37179.25049999996,39306.218499999944,41096.76949999995,42830.15899999994
81.0,1999.2869999999996,3658.665749999999,5249.12,6451.601750000002,7526.674499999998,8650.604249999997,9722.062999999995,11077.118249999998,12611.894999999995,14527.533749999995,16585.61124999999,18731.117499999997,20708.280500000004,22872.700499999995,25331.204999999998,27455.01149999998,29336.36624999999,31319.441249999996,33211.60774999998,35155.15649999998,37179.25049999996,39306.218499999944,41096.76949999995,42830.15899999994
82.0,5997.860999999999,10975.997249999997,15747.36,19354.805250000005,22580.023499999996,25951.81274999999,29166.188999999984,33231.35474999999,37835.68499999998,43582.601249999985,49756.833749999976,56193.35249999999,62124.84150000001,68618.10149999999,75993.61499999999,82365.03449999994,88009.09874999996,93958.32374999998,99634.82324999994,105465.46949999995,111537.75149999987,117918.65549999983,123290.30849999985,128490.47699999982
83.0,5997.860999999999,10975.997249999997,15747.36,19354.805250000005,22580.023499999996,25951.81274999999,29166.188999999984,33231.35474999999,37835.68499999998,43582.601249999985,49756.833749999976,56193.35249999999,62124.84150000001,68618.10149999999,75993.61499999999,82365.03449999994,88009.09874999996,93958.32374999998,99634.82324999994,105465.46949999995,111537.75149999987,117918.65549999983,123290.30849999985,128490.47699999982
84.0,1642.0810000000001,2879.42225,3970.3447499999966,5009.895749999997,6026.927499999999,7009.890999999997,8128.385749999995,9410.382499999998,10967.239249999997,12819.832999999997,14830.857750000001,16749.419749999997,18634.180999999993,20393.079250000003,22342.151499999996,24302.024750000008,26399.0805,28460.07225,30524.029000000006,32771.6535,34918.37775,37050.85524999999,39036.68500000001,40817.96949999999
85.0,1642.0810000000001,2879.42225,3970.3447499999966,5009.895749999997,6026.927499999999,7009.890999999997,8128.385749999995,9410.382499999998,10967.239249999997,12819.832999999997,14830.857750000001,16749.419749999997,18634.180999999993,20393.079250000003,22342.151499999996,24302.024750000008,26399.0805,28460.07225,30524.029000000006,32771.6535,34918.37775,37050.85524999999,39036.68500000001,40817.96949999999
86.0,4926.243,8638.26675,11911.03424999999,15029.687249999992,18080.782499999998,21029.67299999999,24385.157249999986,28231.147499999992,32901.71774999999,38459.49899999999,44492.57325,50248.25924999999,55902.542999999976,61179.23775000001,67026.45449999999,72906.07425000002,79197.2415,85380.21675,91572.08700000001,98314.9605,104755.13325,111152.56574999998,117110.05500000004,122453.90849999998
87.0,4926.243,8638.26675,11911.03424999999,15029.687249999992,18080.782499999998,21029.67299999999,24385.157249999986,28231.147499999992,32901.71774999999,38459.49899999999,44492.57325,50248.25924999999,55902.542999999976,61179.23775000001,67026.45449999999,72906.07425000002,79197.2415,85380.21675,91572.08700000001,98314.9605,104755.13325,111152.56574999998,117110.05500000004,122453.90849999998
88.0,1972.2259999999999,3513.9822499999987,4817.811,6167.246750000001,7254.292500000002,8363.549000000005,9626.595000000005,10999.678000000005,12689.122500000007,14689.343250000013,17469.30075000001,20166.63550000002,22548.524000000012,24482.144250000023,26527.22250000002,28858.12725000002,31245.34275000003,33440.91875000005,35568.29750000004,37513.70575000003,39421.73225000002,41353.64550000001,43144.909000000014,45009.75925000001
89.0,1972.2259999999999,3513.9822499999987,4817.811,6167.246750000001,7254.292500000002,8363.549000000005,9626.595000000005,10999.678000000005,12689.122500000007,14689.343250000013,17469.30075000001,20166.63550000002,22548.524000000012,24482.144250000023,26527.22250000002,28858.12725000002,31245.34275000003,33440.91875000005,35568.29750000004,37513.70575000003,39421.73225000002,41353.64550000001,43144.909000000014,45009.75925000001
90.0,5916.678,10541.946749999996,14453.432999999999,18501.740250000003,21762.877500000006,25090.64700000001,28879.785000000014,32999.034000000014,38067.36750000002,44068.02975000004,52407.90225000003,60499.906500000056,67645.57200000004,73446.43275000007,79581.66750000007,86574.38175000006,93736.02825000009,100322.75625000015,106704.8925000001,112541.1172500001,118265.19675000006,124060.93650000004,129434.72700000004,135029.27775000004
91.0,5916.678,10541.946749999996,14453.432999999999,18501.740250000003,21762.877500000006,25090.64700000001,28879.785000000014,32999.034000000014,38067.36750000002,44068.02975000004,52407.90225000003,60499.906500000056,67645.57200000004,73446.43275000007,79581.66750000007,86574.38175000006,93736.02825000009,100322.75625000015,106704.8925000001,112541.1172500001,118265.19675000006,124060.93650000004,129434.72700000004,135029.27775000004
92.0,6598.004249999999,11740.248749999995,15866.11099999999,19524.56699999999,22854.511749999987,26086.027499999993,29367.89049999999,33427.776,38183.611250000016,43666.24025000004,49585.42025000005,55774.33625000004,62044.914750000025,67982.98249999998,74180.11524999996,80642.25524999996,87307.68024999998,93779.55024999997,100329.78274999998,106510.44075,113233.72499999999,119478.83824999996,125291.83274999994,130971.43474999999
93.0,6598.004249999999,11740.248749999995,15866.11099999999,19524.56699999999,22854.511749999987,26086.027499999993,29367.89049999999,33427.776,38183.611250000016,43666.24025000004,49585.42025000005,55774.33625000004,62044.914750000025,67982.98249999998,74180.11524999996,80642.25524999996,87307.68024999998,93779.55024999997,100329.78274999998,106510.44075,113233.72499999999,119478.83824999996,125291.83274999994,130971.43474999999
94.0,19794.012749999998,35220.74624999998,47598.33299999997,58573.700999999965,68563.53524999996,78258.08249999997,88103.67149999997,100283.328,114550.83375000005,130998.72075000012,148756.26075000013,167323.0087500001,186134.74425000008,203948.94749999995,222540.34574999986,241926.76574999987,261923.04074999993,281338.6507499999,300989.3482499999,319531.32224999997,339701.175,358436.51474999986,375875.49824999983,392914.3042499999
95.0,19794.012749999998,35220.74624999998,47598.33299999997,58573.700999999965,68563.53524999996,78258.08249999997,88103.67149999997,100283.328,114550.83375000005,130998.72075000012,148756.26075000013,167323.0087500001,186134.74425000008,203948.94749999995,222540.34574999986,241926.76574999987,261923.04074999993,281338.6507499999,300989.3482499999,319531.32224999997,339701.175,358436.51474999986,375875.49824999983,392914.3042499999
96.0,1326.8677499999997,2412.93125,3342.01825,4210.351,5089.4475,5965.43,6863.186000000001,8028.280250000004,9471.551500000001,11210.210750000002,13161.732000000005,15118.466750000005,17121.988000000016,18993.23750000001,21073.139500000016,23050.60925000001,25247.634,27437.634499999996,29627.30049999999,31564.346499999978,33351.79199999997,35147.36399999996,36782.340999999964,38216.61399999996
97.0,1326.8677499999997,2412.93125,3342.01825,4210.351,5089.4475,5965.43,6863.186000000001,8028.280250000004,9471.551500000001,11210.210750000002,13161.732000000005,15118.466750000005,17121.988000000016,18993.23750000001,21073.139500000016,23050.60925000001,25247.634,27437.634499999996,29627.30049999999,31564.346499999978,33351.79199999997,35147.36399999996,36782.340999999964,38216.61399999996
98.0,3980.603249999999,7238.793750000001,10026.05475,12631.053,15268.3425,17896.29,20589.558,24084.840750000014,28414.654500000004,33630.63225000001,39485.19600000002,45355.40025000001,51365.96400000005,56979.71250000003,63219.41850000004,69151.82775000003,75742.902,82312.90349999999,88881.90149999998,94693.03949999993,100055.37599999992,105442.09199999987,110347.0229999999,114649.84199999987
99.0,3980.603249999999,7238.793750000001,10026.05475,12631.053,15268.3425,17896.29,20589.558,24084.840750000014,28414.654500000004,33630.63225000001,39485.19600000002,45355.40025000001,51365.96400000005,56979.71250000003,63219.41850000004,69151.82775000003,75742.902,82312.90349999999,88881.90149999998,94693.03949999993,100055.37599999992,105442.09199999987,110347.0229999999,114649.84199999987
100.0,5588.10335,10111.211475000004,14344.115375000003,17960.475574999997,21353.757549999988,24622.19522499999,28457.490999999984,32853.665524999975,38201.94834999997,44588.449674999996,52794.423449999995,61073.224149999995,68929.105,76218.97532499996,83858.68539999993,91264.88899999994,98823.13762499994,106773.95624999989,114490.36349999988,122081.06734999991,129363.0933999999,136179.05052499997,142778.52905,148483.528275
101.0,5588.10335,10111.211475000004,14344.115375000003,17960.475574999997,21353.757549999988,24622.19522499999,28457.490999999984,32853.665524999975,38201.94834999997,44588.449674999996,52794.423449999995,61073.224149999995,68929.105,76218.97532499996,83858.68539999993,91264.88899999994,98823.13762499994,106773.95624999989,114490.36349999988,122081.06734999991,129363.0933999999,136179.05052499997,142778.52905,148483.528275
102.0,16764.31005,30333.63442500001,43032.34612500001,53881.42672499999,64061.27264999996,73866.58567499997,85372.47299999995,98560.99657499992,114605.84504999992,133765.349025,158383.27034999998,183219.67244999998,206787.315,228656.9259749999,251576.0561999998,273794.6669999998,296469.4128749998,320321.8687499997,343471.09049999964,366243.20204999973,388089.2801999997,408537.1515749999,428335.58715000004,445450.58482499997
103.0,16764.31005,30333.63442500001,43032.34612500001,53881.42672499999,64061.27264999996,73866.58567499997,85372.47299999995,98560.99657499992,114605.84504999992,133765.349025,158383.27034999998,183219.67244999998,206787.315,228656.9259749999,251576.0561999998,273794.6669999998,296469.4128749998,320321.8687499997,343471.09049999964,366243.20204999973,388089.2801999997,408537.1515749999,428335.58715000004,445450.58482499997
104.0,10042.2825,18198.874999999993,25314.807499999995,31386.778,37235.47274999997,42674.12499999997,48378.021499999944,55273.70149999992,63491.338999999934,73234.30899999992,84309.09149999998,95447.06899999997,106089.81649999997,116264.24649999989,127383.62899999994,137735.81399999995,148489.05900000012,159294.09900000028,170665.74650000042,181865.33150000044,193654.0165000004,205713.91150000034,216393.6890000004,226893.8390000003
105.0,10042.2825,18198.874999999993,25314.807499999995,31386.778,37235.47274999997,42674.12499999997,48378.021499999944,55273.70149999992,63491.338999999934,73234.30899999992,84309.09149999998,95447.06899999997,106089.81649999997,116264.24649999989,127383.62899999994,137735.81399999995,148489.05900000012,159294.09900000028,170665.74650000042,181865.33150000044,193654.0165000004,205713.91150000034,216393.6890000004,226893.8390000003
106.0,30126.847499999996,54596.62499999998,75944.42249999999,94160.334,111706.41824999992,128022.37499999991,145134.06449999983,165821.10449999978,190474.01699999982,219702.92699999976,252927.27449999994,286341.20699999994,318269.44949999993,348792.7394999997,382150.8869999998,413207.44199999986,445467.1770000004,477882.29700000084,511997.23950000125,545595.9945000013,580962.0495000012,617141.734500001,649181.0670000012,680681.5170000009
107.0,30126.847499999996,54596.62499999998,75944.42249999999,94160.334,111706.41824999992,128022.37499999991,145134.06449999983,165821.10449999978,190474.01699999982,219702.92699999976,252927.27449999994,286341.20699999994,318269.44949999993,348792.7394999997,382150.8869999998,413207.44199999986,445467.1770000004,477882.29700000084,511997.23950000125,545595.9945000013,580962.0495000012,617141.734500001,649181.0670000012,680681.5170000009
108.0,3009.8445,5268.2177500000025,7265.568250000001,9059.78015,10656.460575000001,12176.500825000006,14100.24157500001,16323.173825000018,18894.519825000025,22309.878075000026,26488.657325000026,31267.473575000015,35725.382575000025,39700.95607500004,43989.35507500003,48154.06232500002,52913.241325,57916.46707499998,63136.07557499998,67726.676075,72100.15882499995,76069.19407499993,79599.99607499997,82951.27182499996
109.0,3009.8445,5268.2177500000025,7265.568250000001,9059.78015,10656.460575000001,12176.500825000006,14100.24157500001,16323.173825000018,18894.519825000025,22309.878075000026,26488.657325000026,31267.473575000015,35725.382575000025,39700.95607500004,43989.35507500003,48154.06232500002,52913.241325,57916.46707499998,63136.07557499998,67726.676075,72100.15882499995,76069.19407499993,79599.99607499997,82951.27182499996
110.0,9029.533500000001,15804.653250000007,21796.704750000004,27179.340450000003,31969.381725000003,36529.502475000016,42300.72472500003,48969.52147500005,56683.559475000075,66929.63422500007,79465.97197500008,93802.42072500005,107176.14772500008,119102.86822500011,131968.0652250001,144462.18697500008,158739.723975,173749.40122499992,189408.22672499996,203180.028225,216300.47647499986,228207.5822249998,238799.98822499992,248853.8154749999
111.0,9029.533500000001,15804.653250000007,21796.704750000004,27179.340450000003,31969.381725000003,36529.502475000016,42300.72472500003,48969.52147500005,56683.559475000075,66929.63422500007,79465.97197500008,93802.42072500005,107176.14772500008,119102.86822500011,131968.0652250001,144462.18697500008,158739.723975,173749.40122499992,189408.22672499996,203180.028225,216300.47647499986,228207.5822249998,238799.98822499992,248853.8154749999
112.0,3384.4999999999986,6127.222249999998,8587.014749999998,10759.849499999993,12652.501999999995,14592.966749999994,16597.689499999993,18868.16624999999,21998.061499999996,25685.934500000003,29596.56375000001,33546.563500000004,38075.54950000002,41957.342000000026,46264.927250000015,50684.667500000025,54955.81350000002,59143.991500000026,63751.36925000001,68457.81675000004,72866.94249999999,77112.73199999999,81335.74024999994,85293.71874999997
113.0,3384.4999999999986,6127.222249999998,8587.014749999998,10759.849499999993,12652.501999999995,14592.966749999994,16597.689499999993,18868.16624999999,21998.061499999996,25685.934500000003,29596.56375000001,33546.563500000004,38075.54950000002,41957.342000000026,46264.927250000015,50684.667500000025,54955.81350000002,59143.991500000026,63751.36925000001,68457.81675000004,72866.94249999999,77112.73199999999,81335.74024999994,85293.71874999997
114.0,10153.499999999996,18381.666749999993,25761.044249999995,32279.54849999998,37957.50599999999,43778.900249999984,49793.06849999998,56604.49874999997,65994.18449999999,77057.80350000001,88789.69125000003,100639.69050000001,114226.64850000007,125872.02600000007,138794.78175000005,152054.00250000006,164867.44050000006,177431.97450000007,191254.10775000002,205373.4502500001,218600.82749999996,231338.19599999997,244007.22074999983,255881.1562499999
115.0,10153.499999999996,18381.666749999993,25761.044249999995,32279.54849999998,37957.50599999999,43778.900249999984,49793.06849999998,56604.49874999997,65994.18449999999,77057.80350000001,88789.69125000003,100639.69050000001,114226.64850000007,125872.02600000007,138794.78175000005,152054.00250000006,164867.44050000006,177431.97450000007,191254.10775000002,205373.4502500001,218600.82749999996,231338.19599999997,244007.22074999983,255881.1562499999
116.0,3347.33075,5935.303999999998,7999.052499999997,9899.298999999999,11600.176249999993,13382.31599999999,15156.19249999999,17443.459999999992,20480.003249999987,24054.497749999984,28191.508249999988,32206.036249999997,36250.59374999999,39902.81174999999,43896.064249999996,48079.89000000001,51815.68475,55761.0545,59817.70700000001,63758.982249999994,67797.95999999998,71665.80924999998,75282.20774999996,78662.92099999996
117.0,3347.33075,5935.303999999998,7999.052499999997,9899.298999999999,11600.176249999993,13382.31599999999,15156.19249999999,17443.459999999992,20480.003249999987,24054.497749999984,28191.508249999988,32206.036249999997,36250.59374999999,39902.81174999999,43896.064249999996,48079.89000000001,51815.68475,55761.0545,59817.70700000001,63758.982249999994,67797.95999999998,71665.80924999998,75282.20774999996,78662.92099999996
118.0,10041.99225,17805.911999999997,23997.15749999999,29697.896999999997,34800.52874999998,40146.94799999997,45468.57749999997,52330.379999999976,61440.00974999996,72163.49324999996,84574.52474999997,96618.10874999998,108751.78124999997,119708.43524999998,131688.19275,144239.67,155447.05425,167283.1635,179453.12100000004,191276.94674999997,203393.87999999995,214997.42774999992,225846.6232499999,235988.76299999986
119.0,10041.99225,17805.911999999997,23997.15749999999,29697.896999999997,34800.52874999998,40146.94799999997,45468.57749999997,52330.379999999976,61440.00974999996,72163.49324999996,84574.52474999997,96618.10874999998,108751.78124999997,119708.43524999998,131688.19275,144239.67,155447.05425,167283.1635,179453.12100000004,191276.94674999997,203393.87999999995,214997.42774999992,225846.6232499999,235988.76299999986
120.0,4784.632225,8966.636425,12909.511675000003,16126.16355000001,19328.951150000008,21872.62029999999,24562.326725,27540.42777500001,30963.653125000008,34978.944249999986,39443.05774999997,43734.975174999956,47892.331774999955,52652.13892499997,57700.261924999984,63441.031924999974,68134.32792499992,72438.1976499999,76708.60729999987,80983.03429999985,85574.5750999999,89895.32759999987,94434.71492499983,98409.46637499987
121.0,4784.632225,8966.636425,12909.511675000003,16126.16355000001,19328.951150000008,21872.62029999999,24562.326725,27540.42777500001,30963.653125000008,34978.944249999986,39443.05774999997,43734.975174999956,47892.331774999955,52652.13892499997,57700.261924999984,63441.031924999974,68134.32792499992,72438.1976499999,76708.60729999987,80983.03429999985,85574.5750999999,89895.32759999987,94434.71492499983,98409.46637499987
122.0,14353.896675,26899.909275,38728.53502500001,48378.49065000003,57986.853450000024,65617.86089999997,73686.980175,82621.28332500003,92890.95937500002,104936.83274999996,118329.1732499999,131204.92552499985,143676.99532499985,157956.4167749999,173100.78577499994,190323.09577499994,204402.98377499974,217314.5929499997,230125.82189999963,242949.10289999956,256723.7252999997,269685.98279999965,283304.14477499947,295228.39912499965
123.0,14353.896675,26899.909275,38728.53502500001,48378.49065000003,57986.853450000024,65617.86089999997,73686.980175,82621.28332500003,92890.95937500002,104936.83274999996,118329.1732499999,131204.92552499985,143676.99532499985,157956.4167749999,173100.78577499994,190323.09577499994,204402.98377499974,217314.5929499997,230125.82189999963,242949.10289999956,256723.7252999997,269685.98279999965,283304.14477499947,295228.39912499965
124.0,86921.33899999999,159429.98899999994,220762.00674999997,274699.9252499999,324422.29949999996,371813.77975,421309.3895,479312.0315000001,551246.29825,638977.63125,740584.942,843667.6932499999,944564.7590000001,1040125.4872499998,1139271.6357499997,1238863.5614999996,1339951.1492499996,1441461.6239999994,1546196.849749999,1648291.6659999995,1746716.9904999994,1845533.0134999994,1937365.2297499978,2022988.7354999979
125.0,86921.33899999999,159429.98899999994,220762.00674999997,274699.9252499999,324422.29949999996,371813.77975,421309.3895,479312.0315000001,551246.29825,638977.63125,740584.942,843667.6932499999,944564.7590000001,1040125.4872499998,1139271.6357499997,1238863.5614999996,1339951.1492499996,1441461.6239999994,1546196.849749999,1648291.6659999995,1746716.9904999994,1845533.0134999994,1937365.2297499978,2022988.7354999979
126.0,260764.017,478289.96699999983,662286.02025,824099.7757499998,973266.8984999999,1115441.33925,1263928.1685,1437936.0945000004,1653738.89475,1916932.8937499998,2221754.8260000004,2531003.0797499996,2833694.2770000002,3120376.4617499993,3417814.907249999,3716590.6844999986,4019853.4477499984,4324384.871999998,4638590.549249996,4944874.997999999,5240150.971499998,5536599.040499998,5812095.689249993,6068966.206499994
127.0,260764.017,478289.96699999983,662286.02025,824099.7757499998,973266.8984999999,1115441.33925,1263928.1685,1437936.0945000004,1653738.89475,1916932.8937499998,2221754.8260000004,2531003.0797499996,2833694.2770000002,3120376.4617499993,3417814.907249999,3716590.6844999986,4019853.4477499984,4324384.871999998,4638590.549249996,4944874.997999999,5240150.971499998,5536599.040499998,5812095.689249993,6068966.206499994
128.0,6603.972000000001,12057.573250000001,16779.6545,20659.497249999997,25055.957499999997,28641.3295,32364.117999999995,36509.060999999994,41776.12274999999,47958.63875,54814.648250000006,61466.57725,68766.83699999996,75578.61825000004,82772.71850000005,89316.66625000005,95919.62725000003,102654.05850000001,109385.59675000001,116589.96800000002,123448.00150000007,130024.16375000005,136367.0112500001,142179.2927500001
129.0,6603.972000000001,12057.573250000001,16779.6545,20659.497249999997,25055.957499999997,28641.3295,32364.117999999995,36509.060999999994,41776.12274999999,47958.63875,54814.648250000006,61466.57725,68766.83699999996,75578.61825000004,82772.71850000005,89316.66625000005,95919.62725000003,102654.05850000001,109385.59675000001,116589.96800000002,123448.00150000007,130024.16375000005,136367.0112500001,142179.2927500001
130.0,19811.916,36172.719750000004,50338.9635,61978.49174999999,75167.8725,85923.9885,97092.35399999999,109527.18299999999,125328.36824999997,143875.91625,164443.94475000002,184399.73175,206300.51099999988,226735.85475000012,248318.15550000014,267949.99875000014,287758.8817500001,307962.1755,328156.79025,349769.9040000001,370344.0045000002,390072.49125000014,409101.0337500003,426537.8782500003
131.0,19811.916,36172.719750000004,50338.9635,61978.49174999999,75167.8725,85923.9885,97092.35399999999,109527.18299999999,125328.36824999997,143875.91625,164443.94475000002,184399.73175,206300.51099999988,226735.85475000012,248318.15550000014,267949.99875000014,287758.8817500001,307962.1755,328156.79025,349769.9040000001,370344.0045000002,390072.49125000014,409101.0337500003,426537.8782500003
132.0,884.4678500000002,1724.7125749999998,2417.5279250000003,3136.0363499999994,3774.4904249999977,4424.697799999999,5101.713749999996,5847.639024999994,6694.705849999995,7735.351224999994,8932.737724999995,10246.9638,11627.639749999997,12993.815999999995,14255.014974999998,15542.862425000001,16774.8958,18244.216200000006,19580.226450000013,20847.98870000002,22139.59282500002,23282.147725000024,24326.025975000026,25396.608000000026
133.0,884.4678500000002,1724.7125749999998,2417.5279250000003,3136.0363499999994,3774.4904249999977,4424.697799999999,5101.713749999996,5847.639024999994,6694.705849999995,7735.351224999994,8932.737724999995,10246.9638,11627.639749999997,12993.815999999995,14255.014974999998,15542.862425000001,16774.8958,18244.216200000006,19580.226450000013,20847.98870000002,22139.59282500002,23282.147725000024,24326.025975000026,25396.608000000026
134.0,2653.403550000001,5174.137725,7252.583775000001,9408.10905,11323.471274999993,13274.093399999998,15305.14124999999,17542.917074999983,20084.117549999984,23206.05367499998,26798.213174999986,30740.8914,34882.91924999999,38981.44799999999,42765.044924999995,46628.587275000005,50324.687399999995,54732.648600000015,58740.679350000035,62543.96610000006,66418.77847500006,69846.44317500008,72978.07792500008,76189.82400000008
135.0,2653.403550000001,5174.137725,7252.583775000001,9408.10905,11323.471274999993,13274.093399999998,15305.14124999999,17542.917074999983,20084.117549999984,23206.05367499998,26798.213174999986,30740.8914,34882.91924999999,38981.44799999999,42765.044924999995,46628.587275000005,50324.687399999995,54732.648600000015,58740.679350000035,62543.96610000006,66418.77847500006,69846.44317500008,72978.07792500008,76189.82400000008
136.0,2151.8582499999998,4005.764,5713.725999999999,7159.440499999999,8576.479,10084.718999999997,11682.627749999996,13758.556999999999,15894.062999999995,18742.139750000002,21517.39950000001,24377.32200000002,27260.36375000001,30205.737500000003,32994.33225,35895.02900000002,38816.18700000003,41484.250000000015,44438.05225000002,47335.98700000004,50256.017250000055,53350.58500000005,56139.995000000046,58568.951750000044
137.0,2151.8582499999998,4005.764,5713.725999999999,7159.440499999999,8576.479,10084.718999999997,11682.627749999996,13758.556999999999,15894.062999999995,18742.139750000002,21517.39950000001,24377.32200000002,27260.36375000001,30205.737500000003,32994.33225,35895.02900000002,38816.18700000003,41484.250000000015,44438.05225000002,47335.98700000004,50256.017250000055,53350.58500000005,56139.995000000046,58568.951750000044
138.0,6455.57475,12017.292000000001,17141.177999999996,21478.3215,25729.436999999998,30254.156999999992,35047.883249999984,41275.670999999995,47682.188999999984,56226.419250000006,64552.19850000003,73131.96600000006,81781.09125000003,90617.21250000001,98982.99674999999,107685.08700000006,116448.56100000007,124452.75000000004,133314.15675000008,142007.96100000013,150768.05175000016,160051.75500000015,168419.98500000013,175706.85525000014
139.0,6455.57475,12017.292000000001,17141.177999999996,21478.3215,25729.436999999998,30254.156999999992,35047.883249999984,41275.670999999995,47682.188999999984,56226.419250000006,64552.19850000003,73131.96600000006,81781.09125000003,90617.21250000001,98982.99674999999,107685.08700000006,116448.56100000007,124452.75000000004,133314.15675000008,142007.96100000013,150768.05175000016,160051.75500000015,168419.98500000013,175706.85525000014
140.0,1708.2459999999996,3178.3487500000006,4321.371250000001,5456.49275,6507.833499999999,7776.252224999999,8815.206225,10127.547224999997,11698.898474999996,13706.644975000001,16309.099475000005,18616.51797500002,20718.380975000044,22794.724475000028,24952.441975000027,27066.347225000034,29423.459475000032,31421.411975000025,33601.26747500003,35897.11747500002,37935.83547500005,39935.10222500007,41736.26197500005,43335.93822500002
141.0,1708.2459999999996,3178.3487500000006,4321.371250000001,5456.49275,6507.833499999999,7776.252224999999,8815.206225,10127.547224999997,11698.898474999996,13706.644975000001,16309.099475000005,18616.51797500002,20718.380975000044,22794.724475000028,24952.441975000027,27066.347225000034,29423.459475000032,31421.411975000025,33601.26747500003,35897.11747500002,37935.83547500005,39935.10222500007,41736.26197500005,43335.93822500002
142.0,5124.737999999999,9535.046250000001,12964.113750000004,16369.47825,19523.500499999995,23328.756674999997,26445.618674999998,30382.64167499999,35096.69542499999,41119.934925,48927.298425000015,55849.55392500006,62155.14292500013,68384.17342500009,74857.32592500008,81199.0416750001,88270.37842500009,94264.23592500007,100803.80242500009,107691.35242500006,113807.50642500015,119805.3066750002,125208.78592500015,130007.81467500006
143.0,5124.737999999999,9535.046250000001,12964.113750000004,16369.47825,19523.500499999995,23328.756674999997,26445.618674999998,30382.64167499999,35096.69542499999,41119.934925,48927.298425000015,55849.55392500006,62155.14292500013,68384.17342500009,74857.32592500008,81199.0416750001,88270.37842500009,94264.23592500007,100803.80242500009,107691.35242500006,113807.50642500015,119805.3066750002,125208.78592500015,130007.81467500006
144.0,8939.296749999996,16851.683749999982,23469.527250000006,29074.41825,34224.58175000001,38988.94025,44025.26624999999,49452.42024999999,56304.45099999998,64343.80624999997,73722.25975000003,83312.51549999998,92472.21800000001,102032.46550000008,111285.9230000001,120592.0355000001,129678.9980000002,139680.6205000002,149324.07300000024,159299.06050000034,168864.38800000036,178198.1305000004,186603.56550000043,194691.40300000037
145.0,8939.296749999996,16851.683749999982,23469.527250000006,29074.41825,34224.58175000001,38988.94025,44025.26624999999,49452.42024999999,56304.45099999998,64343.80624999997,73722.25975000003,83312.51549999998,92472.21800000001,102032.46550000008,111285.9230000001,120592.0355000001,129678.9980000002,139680.6205000002,149324.07300000024,159299.06050000034,168864.38800000036,178198.1305000004,186603.56550000043,194691.40300000037
146.0,26817.89024999999,50555.051249999946,70408.58175000001,87223.25475,102673.74525000004,116966.82075,132075.79875,148357.26074999996,168913.35299999994,193031.41874999992,221166.77925000008,249937.54649999994,277416.65400000004,306097.39650000026,333857.7690000003,361776.1065000003,389036.9940000006,419041.8615000006,447972.21900000074,477897.181500001,506593.16400000104,534594.3915000012,559810.6965000012,584074.2090000011
147.0,26817.89024999999,50555.051249999946,70408.58175000001,87223.25475,102673.74525000004,116966.82075,132075.79875,148357.26074999996,168913.35299999994,193031.41874999992,221166.77925000008,249937.54649999994,277416.65400000004,306097.39650000026,333857.7690000003,361776.1065000003,389036.9940000006,419041.8615000006,447972.21900000074,477897.181500001,506593.16400000104,534594.3915000012,559810.6965000012,584074.2090000011
148.0,2370.2527499999997,4626.155749999999,6301.867999999996,7735.941499999997,9091.480999999994,10329.549749999995,11716.616999999995,13256.817999999992,15307.429499999993,17939.55024999999,21914.15775,25510.531750000002,29044.432500000003,31939.42025,34578.57849999999,37300.83374999999,40076.24299999998,42789.55300000001,45586.780750000005,48346.08175,50912.5315,53543.23074999999,56115.298999999985,58374.61199999999
149.0,2370.2527499999997,4626.155749999999,6301.867999999996,7735.941499999997,9091.480999999994,10329.549749999995,11716.616999999995,13256.817999999992,15307.429499999993,17939.55024999999,21914.15775,25510.531750000002,29044.432500000003,31939.42025,34578.57849999999,37300.83374999999,40076.24299999998,42789.55300000001,45586.780750000005,48346.08175,50912.5315,53543.23074999999,56115.298999999985,58374.61199999999
150.0,7110.758249999999,13878.467249999998,18905.60399999999,23207.82449999999,27274.442999999985,30988.649249999984,35149.85099999998,39770.453999999976,45922.28849999998,53818.65074999997,65742.47325,76531.59525000001,87133.29750000002,95818.26075,103735.73549999997,111902.50124999997,120228.72899999993,128368.65900000001,136760.34225000002,145038.24524999998,152737.5945,160629.69224999996,168345.89699999994,175123.83599999995
151.0,7110.758249999999,13878.467249999998,18905.60399999999,23207.82449999999,27274.442999999985,30988.649249999984,35149.85099999998,39770.453999999976,45922.28849999998,53818.65074999997,65742.47325,76531.59525000001,87133.29750000002,95818.26075,103735.73549999997,111902.50124999997,120228.72899999993,128368.65900000001,136760.34225000002,145038.24524999998,152737.5945,160629.69224999996,168345.89699999994,175123.83599999995
152.0,8604.962499999996,14703.599750000001,19805.363250000006,24238.305500000006,28538.09850000002,32651.01950000004,36833.04750000007,41489.244500000066,47002.72625000008,53982.97075000008,61783.29950000006,69749.60250000007,77837.05575000006,86033.02250000005,94192.6977500001,102580.5000000001,111053.42375000016,119712.13225000014,128263.14700000019,136651.4795000001,144773.26125000027,152615.65700000027,160063.4907500003,167129.6662500003
153.0,8604.962499999996,14703.599750000001,19805.363250000006,24238.305500000006,28538.09850000002,32651.01950000004,36833.04750000007,41489.244500000066,47002.72625000008,53982.97075000008,61783.29950000006,69749.60250000007,77837.05575000006,86033.02250000005,94192.6977500001,102580.5000000001,111053.42375000016,119712.13225000014,128263.14700000019,136651.4795000001,144773.26125000027,152615.65700000027,160063.4907500003,167129.6662500003
154.0,25814.88749999999,44110.799250000004,59416.089750000014,72714.91650000002,85614.29550000005,97953.05850000012,110499.14250000022,124467.7335000002,141008.17875000025,161948.91225000023,185349.89850000018,209248.8075000002,233511.16725000017,258099.06750000015,282578.09325000027,307741.5000000003,333160.27125000046,359136.3967500004,384789.4410000006,409954.4385000003,434319.7837500008,457846.97100000083,480190.47225000086,501388.9987500009
155.0,25814.88749999999,44110.799250000004,59416.089750000014,72714.91650000002,85614.29550000005,97953.05850000012,110499.14250000022,124467.7335000002,141008.17875000025,161948.91225000023,185349.89850000018,209248.8075000002,233511.16725000017,258099.06750000015,282578.09325000027,307741.5000000003,333160.27125000046,359136.3967500004,384789.4410000006,409954.4385000003,434319.7837500008,457846.97100000083,480190.47225000086,501388.9987500009
156.0,4666.711500000001,8421.652,11680.091499999999,14862.818749999997,17520.737249999995,20008.42299999998,22694.69899999998,25660.685249999977,29577.41724999999,34576.93350000001,40319.864250000006,46620.840999999986,52348.4965,57382.09424999999,62712.22949999997,67952.17224999996,73273.58024999996,78729.76424999992,84516.11274999994,90076.38374999998,95482.91500000002,101660.47400000002,106847.41250000003,111735.09000000003
157.0,4666.711500000001,8421.652,11680.091499999999,14862.818749999997,17520.737249999995,20008.42299999998,22694.69899999998,25660.685249999977,29577.41724999999,34576.93350000001,40319.864250000006,46620.840999999986,52348.4965,57382.09424999999,62712.22949999997,67952.17224999996,73273.58024999996,78729.76424999992,84516.11274999994,90076.38374999998,95482.91500000002,101660.47400000002,106847.41250000003,111735.09000000003
158.0,14000.134500000004,25264.956,35040.2745,44588.45624999999,52562.21174999999,60025.26899999994,68084.09699999994,76982.05574999993,88732.25174999997,103730.80050000001,120959.59275000001,139862.52299999996,157045.4895,172146.28274999995,188136.68849999993,203856.5167499999,219820.74074999988,236189.29274999976,253548.33824999983,270229.15124999994,286448.74500000005,304981.422,320542.2375000001,335205.2700000001
159.0,14000.134500000004,25264.956,35040.2745,44588.45624999999,52562.21174999999,60025.26899999994,68084.09699999994,76982.05574999993,88732.25174999997,103730.80050000001,120959.59275000001,139862.52299999996,157045.4895,172146.28274999995,188136.68849999993,203856.5167499999,219820.74074999988,236189.29274999976,253548.33824999983,270229.15124999994,286448.74500000005,304981.422,320542.2375000001,335205.2700000001
160.0,3877.9905000000003,7281.504499999999,9915.171750000005,12000.855000000005,14043.450250000007,16071.166749999995,18152.00899999999,20572.03474999999,23545.01124999999,26901.507499999985,30826.72274999997,34848.862749999986,39192.69625,43109.57825,47125.33575,51287.02425,55923.18425000002,60222.87425000004,64890.80950000005,69564.35200000001,73719.87450000003,77654.92575000004,81696.21275000005,85153.549
161.0,3877.9905000000003,7281.504499999999,9915.171750000005,12000.855000000005,14043.450250000007,16071.166749999995,18152.00899999999,20572.03474999999,23545.01124999999,26901.507499999985,30826.72274999997,34848.862749999986,39192.69625,43109.57825,47125.33575,51287.02425,55923.18425000002,60222.87425000004,64890.80950000005,69564.35200000001,73719.87450000003,77654.92575000004,81696.21275000005,85153.549
162.0,11633.971500000001,21844.513499999997,29745.515250000015,36002.56500000002,42130.35075000002,48213.50024999998,54456.02699999997,61716.104249999975,70635.03374999997,80704.52249999996,92480.16824999992,104546.58824999996,117578.08875,129328.73475,141376.00725,153861.07275,167769.55275000006,180668.6227500001,194672.42850000015,208693.05600000004,221159.6235000001,232964.7772500001,245088.63825000013,255460.647
163.0,11633.971500000001,21844.513499999997,29745.515250000015,36002.56500000002,42130.35075000002,48213.50024999998,54456.02699999997,61716.104249999975,70635.03374999997,80704.52249999996,92480.16824999992,104546.58824999996,117578.08875,129328.73475,141376.00725,153861.07275,167769.55275000006,180668.6227500001,194672.42850000015,208693.05600000004,221159.6235000001,232964.7772500001,245088.63825000013,255460.647
164.0,2646.3707500000005,5110.481250000003,7036.989500000001,8742.870000000004,10471.455250000014,12055.594750000018,13812.408250000017,15823.930500000011,18499.517000000003,21571.585000000006,24718.21350000002,27987.37800000003,31262.08950000005,34476.921250000065,37680.76925000007,40951.64550000007,44175.65850000007,47690.11625000009,51260.55650000008,54535.331750000056,58015.43425000006,61371.44150000006,64807.816000000064,68414.92200000011
165.0,2646.3707500000005,5110.481250000003,7036.989500000001,8742.870000000004,10471.455250000014,12055.594750000018,13812.408250000017,15823.930500000011,18499.517000000003,21571.585000000006,24718.21350000002,27987.37800000003,31262.08950000005,34476.921250000065,37680.76925000007,40951.64550000007,44175.65850000007,47690.11625000009,51260.55650000008,54535.331750000056,58015.43425000006,61371.44150000006,64807.816000000064,68414.92200000011
166.0,7939.112250000002,15331.443750000008,21110.968500000003,26228.610000000015,31414.36575000004,36166.784250000055,41437.22475000005,47471.791500000036,55498.55100000001,64714.75500000002,74154.64050000007,83962.1340000001,93786.26850000015,103430.76375000019,113042.30775000021,122854.93650000021,132526.9755000002,143070.34875000027,153781.66950000025,163605.99525000015,174046.30275000018,184114.32450000016,194423.4480000002,205244.76600000032
167.0,7939.112250000002,15331.443750000008,21110.968500000003,26228.610000000015,31414.36575000004,36166.784250000055,41437.22475000005,47471.791500000036,55498.55100000001,64714.75500000002,74154.64050000007,83962.1340000001,93786.26850000015,103430.76375000019,113042.30775000021,122854.93650000021,132526.9755000002,143070.34875000027,153781.66950000025,163605.99525000015,174046.30275000018,184114.32450000016,194423.4480000002,205244.76600000032
168.0,95187.27574999999,175307.89049999995,244155.30774999998,304810.98625,360379.264,411171.3352500001,464190.91975000006,525128.9005000001,600059.7795000002,689925.916,793035.024,900746.45475,1006820.2929999998,1110348.2374999996,1216653.0219999994,1324291.2017499993,1432586.8769999996,1541859.31175,1651340.82225,1758542.6572499997,1862120.0735,1962627.8605,2058091.3894999998,2146439.79075
169.0,95187.27574999999,175307.89049999995,244155.30774999998,304810.98625,360379.264,411171.3352500001,464190.91975000006,525128.9005000001,600059.7795000002,689925.916,793035.024,900746.45475,1006820.2929999998,1110348.2374999996,1216653.0219999994,1324291.2017499993,1432586.8769999996,1541859.31175,1651340.82225,1758542.6572499997,1862120.0735,1962627.8605,2058091.3894999998,2146439.79075
170.0,285561.82725,525923.6714999998,732465.92325,914432.95875,1081137.7920000001,1233514.0057500005,1392572.7592500001,1575386.7015000004,1800179.3385000005,2069777.748,2379105.0719999997,2702239.36425,3020460.8789999997,3331044.7124999985,3649959.0659999982,3972873.605249998,4297760.630999999,4625577.93525,4954022.46675,5275627.971749999,5586360.2205,5887883.581499999,6174274.1685,6439319.37225
171.0,285561.82725,525923.6714999998,732465.92325,914432.95875,1081137.7920000001,1233514.0057500005,1392572.7592500001,1575386.7015000004,1800179.3385000005,2069777.748,2379105.0719999997,2702239.36425,3020460.8789999997,3331044.7124999985,3649959.0659999982,3972873.605249998,4297760.630999999,4625577.93525,4954022.46675,5275627.971749999,5586360.2205,5887883.581499999,6174274.1685,6439319.37225
172.0,13253.9175,25124.496749999995,34891.23174999998,42884.759999999966,49929.62174999998,55871.90049999997,61316.00574999996,67511.08275000002,74813.94075000005,83851.01825000007,94341.75575000007,104544.41325000009,114400.48825000011,123918.0475000001,134167.13000000003,143900.1950000001,154147.8825000002,163940.29250000016,174348.08000000005,185421.51000000007,197398.5125000001,209445.18000000014,221776.01750000022,233496.15250000023
173.0,13253.9175,25124.496749999995,34891.23174999998,42884.759999999966,49929.62174999998,55871.90049999997,61316.00574999996,67511.08275000002,74813.94075000005,83851.01825000007,94341.75575000007,104544.41325000009,114400.48825000011,123918.0475000001,134167.13000000003,143900.1950000001,154147.8825000002,163940.29250000016,174348.08000000005,185421.51000000007,197398.5125000001,209445.18000000014,221776.01750000022,233496.15250000023
174.0,39761.7525,75373.49024999999,104673.69524999993,128654.2799999999,149788.86524999992,167615.7014999999,183948.0172499999,202533.24825000006,224441.82225000014,251553.05475000018,283025.2672500002,313633.23975000024,343201.46475000033,371754.1425000003,402501.39000000013,431700.5850000003,462443.64750000066,491820.87750000047,523044.2400000001,556264.5300000003,592195.5375000003,628335.5400000004,665328.0525000007,700488.4575000007
175.0,39761.7525,75373.49024999999,104673.69524999993,128654.2799999999,149788.86524999992,167615.7014999999,183948.0172499999,202533.24825000006,224441.82225000014,251553.05475000018,283025.2672500002,313633.23975000024,343201.46475000033,371754.1425000003,402501.39000000013,431700.5850000003,462443.64750000066,491820.87750000047,523044.2400000001,556264.5300000003,592195.5375000003,628335.5400000004,665328.0525000007,700488.4575000007
176.0,3568.5117499999988,6695.579499999999,9170.3705,11540.862500000003,13626.382500000003,15557.577249999997,17546.163249999994,19927.1965,22828.51274999999,26020.271999999986,29621.426999999992,33280.681,36859.359500000006,40425.81775000002,44453.82649999999,48523.821250000015,52274.68075,56355.58525000001,60462.9195,64688.05399999999,68661.33774999999,72915.40575,76781.80849999997,80691.70099999996
177.0,3568.5117499999988,6695.579499999999,9170.3705,11540.862500000003,13626.382500000003,15557.577249999997,17546.163249999994,19927.1965,22828.51274999999,26020.271999999986,29621.426999999992,33280.681,36859.359500000006,40425.81775000002,44453.82649999999,48523.821250000015,52274.68075,56355.58525000001,60462.9195,64688.05399999999,68661.33774999999,72915.40575,76781.80849999997,80691.70099999996
178.0,10705.535249999997,20086.738499999996,27511.111500000003,34622.58750000001,40879.14750000001,46672.73174999999,52638.48974999998,59781.589499999995,68485.53824999997,78060.81599999996,88864.28099999997,99842.04299999999,110578.07850000002,121277.45325000005,133361.47949999996,145571.46375000005,156824.04225,169066.75575000004,181388.7585,194064.16199999995,205984.01324999996,218746.21725000002,230345.4254999999,242075.1029999999
179.0,10705.535249999997,20086.738499999996,27511.111500000003,34622.58750000001,40879.14750000001,46672.73174999999,52638.48974999998,59781.589499999995,68485.53824999997,78060.81599999996,88864.28099999997,99842.04299999999,110578.07850000002,121277.45325000005,133361.47949999996,145571.46375000005,156824.04225,169066.75575000004,181388.7585,194064.16199999995,205984.01324999996,218746.21725000002,230345.4254999999,242075.1029999999
180.0,1602.2883500000003,2927.4249749999994,4150.72325,5100.200175000001,6083.197625000001,7015.191125,8030.221624999998,9221.823574999997,10641.147824999996,12695.417824999997,15186.188074999998,18087.697074999993,20851.869824999983,23164.14182499998,25492.13982499998,27780.962574999965,30128.589599999978,32299.820699999982,34527.32919999998,36525.04719999997,38320.221999999965,40230.77794999997,41997.38447499997,43638.952124999974
181.0,1602.2883500000003,2927.4249749999994,4150.72325,5100.200175000001,6083.197625000001,7015.191125,8030.221624999998,9221.823574999997,10641.147824999996,12695.417824999997,15186.188074999998,18087.697074999993,20851.869824999983,23164.14182499998,25492.13982499998,27780.962574999965,30128.589599999978,32299.820699999982,34527.32919999998,36525.04719999997,38320.221999999965,40230.77794999997,41997.38447499997,43638.952124999974
182.0,4806.86505,8782.274924999998,12452.169750000001,15300.600525000002,18249.592875000002,21045.573375,24090.664874999995,27665.470724999992,31923.44347499999,38086.25347499999,45558.564224999995,54263.09122499998,62555.60947499995,69492.42547499994,76476.41947499994,83342.88772499989,90385.76879999993,96899.46209999995,103581.98759999993,109575.14159999992,114960.6659999999,120692.33384999991,125992.15342499991,130916.85637499992
183.0,4806.86505,8782.274924999998,12452.169750000001,15300.600525000002,18249.592875000002,21045.573375,24090.664874999995,27665.470724999992,31923.44347499999,38086.25347499999,45558.564224999995,54263.09122499998,62555.60947499995,69492.42547499994,76476.41947499994,83342.88772499989,90385.76879999993,96899.46209999995,103581.98759999993,109575.14159999992,114960.6659999999,120692.33384999991,125992.15342499991,130916.85637499992
184.0,105628.20749999999,196039.6425,272136.1124999999,338968.41249999986,400027.9424999998,456199.3374999998,513379.4149999998,579807.6299999999,661130.6974999999,760716.0974999999,872832.8849999998,990449.3849999998,1107800.9574999996,1221654.8524999996,1338551.6674999995,1456187.3649999995,1573947.6874999998,1693876.9499999995,1814651.1749999996,1931425.4349999998,2048250.8,2160654.9824999995,2267685.3375,2368192.59
185.0,105628.20749999999,196039.6425,272136.1124999999,338968.41249999986,400027.9424999998,456199.3374999998,513379.4149999998,579807.6299999999,661130.6974999999,760716.0974999999,872832.8849999998,990449.3849999998,1107800.9574999996,1221654.8524999996,1338551.6674999995,1456187.3649999995,1573947.6874999998,1693876.9499999995,1814651.1749999996,1931425.4349999998,2048250.8,2160654.9824999995,2267685.3375,2368192.59
186.0,316884.62249999994,588118.9275,816408.3374999997,1016905.2374999996,1200083.8274999992,1368598.0124999993,1540138.2449999994,1739422.8899999997,1983392.0924999998,2282148.2924999995,2618498.6549999993,2971348.1549999993,3323402.8724999987,3664964.5574999987,4015655.0024999985,4368562.094999999,4721843.062499999,5081630.849999999,5443953.5249999985,5794276.305,6144752.4,6481964.947499998,6803056.012499999,7104577.77
187.0,316884.62249999994,588118.9275,816408.3374999997,1016905.2374999996,1200083.8274999992,1368598.0124999993,1540138.2449999994,1739422.8899999997,1983392.0924999998,2282148.2924999995,2618498.6549999993,2971348.1549999993,3323402.8724999987,3664964.5574999987,4015655.0024999985,4368562.094999999,4721843.062499999,5081630.849999999,5443953.5249999985,5794276.305,6144752.4,6481964.947499998,6803056.012499999,7104577.77
188.0,2577.44275,4792.908000000003,6687.904750000003,8237.151000000005,9718.851500000006,11183.941250000007,12814.018750000007,14571.792750000002,16920.672750000005,19735.969750000004,22791.433250000002,26212.042500000007,29590.625750000014,32900.79250000001,36522.37650000001,39997.38275000002,43568.31925000002,47453.839500000024,51063.70925,54854.684249999984,58613.17399999997,62140.52549999999,65550.35699999997,68637.36275
189.0,2577.44275,4792.908000000003,6687.904750000003,8237.151000000005,9718.851500000006,11183.941250000007,12814.018750000007,14571.792750000002,16920.672750000005,19735.969750000004,22791.433250000002,26212.042500000007,29590.625750000014,32900.79250000001,36522.37650000001,39997.38275000002,43568.31925000002,47453.839500000024,51063.70925,54854.684249999984,58613.17399999997,62140.52549999999,65550.35699999997,68637.36275
190.0,7732.3282500000005,14378.72400000001,20063.71425000001,24711.453000000016,29156.55450000002,33551.823750000025,38442.05625000002,43715.37825000001,50762.018250000016,59207.90925000001,68374.29975,78636.12750000002,88771.87725000005,98702.37750000003,109567.12950000004,119992.14825000006,130704.95775000006,142361.51850000006,153191.12774999999,164564.05274999994,175839.5219999999,186421.57649999997,196651.07099999994,205912.08825
191.0,7732.3282500000005,14378.72400000001,20063.71425000001,24711.453000000016,29156.55450000002,33551.823750000025,38442.05625000002,43715.37825000001,50762.018250000016,59207.90925000001,68374.29975,78636.12750000002,88771.87725000005,98702.37750000003,109567.12950000004,119992.14825000006,130704.95775000006,142361.51850000006,153191.12774999999,164564.05274999994,175839.5219999999,186421.57649999997,196651.07099999994,205912.08825
192.0,869.352025,1598.20675,2222.945099999999,2846.3850999999995,3417.6274750000002,3968.3177250000012,4557.08705,5273.443525,6125.0479000000005,7633.652250000001,9032.8324,10508.267150000001,11783.757150000005,12836.64455,13995.954800000001,15147.039149999997,16459.897599999993,17879.983099999987,19186.28754999998,20270.39417499998,21396.168074999983,22524.691099999985,23552.45265,24477.199625
193.0,869.352025,1598.20675,2222.945099999999,2846.3850999999995,3417.6274750000002,3968.3177250000012,4557.08705,5273.443525,6125.0479000000005,7633.652250000001,9032.8324,10508.267150000001,11783.757150000005,12836.64455,13995.954800000001,15147.039149999997,16459.897599999993,17879.983099999987,19186.28754999998,20270.39417499998,21396.168074999983,22524.691099999985,23552.45265,24477.199625
194.0,2608.056075,4794.62025,6668.835299999997,8539.155299999999,10252.882425,11904.953175000004,13671.26115,15820.330575,18375.1437,22900.956750000005,27098.497199999998,31524.801450000006,35351.271450000015,38509.933650000006,41987.864400000006,45441.11744999999,49379.692799999975,53639.949299999964,57558.86264999994,60811.18252499994,64188.50422499995,67574.07329999996,70657.35795,73431.598875
195.0,2608.056075,4794.62025,6668.835299999997,8539.155299999999,10252.882425,11904.953175000004,13671.26115,15820.330575,18375.1437,22900.956750000005,27098.497199999998,31524.801450000006,35351.271450000015,38509.933650000006,41987.864400000006,45441.11744999999,49379.692799999975,53639.949299999964,57558.86264999994,60811.18252499994,64188.50422499995,67574.07329999996,70657.35795,73431.598875
196.0,1020.4359999999999,2042.5167999999994,2880.8351499999994,3635.8680249999984,4328.171849999999,4942.606724999999,5652.448275,6558.4141500000005,7730.3474,9212.895149999998,10692.305899999998,12312.1339,13915.41865,15350.8194,16869.716475,18279.028225000002,19869.625350000006,21295.552850000004,22757.254675,24338.359425000006,25809.901425000015,27288.505675000015,28530.515175000022,29682.40917500002
197.0,1020.4359999999999,2042.5167999999994,2880.8351499999994,3635.8680249999984,4328.171849999999,4942.606724999999,5652.448275,6558.4141500000005,7730.3474,9212.895149999998,10692.305899999998,12312.1339,13915.41865,15350.8194,16869.716475,18279.028225000002,19869.625350000006,21295.552850000004,22757.254675,24338.359425000006,25809.901425000015,27288.505675000015,28530.515175000022,29682.40917500002
198.0,3061.308,6127.550399999998,8642.505449999999,10907.604074999996,12984.515549999996,14827.820174999997,16957.344825,19675.24245,23191.0422,27638.685449999997,32076.91769999999,36936.4017,41746.25595,46052.4582,50609.149425,54837.084675000006,59608.87605000002,63886.65855000001,68271.764025,73015.07827500002,77429.70427500004,81865.51702500004,85591.54552500007,89047.22752500005
199.0,3061.308,6127.550399999998,8642.505449999999,10907.604074999996,12984.515549999996,14827.820174999997,16957.344825,19675.24245,23191.0422,27638.685449999997,32076.91769999999,36936.4017,41746.25595,46052.4582,50609.149425,54837.084675000006,59608.87605000002,63886.65855000001,68271.764025,73015.07827500002,77429.70427500004,81865.51702500004,85591.54552500007,89047.22752500005
200.0,1802.5657500000002,3184.046375,4322.542325,5347.770124999998,6275.0281249999925,7217.231174999991,8140.354574999989,9480.554699999984,10836.872699999985,12810.249374999987,15311.465874999989,17880.940874999975,20423.79612499997,22608.049624999967,25121.26562499996,27973.56287499995,30583.080124999942,33507.00012499994,36607.077124999945,39537.866424999935,42355.12019999992,44758.923349999895,47260.5230999999,49258.10162499991
201.0,1802.5657500000002,3184.046375,4322.542325,5347.770124999998,6275.0281249999925,7217.231174999991,8140.354574999989,9480.554699999984,10836.872699999985,12810.249374999987,15311.465874999989,17880.940874999975,20423.79612499997,22608.049624999967,25121.26562499996,27973.56287499995,30583.080124999942,33507.00012499994,36607.077124999945,39537.866424999935,42355.12019999992,44758.923349999895,47260.5230999999,49258.10162499991
202.0,5407.697250000001,9552.139125,12967.626975000001,16043.310374999994,18825.084374999977,21651.693524999973,24421.063724999967,28441.66409999995,32510.618099999956,38430.74812499996,45934.39762499997,53642.82262499993,61271.388374999915,67824.1488749999,75363.79687499988,83920.68862499985,91749.24037499982,100521.00037499983,109821.23137499983,118613.59927499981,127065.36059999975,134276.7700499997,141781.56929999968,147774.30487499974
203.0,5407.697250000001,9552.139125,12967.626975000001,16043.310374999994,18825.084374999977,21651.693524999973,24421.063724999967,28441.66409999995,32510.618099999956,38430.74812499996,45934.39762499997,53642.82262499993,61271.388374999915,67824.1488749999,75363.79687499988,83920.68862499985,91749.24037499982,100521.00037499983,109821.23137499983,118613.59927499981,127065.36059999975,134276.7700499997,141781.56929999968,147774.30487499974
204.0,2389.029750000001,4390.045250000001,6256.48725,7843.7127500000015,9370.607250000005,10789.220500000003,12309.063250000001,14098.445000000002,16337.63125,19007.29775,22003.750250000016,25228.38575000002,28351.877000000022,31437.44025000003,34512.176750000035,37786.64275000002,40902.13650000003,44379.69475000003,47637.04725000004,50742.10550000002,53932.408999999985,56995.7435,59826.42649999998,62269.69499999998
205.0,2389.029750000001,4390.045250000001,6256.48725,7843.7127500000015,9370.607250000005,10789.220500000003,12309.063250000001,14098.445000000002,16337.63125,19007.29775,22003.750250000016,25228.38575000002,28351.877000000022,31437.44025000003,34512.176750000035,37786.64275000002,40902.13650000003,44379.69475000003,47637.04725000004,50742.10550000002,53932.408999999985,56995.7435,59826.42649999998,62269.69499999998
206.0,7167.089250000003,13170.135750000003,18769.461750000002,23531.138250000004,28111.821750000014,32367.66150000001,36927.189750000005,42295.33500000001,49012.89375,57021.89325000001,66011.25075000005,75685.15725000006,85055.63100000007,94312.32075000009,103536.5302500001,113359.92825000006,122706.4095000001,133139.0842500001,142911.14175000013,152226.31650000007,161797.22699999996,170987.2305,179479.27949999995,186809.08499999993
207.0,7167.089250000003,13170.135750000003,18769.461750000002,23531.138250000004,28111.821750000014,32367.66150000001,36927.189750000005,42295.33500000001,49012.89375,57021.89325000001,66011.25075000005,75685.15725000006,85055.63100000007,94312.32075000009,103536.5302500001,113359.92825000006,122706.4095000001,133139.0842500001,142911.14175000013,152226.31650000007,161797.22699999996,170987.2305,179479.27949999995,186809.08499999993
