0.0,0.0,1.0,2.0,3.0,4.0,5.0,6.0,7.0,8.0,9.0,10.0,11.0,12.0,13.0,14.0,15.0,16.0,17.0,18.0,19.0,20.0,21.0,22.0,23.0
0.0,568.0,568.0,568.0,569.0,569.0,569.0,569.0,570.0,570.0,571.0,572.0,572.0,573.0,573.0,574.0,575.0,575.0,576.0,576.0,577.0,578.0,578.0,578.0,1.0
1.0,568.0,568.0,568.0,569.0,569.0,569.0,569.0,570.0,570.0,571.0,572.0,572.0,573.0,573.0,574.0,575.0,575.0,576.0,576.0,577.0,578.0,578.0,578.0,1.0
2.0,1703.0,1703.0,1704.0,1705.0,1705.0,1706.0,1707.0,1708.0,1710.0,1712.0,1714.0,1716.0,1718.0,1719.0,1721.0,1723.0,1725.0,1727.0,1728.0,1730.0,1732.0,1733.0,1734.0,1.0
3.0,1703.0,1703.0,1704.0,1705.0,1705.0,1706.0,1707.0,1708.0,1710.0,1712.0,1714.0,1716.0,1718.0,1719.0,1721.0,1723.0,1725.0,1727.0,1728.0,1730.0,1732.0,1733.0,1734.0,1.0
4.0,288.0,288.0,288.0,288.0,289.0,289.0,289.0,289.0,289.0,290.0,290.0,290.0,290.0,291.0,291.0,291.0,292.0,292.0,292.0,292.0,293.0,293.0,293.0,1.0
5.0,288.0,288.0,288.0,288.0,289.0,289.0,289.0,289.0,289.0,290.0,290.0,290.0,290.0,291.0,291.0,291.0,292.0,292.0,292.0,292.0,293.0,293.0,293.0,1.0
6.0,863.0,864.0,864.0,864.0,865.0,865.0,866.0,867.0,867.0,868.0,869.0,870.0,870.0,871.0,872.0,873.0,874.0,875.0,875.0,876.0,877.0,877.0,878.0,1.0
7.0,863.0,864.0,864.0,864.0,865.0,865.0,866.0,867.0,867.0,868.0,869.0,870.0,870.0,871.0,872.0,873.0,874.0,875.0,875.0,876.0,877.0,877.0,878.0,1.0
8.0,2160.0,2161.0,2162.0,2162.0,2163.0,2164.0,2165.0,2166.0,2168.0,2171.0,2173.0,2175.0,2178.0,2180.0,2183.0,2185.0,2187.0,2189.0,2191.0,2192.0,2194.0,2195.0,2196.0,1.0
9.0,2160.0,2161.0,2162.0,2162.0,2163.0,2164.0,2165.0,2166.0,2168.0,2171.0,2173.0,2175.0,2178.0,2180.0,2183.0,2185.0,2187.0,2189.0,2191.0,2192.0,2194.0,2195.0,2196.0,1.0
10.0,6480.0,6482.0,6485.0,6486.0,6488.0,6490.0,6493.0,6498.0,6504.0,6511.0,6518.0,6525.0,6533.0,6540.0,6547.0,6554.0,6561.0,6567.0,6572.0,6576.0,6580.0,6584.0,6588.0,1.0
11.0,6480.0,6482.0,6485.0,6486.0,6488.0,6490.0,6493.0,6498.0,6504.0,6511.0,6518.0,6525.0,6533.0,6540.0,6547.0,6554.0,6561.0,6567.0,6572.0,6576.0,6580.0,6584.0,6588.0,1.0
12.0,526.0,527.0,527.0,527.0,527.0,528.0,528.0,528.0,529.0,529.0,530.0,530.0,531.0,531.0,532.0,532.0,533.0,533.0,534.0,534.0,535.0,535.0,535.0,1.0
13.0,526.0,527.0,527.0,527.0,527.0,528.0,528.0,528.0,529.0,529.0,530.0,530.0,531.0,531.0,532.0,532.0,533.0,533.0,534.0,534.0,535.0,535.0,535.0,1.0
14.0,1578.0,1579.0,1580.0,1580.0,1581.0,1582.0,1583.0,1584.0,1585.0,1587.0,1588.0,1590.0,1591.0,1593.0,1594.0,1596.0,1597.0,1599.0,1600.0,1602.0,1603.0,1604.0,1605.0,1.0
15.0,1578.0,1579.0,1580.0,1580.0,1581.0,1582.0,1583.0,1584.0,1585.0,1587.0,1588.0,1590.0,1591.0,1593.0,1594.0,1596.0,1597.0,1599.0,1600.0,1602.0,1603.0,1604.0,1605.0,1.0
16.0,301.0,302.0,302.0,302.0,302.0,302.0,302.0,303.0,303.0,303.0,304.0,304.0,304.0,305.0,305.0,305.0,306.0,306.0,306.0,306.0,307.0,307.0,307.0,1.0
17.0,301.0,302.0,302.0,302.0,302.0,302.0,302.0,303.0,303.0,303.0,304.0,304.0,304.0,305.0,305.0,305.0,306.0,306.0,306.0,306.0,307.0,307.0,307.0,1.0
18.0,903.0,904.0,904.0,904.0,905.0,905.0,906.0,907.0,908.0,909.0,910.0,911.0,912.0,913.0,914.0,915.0,916.0,917.0,918.0,918.0,919.0,920.0,921.0,1.0
19.0,903.0,904.0,904.0,904.0,905.0,905.0,906.0,907.0,908.0,909.0,910.0,911.0,912.0,913.0,914.0,915.0,916.0,917.0,918.0,918.0,919.0,920.0,921.0,1.0
20.0,403.0,403.0,404.0,404.0,404.0,404.0,404.0,405.0,405.0,406.0,406.0,406.0,407.0,407.0,408.0,408.0,408.0,409.0,409.0,409.0,410.0,410.0,410.0,1.0
21.0,403.0,403.0,404.0,404.0,404.0,404.0,404.0,405.0,405.0,406.0,406.0,406.0,407.0,407.0,408.0,408.0,408.0,409.0,409.0,409.0,410.0,410.0,410.0,1.0
22.0,1208.0,1209.0,1210.0,1210.0,1211.0,1211.0,1212.0,1214.0,1215.0,1216.0,1217.0,1218.0,1219.0,1220.0,1222.0,1223.0,1224.0,1225.0,1226.0,1227.0,1228.0,1229.0,1230.0,1.0
23.0,1208.0,1209.0,1210.0,1210.0,1211.0,1211.0,1212.0,1214.0,1215.0,1216.0,1217.0,1218.0,1219.0,1220.0,1222.0,1223.0,1224.0,1225.0,1226.0,1227.0,1228.0,1229.0,1230.0,1.0
24.0,267.0,267.0,267.0,268.0,268.0,268.0,268.0,268.0,268.0,269.0,269.0,269.0,269.0,270.0,270.0,270.0,271.0,271.0,271.0,271.0,272.0,272.0,272.0,1.0
25.0,267.0,267.0,267.0,268.0,268.0,268.0,268.0,268.0,268.0,269.0,269.0,269.0,269.0,270.0,270.0,270.0,271.0,271.0,271.0,271.0,272.0,272.0,272.0,1.0
26.0,801.0,801.0,801.0,802.0,802.0,802.0,803.0,804.0,804.0,805.0,806.0,807.0,807.0,808.0,809.0,810.0,811.0,811.0,812.0,813.0,814.0,814.0,815.0,1.0
27.0,801.0,801.0,801.0,802.0,802.0,802.0,803.0,804.0,804.0,805.0,806.0,807.0,807.0,808.0,809.0,810.0,811.0,811.0,812.0,813.0,814.0,814.0,815.0,1.0
28.0,9704.0,9709.0,9713.0,9717.0,9720.0,9725.0,9732.0,9740.0,9748.0,9757.0,9766.0,9775.0,9784.0,9793.0,9802.0,9811.0,9820.0,9829.0,9838.0,9846.0,9854.0,9862.0,9869.0,1.0
29.0,9704.0,9709.0,9713.0,9717.0,9720.0,9725.0,9732.0,9740.0,9748.0,9757.0,9766.0,9775.0,9784.0,9793.0,9802.0,9811.0,9820.0,9829.0,9838.0,9846.0,9854.0,9862.0,9869.0,1.0
30.0,29112.0,29125.0,29138.0,29149.0,29160.0,29174.0,29194.0,29218.0,29243.0,29270.0,29296.0,29323.0,29350.0,29378.0,29405.0,29432.0,29460.0,29487.0,29513.0,29538.0,29561.0,29584.0,29605.0,1.0
31.0,29112.0,29125.0,29138.0,29149.0,29160.0,29174.0,29194.0,29218.0,29243.0,29270.0,29296.0,29323.0,29350.0,29378.0,29405.0,29432.0,29460.0,29487.0,29513.0,29538.0,29561.0,29584.0,29605.0,1.0
32.0,269.0,269.0,269.0,269.0,269.0,269.0,270.0,270.0,270.0,270.0,271.0,271.0,271.0,271.0,271.0,272.0,272.0,272.0,272.0,273.0,273.0,273.0,273.0,1.0
33.0,269.0,269.0,269.0,269.0,269.0,269.0,270.0,270.0,270.0,270.0,271.0,271.0,271.0,271.0,271.0,272.0,272.0,272.0,272.0,273.0,273.0,273.0,273.0,1.0
34.0,805.0,806.0,806.0,806.0,807.0,807.0,808.0,809.0,809.0,810.0,811.0,811.0,812.0,813.0,813.0,814.0,815.0,816.0,816.0,817.0,818.0,819.0,819.0,1.0
35.0,805.0,806.0,806.0,806.0,807.0,807.0,808.0,809.0,809.0,810.0,811.0,811.0,812.0,813.0,813.0,814.0,815.0,816.0,816.0,817.0,818.0,819.0,819.0,1.0
36.0,160.0,161.0,161.0,161.0,161.0,161.0,161.0,161.0,161.0,161.0,162.0,162.0,162.0,162.0,162.0,162.0,163.0,163.0,163.0,163.0,163.0,163.0,163.0,1.0
37.0,160.0,161.0,161.0,161.0,161.0,161.0,161.0,161.0,161.0,161.0,162.0,162.0,162.0,162.0,162.0,162.0,163.0,163.0,163.0,163.0,163.0,163.0,163.0,1.0
38.0,480.0,481.0,481.0,481.0,481.0,481.0,482.0,482.0,483.0,483.0,484.0,484.0,485.0,485.0,486.0,486.0,487.0,487.0,488.0,488.0,489.0,489.0,489.0,1.0
39.0,480.0,481.0,481.0,481.0,481.0,481.0,482.0,482.0,483.0,483.0,484.0,484.0,485.0,485.0,486.0,486.0,487.0,487.0,488.0,488.0,489.0,489.0,489.0,1.0
40.0,373.0,373.0,373.0,373.0,374.0,374.0,374.0,374.0,375.0,375.0,375.0,376.0,376.0,377.0,377.0,377.0,378.0,378.0,378.0,379.0,379.0,379.0,380.0,1.0
41.0,373.0,373.0,373.0,373.0,374.0,374.0,374.0,374.0,375.0,375.0,375.0,376.0,376.0,377.0,377.0,377.0,378.0,378.0,378.0,379.0,379.0,379.0,380.0,1.0
42.0,1118.0,1118.0,1119.0,1119.0,1120.0,1120.0,1121.0,1122.0,1123.0,1124.0,1125.0,1126.0,1127.0,1129.0,1130.0,1131.0,1132.0,1133.0,1134.0,1135.0,1136.0,1137.0,1138.0,1.0
43.0,1118.0,1118.0,1119.0,1119.0,1120.0,1120.0,1121.0,1122.0,1123.0,1124.0,1125.0,1126.0,1127.0,1129.0,1130.0,1131.0,1132.0,1133.0,1134.0,1135.0,1136.0,1137.0,1138.0,1.0
44.0,343.0,344.0,344.0,344.0,344.0,344.0,344.0,345.0,345.0,345.0,346.0,346.0,346.0,347.0,347.0,347.0,348.0,348.0,349.0,349.0,349.0,349.0,350.0,1.0
45.0,343.0,344.0,344.0,344.0,344.0,344.0,344.0,345.0,345.0,345.0,346.0,346.0,346.0,347.0,347.0,347.0,348.0,348.0,349.0,349.0,349.0,349.0,350.0,1.0
46.0,1029.0,1030.0,1030.0,1030.0,1031.0,1031.0,1032.0,1033.0,1034.0,1035.0,1036.0,1037.0,1038.0,1039.0,1040.0,1041.0,1043.0,1044.0,1045.0,1045.0,1046.0,1047.0,1048.0,1.0
47.0,1029.0,1030.0,1030.0,1030.0,1031.0,1031.0,1032.0,1033.0,1034.0,1035.0,1036.0,1037.0,1038.0,1039.0,1040.0,1041.0,1043.0,1044.0,1045.0,1045.0,1046.0,1047.0,1048.0,1.0
48.0,294.0,294.0,294.0,294.0,294.0,294.0,295.0,295.0,295.0,296.0,296.0,296.0,297.0,297.0,297.0,298.0,298.0,298.0,298.0,299.0,299.0,299.0,299.0,1.0
49.0,294.0,294.0,294.0,294.0,294.0,294.0,295.0,295.0,295.0,296.0,296.0,296.0,297.0,297.0,297.0,298.0,298.0,298.0,298.0,299.0,299.0,299.0,299.0,1.0
50.0,880.0,881.0,881.0,881.0,882.0,882.0,883.0,884.0,885.0,886.0,886.0,887.0,889.0,889.0,891.0,892.0,892.0,893.0,894.0,895.0,896.0,896.0,897.0,1.0
51.0,880.0,881.0,881.0,881.0,882.0,882.0,883.0,884.0,885.0,886.0,886.0,887.0,889.0,889.0,891.0,892.0,892.0,893.0,894.0,895.0,896.0,896.0,897.0,1.0
52.0,320.0,320.0,320.0,320.0,320.0,321.0,321.0,321.0,322.0,322.0,322.0,322.0,323.0,323.0,323.0,324.0,324.0,324.0,325.0,325.0,325.0,326.0,326.0,1.0
53.0,320.0,320.0,320.0,320.0,320.0,321.0,321.0,321.0,322.0,322.0,322.0,322.0,323.0,323.0,323.0,324.0,324.0,324.0,325.0,325.0,325.0,326.0,326.0,1.0
54.0,959.0,959.0,959.0,960.0,960.0,961.0,962.0,963.0,964.0,964.0,965.0,966.0,967.0,968.0,969.0,970.0,971.0,972.0,973.0,974.0,975.0,976.0,976.0,1.0
55.0,959.0,959.0,959.0,960.0,960.0,961.0,962.0,963.0,964.0,964.0,965.0,966.0,967.0,968.0,969.0,970.0,971.0,972.0,973.0,974.0,975.0,976.0,976.0,1.0
56.0,664.0,664.0,664.0,665.0,665.0,665.0,666.0,666.0,667.0,667.0,668.0,669.0,669.0,670.0,670.0,671.0,672.0,672.0,673.0,673.0,674.0,674.0,675.0,1.0
57.0,664.0,664.0,664.0,665.0,665.0,665.0,666.0,666.0,667.0,667.0,668.0,669.0,669.0,670.0,670.0,671.0,672.0,672.0,673.0,673.0,674.0,674.0,675.0,1.0
58.0,1991.0,1991.0,1992.0,1993.0,1994.0,1995.0,1996.0,1997.0,1999.0,2001.0,2003.0,2005.0,2007.0,2009.0,2010.0,2012.0,2014.0,2016.0,2017.0,2019.0,2020.0,2021.0,2023.0,1.0
59.0,1991.0,1991.0,1992.0,1993.0,1994.0,1995.0,1996.0,1997.0,1999.0,2001.0,2003.0,2005.0,2007.0,2009.0,2010.0,2012.0,2014.0,2016.0,2017.0,2019.0,2020.0,2021.0,2023.0,1.0
60.0,300.0,300.0,300.0,300.0,300.0,301.0,301.0,301.0,301.0,302.0,302.0,302.0,303.0,303.0,303.0,304.0,304.0,304.0,304.0,305.0,305.0,305.0,305.0,1.0
61.0,300.0,300.0,300.0,300.0,300.0,301.0,301.0,301.0,301.0,302.0,302.0,302.0,303.0,303.0,303.0,304.0,304.0,304.0,304.0,305.0,305.0,305.0,305.0,1.0
62.0,899.0,899.0,900.0,900.0,900.0,901.0,901.0,902.0,903.0,904.0,905.0,906.0,907.0,908.0,909.0,910.0,911.0,911.0,912.0,913.0,914.0,915.0,915.0,1.0
63.0,899.0,899.0,900.0,900.0,900.0,901.0,901.0,902.0,903.0,904.0,905.0,906.0,907.0,908.0,909.0,910.0,911.0,911.0,912.0,913.0,914.0,915.0,915.0,1.0
64.0,175.0,175.0,176.0,176.0,176.0,176.0,176.0,176.0,176.0,176.0,177.0,177.0,177.0,177.0,177.0,177.0,178.0,178.0,178.0,178.0,178.0,178.0,179.0,1.0
65.0,175.0,175.0,176.0,176.0,176.0,176.0,176.0,176.0,176.0,176.0,177.0,177.0,177.0,177.0,177.0,177.0,178.0,178.0,178.0,178.0,178.0,178.0,179.0,1.0
66.0,525.0,525.0,526.0,526.0,526.0,526.0,527.0,527.0,528.0,528.0,529.0,529.0,530.0,530.0,531.0,531.0,532.0,532.0,533.0,533.0,534.0,534.0,535.0,1.0
67.0,525.0,525.0,526.0,526.0,526.0,526.0,527.0,527.0,528.0,528.0,529.0,529.0,530.0,530.0,531.0,531.0,532.0,532.0,533.0,533.0,534.0,534.0,535.0,1.0
68.0,346.0,346.0,346.0,347.0,347.0,347.0,347.0,347.0,348.0,348.0,348.0,349.0,349.0,349.0,350.0,350.0,350.0,351.0,351.0,351.0,352.0,352.0,352.0,1.0
69.0,346.0,346.0,346.0,347.0,347.0,347.0,347.0,347.0,348.0,348.0,348.0,349.0,349.0,349.0,350.0,350.0,350.0,351.0,351.0,351.0,352.0,352.0,352.0,1.0
70.0,1037.0,1038.0,1038.0,1039.0,1039.0,1040.0,1040.0,1041.0,1042.0,1043.0,1044.0,1045.0,1046.0,1047.0,1048.0,1049.0,1050.0,1051.0,1052.0,1053.0,1054.0,1055.0,1056.0,1.0
71.0,1037.0,1038.0,1038.0,1039.0,1039.0,1040.0,1040.0,1041.0,1042.0,1043.0,1044.0,1045.0,1046.0,1047.0,1048.0,1049.0,1050.0,1051.0,1052.0,1053.0,1054.0,1055.0,1056.0,1.0
72.0,251.0,251.0,252.0,252.0,252.0,252.0,252.0,252.0,253.0,253.0,253.0,253.0,254.0,254.0,254.0,254.0,255.0,255.0,255.0,255.0,256.0,256.0,256.0,1.0
73.0,251.0,251.0,252.0,252.0,252.0,252.0,252.0,252.0,253.0,253.0,253.0,253.0,254.0,254.0,254.0,254.0,255.0,255.0,255.0,255.0,256.0,256.0,256.0,1.0
74.0,753.0,753.0,754.0,754.0,754.0,755.0,755.0,756.0,757.0,757.0,758.0,759.0,760.0,760.0,761.0,762.0,763.0,763.0,764.0,765.0,766.0,766.0,767.0,1.0
75.0,753.0,753.0,754.0,754.0,754.0,755.0,755.0,756.0,757.0,757.0,758.0,759.0,760.0,760.0,761.0,762.0,763.0,763.0,764.0,765.0,766.0,766.0,767.0,1.0
76.0,1356.0,1357.0,1358.0,1358.0,1358.0,1359.0,1360.0,1361.0,1362.0,1363.0,1365.0,1366.0,1367.0,1369.0,1370.0,1371.0,1372.0,1373.0,1374.0,1375.0,1376.0,1377.0,1378.0,1.0
77.0,1356.0,1357.0,1358.0,1358.0,1358.0,1359.0,1360.0,1361.0,1362.0,1363.0,1365.0,1366.0,1367.0,1369.0,1370.0,1371.0,1372.0,1373.0,1374.0,1375.0,1376.0,1377.0,1378.0,1.0
78.0,4068.0,4070.0,4072.0,4073.0,4074.0,4076.0,4078.0,4082.0,4085.0,4089.0,4093.0,4097.0,4101.0,4105.0,4109.0,4112.0,4116.0,4119.0,4122.0,4125.0,4128.0,4131.0,4134.0,1.0
79.0,4068.0,4070.0,4072.0,4073.0,4074.0,4076.0,4078.0,4082.0,4085.0,4089.0,4093.0,4097.0,4101.0,4105.0,4109.0,4112.0,4116.0,4119.0,4122.0,4125.0,4128.0,4131.0,4134.0,1.0
80.0,227.0,227.0,227.0,227.0,227.0,227.0,228.0,228.0,228.0,228.0,228.0,229.0,229.0,229.0,229.0,230.0,230.0,230.0,230.0,230.0,231.0,231.0,231.0,1.0
81.0,227.0,227.0,227.0,227.0,227.0,227.0,228.0,228.0,228.0,228.0,228.0,229.0,229.0,229.0,229.0,230.0,230.0,230.0,230.0,230.0,231.0,231.0,231.0,1.0
82.0,680.0,680.0,681.0,681.0,681.0,681.0,682.0,682.0,683.0,684.0,684.0,685.0,686.0,687.0,687.0,688.0,689.0,689.0,690.0,690.0,691.0,691.0,692.0,1.0
83.0,680.0,680.0,681.0,681.0,681.0,681.0,682.0,682.0,683.0,684.0,684.0,685.0,686.0,687.0,687.0,688.0,689.0,689.0,690.0,690.0,691.0,691.0,692.0,1.0
84.0,188.0,188.0,188.0,188.0,188.0,188.0,189.0,189.0,189.0,189.0,189.0,189.0,190.0,190.0,190.0,190.0,190.0,190.0,191.0,191.0,191.0,191.0,191.0,1.0
85.0,188.0,188.0,188.0,188.0,188.0,188.0,189.0,189.0,189.0,189.0,189.0,189.0,190.0,190.0,190.0,190.0,190.0,190.0,191.0,191.0,191.0,191.0,191.0,1.0
86.0,563.0,563.0,563.0,564.0,564.0,564.0,565.0,565.0,566.0,566.0,567.0,567.0,568.0,568.0,569.0,569.0,570.0,570.0,571.0,571.0,572.0,572.0,573.0,1.0
87.0,563.0,563.0,563.0,564.0,564.0,564.0,565.0,565.0,566.0,566.0,567.0,567.0,568.0,568.0,569.0,569.0,570.0,570.0,571.0,571.0,572.0,572.0,573.0,1.0
88.0,213.0,213.0,213.0,213.0,213.0,213.0,213.0,214.0,214.0,214.0,214.0,214.0,215.0,215.0,215.0,215.0,215.0,216.0,216.0,216.0,216.0,216.0,216.0,1.0
89.0,213.0,213.0,213.0,213.0,213.0,213.0,213.0,214.0,214.0,214.0,214.0,214.0,215.0,215.0,215.0,215.0,215.0,216.0,216.0,216.0,216.0,216.0,216.0,1.0
90.0,638.0,638.0,638.0,638.0,639.0,639.0,639.0,640.0,641.0,641.0,642.0,642.0,643.0,643.0,644.0,645.0,645.0,646.0,646.0,647.0,647.0,648.0,648.0,1.0
91.0,638.0,638.0,638.0,638.0,639.0,639.0,639.0,640.0,641.0,641.0,642.0,642.0,643.0,643.0,644.0,645.0,645.0,646.0,646.0,647.0,647.0,648.0,648.0,1.0
92.0,628.0,628.0,628.0,628.0,629.0,629.0,629.0,630.0,630.0,630.0,631.0,631.0,632.0,632.0,633.0,633.0,634.0,634.0,634.0,635.0,635.0,635.0,636.0,1.0
93.0,628.0,628.0,628.0,628.0,629.0,629.0,629.0,630.0,630.0,630.0,631.0,631.0,632.0,632.0,633.0,633.0,634.0,634.0,634.0,635.0,635.0,635.0,636.0,1.0
94.0,1883.0,1883.0,1884.0,1884.0,1885.0,1886.0,1886.0,1888.0,1889.0,1890.0,1892.0,1893.0,1894.0,1896.0,1897.0,1898.0,1900.0,1901.0,1902.0,1903.0,1904.0,1905.0,1906.0,1.0
95.0,1883.0,1883.0,1884.0,1884.0,1885.0,1886.0,1886.0,1888.0,1889.0,1890.0,1892.0,1893.0,1894.0,1896.0,1897.0,1898.0,1900.0,1901.0,1902.0,1903.0,1904.0,1905.0,1906.0,1.0
96.0,222.0,222.0,222.0,222.0,222.0,223.0,223.0,223.0,223.0,223.0,224.0,224.0,224.0,224.0,225.0,225.0,225.0,225.0,226.0,226.0,226.0,226.0,226.0,1.0
97.0,222.0,222.0,222.0,222.0,222.0,223.0,223.0,223.0,223.0,223.0,224.0,224.0,224.0,224.0,225.0,225.0,225.0,225.0,226.0,226.0,226.0,226.0,226.0,1.0
98.0,665.0,666.0,666.0,666.0,666.0,667.0,667.0,668.0,669.0,669.0,670.0,671.0,672.0,672.0,673.0,674.0,675.0,675.0,676.0,677.0,677.0,678.0,678.0,1.0
99.0,665.0,666.0,666.0,666.0,666.0,667.0,667.0,668.0,669.0,669.0,670.0,671.0,672.0,672.0,673.0,674.0,675.0,675.0,676.0,677.0,677.0,678.0,678.0,1.0
100.0,773.0,774.0,774.0,774.0,775.0,775.0,776.0,777.0,777.0,778.0,779.0,780.0,780.0,781.0,782.0,783.0,784.0,784.0,785.0,786.0,787.0,787.0,788.0,1.0
101.0,773.0,774.0,774.0,774.0,775.0,775.0,776.0,777.0,777.0,778.0,779.0,780.0,780.0,781.0,782.0,783.0,784.0,784.0,785.0,786.0,787.0,787.0,788.0,1.0
102.0,2319.0,2321.0,2321.0,2322.0,2323.0,2325.0,2327.0,2329.0,2331.0,2333.0,2336.0,2338.0,2340.0,2343.0,2345.0,2347.0,2350.0,2352.0,2355.0,2357.0,2359.0,2361.0,2363.0,1.0
103.0,2319.0,2321.0,2321.0,2322.0,2323.0,2325.0,2327.0,2329.0,2331.0,2333.0,2336.0,2338.0,2340.0,2343.0,2345.0,2347.0,2350.0,2352.0,2355.0,2357.0,2359.0,2361.0,2363.0,1.0
104.0,1292.0,1293.0,1294.0,1294.0,1295.0,1295.0,1296.0,1297.0,1298.0,1300.0,1301.0,1302.0,1303.0,1304.0,1305.0,1307.0,1308.0,1309.0,1310.0,1311.0,1312.0,1313.0,1314.0,1.0
105.0,1292.0,1293.0,1294.0,1294.0,1295.0,1295.0,1296.0,1297.0,1298.0,1300.0,1301.0,1302.0,1303.0,1304.0,1305.0,1307.0,1308.0,1309.0,1310.0,1311.0,1312.0,1313.0,1314.0,1.0
106.0,3876.0,3878.0,3880.0,3882.0,3883.0,3885.0,3887.0,3890.0,3894.0,3898.0,3901.0,3905.0,3908.0,3912.0,3915.0,3919.0,3922.0,3925.0,3929.0,3932.0,3935.0,3938.0,3941.0,1.0
107.0,3876.0,3878.0,3880.0,3882.0,3883.0,3885.0,3887.0,3890.0,3894.0,3898.0,3901.0,3905.0,3908.0,3912.0,3915.0,3919.0,3922.0,3925.0,3929.0,3932.0,3935.0,3938.0,3941.0,1.0
108.0,435.0,435.0,435.0,435.0,435.0,436.0,436.0,436.0,437.0,437.0,438.0,438.0,438.0,439.0,439.0,440.0,440.0,441.0,441.0,442.0,442.0,442.0,443.0,1.0
109.0,435.0,435.0,435.0,435.0,435.0,436.0,436.0,436.0,437.0,437.0,438.0,438.0,438.0,439.0,439.0,440.0,440.0,441.0,441.0,442.0,442.0,442.0,443.0,1.0
110.0,1303.0,1304.0,1304.0,1305.0,1305.0,1306.0,1307.0,1308.0,1309.0,1311.0,1312.0,1313.0,1314.0,1316.0,1317.0,1319.0,1320.0,1321.0,1323.0,1324.0,1325.0,1326.0,1327.0,1.0
111.0,1303.0,1304.0,1304.0,1305.0,1305.0,1306.0,1307.0,1308.0,1309.0,1311.0,1312.0,1313.0,1314.0,1316.0,1317.0,1319.0,1320.0,1321.0,1323.0,1324.0,1325.0,1326.0,1327.0,1.0
112.0,274.0,275.0,275.0,275.0,275.0,275.0,275.0,275.0,276.0,276.0,276.0,276.0,276.0,277.0,277.0,277.0,277.0,277.0,278.0,278.0,278.0,278.0,278.0,1.0
113.0,274.0,275.0,275.0,275.0,275.0,275.0,275.0,275.0,276.0,276.0,276.0,276.0,276.0,277.0,277.0,277.0,277.0,277.0,278.0,278.0,278.0,278.0,278.0,1.0
114.0,822.0,823.0,823.0,823.0,824.0,824.0,825.0,825.0,826.0,826.0,827.0,828.0,828.0,829.0,829.0,830.0,831.0,831.0,832.0,833.0,833.0,834.0,834.0,1.0
115.0,822.0,823.0,823.0,823.0,824.0,824.0,825.0,825.0,826.0,826.0,827.0,828.0,828.0,829.0,829.0,830.0,831.0,831.0,832.0,833.0,833.0,834.0,834.0,1.0
116.0,418.0,418.0,418.0,418.0,418.0,419.0,419.0,419.0,420.0,420.0,420.0,421.0,421.0,422.0,422.0,422.0,423.0,423.0,424.0,424.0,424.0,425.0,425.0,1.0
117.0,418.0,418.0,418.0,418.0,418.0,419.0,419.0,419.0,420.0,420.0,420.0,421.0,421.0,422.0,422.0,422.0,423.0,423.0,424.0,424.0,424.0,425.0,425.0,1.0
118.0,1252.0,1253.0,1253.0,1254.0,1254.0,1255.0,1256.0,1257.0,1258.0,1259.0,1260.0,1261.0,1263.0,1264.0,1265.0,1266.0,1268.0,1269.0,1270.0,1271.0,1272.0,1274.0,1274.0,1.0
119.0,1252.0,1253.0,1253.0,1254.0,1254.0,1255.0,1256.0,1257.0,1258.0,1259.0,1260.0,1261.0,1263.0,1264.0,1265.0,1266.0,1268.0,1269.0,1270.0,1271.0,1272.0,1274.0,1274.0,1.0
120.0,363.0,363.0,363.0,364.0,364.0,364.0,364.0,364.0,365.0,365.0,365.0,366.0,366.0,366.0,367.0,367.0,367.0,368.0,368.0,368.0,369.0,369.0,369.0,1.0
121.0,363.0,363.0,363.0,364.0,364.0,364.0,364.0,364.0,365.0,365.0,365.0,366.0,366.0,366.0,367.0,367.0,367.0,368.0,368.0,368.0,369.0,369.0,369.0,1.0
122.0,1088.0,1089.0,1089.0,1090.0,1090.0,1091.0,1092.0,1092.0,1093.0,1094.0,1095.0,1096.0,1097.0,1098.0,1099.0,1100.0,1101.0,1102.0,1103.0,1104.0,1105.0,1106.0,1106.0,1.0
123.0,1088.0,1089.0,1089.0,1090.0,1090.0,1091.0,1092.0,1092.0,1093.0,1094.0,1095.0,1096.0,1097.0,1098.0,1099.0,1100.0,1101.0,1102.0,1103.0,1104.0,1105.0,1106.0,1106.0,1.0
124.0,10676.0,10680.0,10685.0,10689.0,10693.0,10698.0,10705.0,10714.0,10723.0,10733.0,10743.0,10753.0,10763.0,10773.0,10784.0,10794.0,10804.0,10814.0,10823.0,10832.0,10841.0,10848.0,10856.0,1.0
125.0,10676.0,10680.0,10685.0,10689.0,10693.0,10698.0,10705.0,10714.0,10723.0,10733.0,10743.0,10753.0,10763.0,10773.0,10784.0,10794.0,10804.0,10814.0,10823.0,10832.0,10841.0,10848.0,10856.0,1.0
126.0,32026.0,32040.0,32053.0,32065.0,32077.0,32092.0,32114.0,32141.0,32169.0,32198.0,32228.0,32258.0,32289.0,32319.0,32350.0,32380.0,32410.0,32440.0,32469.0,32495.0,32521.0,32544.0,32566.0,1.0
127.0,32026.0,32040.0,32053.0,32065.0,32077.0,32092.0,32114.0,32141.0,32169.0,32198.0,32228.0,32258.0,32289.0,32319.0,32350.0,32380.0,32410.0,32440.0,32469.0,32495.0,32521.0,32544.0,32566.0,1.0
128.0,777.0,777.0,778.0,778.0,778.0,779.0,779.0,780.0,781.0,781.0,782.0,783.0,783.0,784.0,785.0,786.0,786.0,787.0,788.0,789.0,789.0,790.0,790.0,1.0
129.0,777.0,777.0,778.0,778.0,778.0,779.0,779.0,780.0,781.0,781.0,782.0,783.0,783.0,784.0,785.0,786.0,786.0,787.0,788.0,789.0,789.0,790.0,790.0,1.0
130.0,2330.0,2331.0,2332.0,2333.0,2334.0,2335.0,2337.0,2339.0,2341.0,2343.0,2345.0,2347.0,2349.0,2352.0,2354.0,2356.0,2358.0,2360.0,2363.0,2365.0,2367.0,2368.0,2370.0,1.0
131.0,2330.0,2331.0,2332.0,2333.0,2334.0,2335.0,2337.0,2339.0,2341.0,2343.0,2345.0,2347.0,2349.0,2352.0,2354.0,2356.0,2358.0,2360.0,2363.0,2365.0,2367.0,2368.0,2370.0,1.0
132.0,127.0,127.0,127.0,127.0,127.0,128.0,128.0,128.0,128.0,128.0,128.0,128.0,129.0,129.0,129.0,129.0,129.0,129.0,129.0,129.0,130.0,130.0,130.0,1.0
133.0,127.0,127.0,127.0,127.0,127.0,128.0,128.0,128.0,128.0,128.0,128.0,128.0,129.0,129.0,129.0,129.0,129.0,129.0,129.0,129.0,130.0,130.0,130.0,1.0
134.0,381.0,381.0,381.0,381.0,381.0,382.0,382.0,382.0,383.0,383.0,384.0,384.0,385.0,385.0,385.0,386.0,386.0,387.0,387.0,387.0,388.0,388.0,388.0,1.0
135.0,381.0,381.0,381.0,381.0,381.0,382.0,382.0,382.0,383.0,383.0,384.0,384.0,385.0,385.0,385.0,386.0,386.0,387.0,387.0,387.0,388.0,388.0,388.0,1.0
136.0,309.0,309.0,309.0,310.0,310.0,310.0,310.0,310.0,311.0,311.0,311.0,312.0,312.0,312.0,312.0,313.0,313.0,313.0,314.0,314.0,314.0,314.0,315.0,1.0
137.0,309.0,309.0,309.0,310.0,310.0,310.0,310.0,310.0,311.0,311.0,311.0,312.0,312.0,312.0,312.0,313.0,313.0,313.0,314.0,314.0,314.0,314.0,315.0,1.0
138.0,926.0,927.0,927.0,928.0,928.0,929.0,929.0,930.0,931.0,932.0,933.0,934.0,935.0,935.0,936.0,937.0,938.0,939.0,940.0,941.0,942.0,942.0,943.0,1.0
139.0,926.0,927.0,927.0,928.0,928.0,929.0,929.0,930.0,931.0,932.0,933.0,934.0,935.0,935.0,936.0,937.0,938.0,939.0,940.0,941.0,942.0,942.0,943.0,1.0
140.0,195.0,195.0,195.0,195.0,195.0,195.0,195.0,195.0,195.0,196.0,196.0,196.0,196.0,196.0,196.0,197.0,197.0,197.0,197.0,197.0,197.0,197.0,197.0,1.0
141.0,195.0,195.0,195.0,195.0,195.0,195.0,195.0,195.0,195.0,196.0,196.0,196.0,196.0,196.0,196.0,197.0,197.0,197.0,197.0,197.0,197.0,197.0,197.0,1.0
142.0,583.0,583.0,584.0,584.0,584.0,584.0,584.0,585.0,585.0,586.0,586.0,587.0,587.0,588.0,588.0,589.0,589.0,590.0,590.0,590.0,591.0,591.0,591.0,1.0
143.0,583.0,583.0,584.0,584.0,584.0,584.0,584.0,585.0,585.0,586.0,586.0,587.0,587.0,588.0,588.0,589.0,589.0,590.0,590.0,590.0,591.0,591.0,591.0,1.0
144.0,1223.0,1224.0,1224.0,1224.0,1225.0,1225.0,1226.0,1227.0,1228.0,1229.0,1230.0,1232.0,1233.0,1234.0,1235.0,1237.0,1238.0,1239.0,1240.0,1241.0,1241.0,1242.0,1243.0,1.0
145.0,1223.0,1224.0,1224.0,1224.0,1225.0,1225.0,1226.0,1227.0,1228.0,1229.0,1230.0,1232.0,1233.0,1234.0,1235.0,1237.0,1238.0,1239.0,1240.0,1241.0,1241.0,1242.0,1243.0,1.0
146.0,3668.0,3670.0,3671.0,3672.0,3673.0,3674.0,3676.0,3679.0,3682.0,3686.0,3690.0,3694.0,3697.0,3701.0,3705.0,3709.0,3712.0,3715.0,3718.0,3721.0,3723.0,3725.0,3727.0,1.0
147.0,3668.0,3670.0,3671.0,3672.0,3673.0,3674.0,3676.0,3679.0,3682.0,3686.0,3690.0,3694.0,3697.0,3701.0,3705.0,3709.0,3712.0,3715.0,3718.0,3721.0,3723.0,3725.0,3727.0,1.0
148.0,271.0,272.0,272.0,272.0,272.0,272.0,272.0,272.0,273.0,273.0,273.0,273.0,274.0,274.0,274.0,274.0,275.0,275.0,275.0,275.0,276.0,276.0,276.0,1.0
149.0,271.0,272.0,272.0,272.0,272.0,272.0,272.0,272.0,273.0,273.0,273.0,273.0,274.0,274.0,274.0,274.0,275.0,275.0,275.0,275.0,276.0,276.0,276.0,1.0
150.0,813.0,814.0,814.0,814.0,815.0,815.0,816.0,816.0,817.0,818.0,818.0,819.0,820.0,821.0,821.0,822.0,823.0,824.0,825.0,825.0,826.0,827.0,828.0,1.0
151.0,813.0,814.0,814.0,814.0,815.0,815.0,816.0,816.0,817.0,818.0,818.0,819.0,820.0,821.0,821.0,822.0,823.0,824.0,825.0,825.0,826.0,827.0,828.0,1.0
152.0,954.0,954.0,954.0,955.0,955.0,955.0,956.0,957.0,957.0,958.0,959.0,961.0,962.0,963.0,964.0,965.0,965.0,966.0,967.0,968.0,969.0,969.0,970.0,1.0
153.0,954.0,954.0,954.0,955.0,955.0,955.0,956.0,957.0,957.0,958.0,959.0,961.0,962.0,963.0,964.0,965.0,965.0,966.0,967.0,968.0,969.0,969.0,970.0,1.0
154.0,2860.0,2861.0,2862.0,2863.0,2864.0,2865.0,2867.0,2869.0,2871.0,2874.0,2877.0,2881.0,2884.0,2887.0,2890.0,2893.0,2895.0,2898.0,2901.0,2903.0,2905.0,2907.0,2909.0,1.0
155.0,2860.0,2861.0,2862.0,2863.0,2864.0,2865.0,2867.0,2869.0,2871.0,2874.0,2877.0,2881.0,2884.0,2887.0,2890.0,2893.0,2895.0,2898.0,2901.0,2903.0,2905.0,2907.0,2909.0,1.0
156.0,691.0,692.0,692.0,692.0,692.0,693.0,693.0,694.0,695.0,695.0,696.0,697.0,697.0,698.0,699.0,699.0,700.0,701.0,701.0,702.0,703.0,703.0,704.0,1.0
157.0,691.0,692.0,692.0,692.0,692.0,693.0,693.0,694.0,695.0,695.0,696.0,697.0,697.0,698.0,699.0,699.0,700.0,701.0,701.0,702.0,703.0,703.0,704.0,1.0
158.0,2073.0,2074.0,2075.0,2076.0,2076.0,2077.0,2079.0,2081.0,2083.0,2085.0,2087.0,2089.0,2091.0,2093.0,2095.0,2097.0,2099.0,2101.0,2103.0,2105.0,2107.0,2108.0,2110.0,1.0
159.0,2073.0,2074.0,2075.0,2076.0,2076.0,2077.0,2079.0,2081.0,2083.0,2085.0,2087.0,2089.0,2091.0,2093.0,2095.0,2097.0,2099.0,2101.0,2103.0,2105.0,2107.0,2108.0,2110.0,1.0
160.0,364.0,364.0,364.0,364.0,364.0,364.0,364.0,365.0,365.0,365.0,366.0,366.0,366.0,367.0,367.0,367.0,368.0,368.0,368.0,369.0,369.0,369.0,369.0,1.0
161.0,364.0,364.0,364.0,364.0,364.0,364.0,364.0,365.0,365.0,365.0,366.0,366.0,366.0,367.0,367.0,367.0,368.0,368.0,368.0,369.0,369.0,369.0,369.0,1.0
162.0,1090.0,1090.0,1090.0,1091.0,1091.0,1092.0,1092.0,1093.0,1094.0,1095.0,1096.0,1097.0,1098.0,1099.0,1100.0,1101.0,1102.0,1103.0,1104.0,1105.0,1105.0,1106.0,1107.0,1.0
163.0,1090.0,1090.0,1090.0,1091.0,1091.0,1092.0,1092.0,1093.0,1094.0,1095.0,1096.0,1097.0,1098.0,1099.0,1100.0,1101.0,1102.0,1103.0,1104.0,1105.0,1105.0,1106.0,1107.0,1.0
164.0,350.0,350.0,350.0,350.0,351.0,351.0,351.0,351.0,352.0,352.0,352.0,352.0,353.0,353.0,353.0,354.0,354.0,354.0,355.0,355.0,355.0,356.0,356.0,1.0
165.0,350.0,350.0,350.0,350.0,351.0,351.0,351.0,351.0,352.0,352.0,352.0,352.0,353.0,353.0,353.0,354.0,354.0,354.0,355.0,355.0,355.0,356.0,356.0,1.0
166.0,1049.0,1049.0,1050.0,1050.0,1051.0,1052.0,1052.0,1053.0,1054.0,1055.0,1055.0,1056.0,1057.0,1058.0,1059.0,1060.0,1061.0,1062.0,1063.0,1064.0,1065.0,1066.0,1067.0,1.0
167.0,1049.0,1049.0,1050.0,1050.0,1051.0,1052.0,1052.0,1053.0,1054.0,1055.0,1055.0,1056.0,1057.0,1058.0,1059.0,1060.0,1061.0,1062.0,1063.0,1064.0,1065.0,1066.0,1067.0,1.0
168.0,11654.0,11659.0,11663.0,11667.0,11672.0,11677.0,11684.0,11694.0,11704.0,11715.0,11726.0,11738.0,11750.0,11762.0,11773.0,11785.0,11796.0,11807.0,11817.0,11826.0,11835.0,11843.0,11850.0,1.0
169.0,11654.0,11659.0,11663.0,11667.0,11672.0,11677.0,11684.0,11694.0,11704.0,11715.0,11726.0,11738.0,11750.0,11762.0,11773.0,11785.0,11796.0,11807.0,11817.0,11826.0,11835.0,11843.0,11850.0,1.0
170.0,34962.0,34976.0,34989.0,35001.0,35014.0,35029.0,35052.0,35080.0,35111.0,35144.0,35178.0,35213.0,35249.0,35284.0,35318.0,35353.0,35387.0,35419.0,35449.0,35477.0,35503.0,35527.0,35550.0,1.0
171.0,34962.0,34976.0,34989.0,35001.0,35014.0,35029.0,35052.0,35080.0,35111.0,35144.0,35178.0,35213.0,35249.0,35284.0,35318.0,35353.0,35387.0,35419.0,35449.0,35477.0,35503.0,35527.0,35550.0,1.0
172.0,1286.0,1287.0,1288.0,1288.0,1289.0,1289.0,1290.0,1291.0,1292.0,1293.0,1294.0,1296.0,1297.0,1298.0,1299.0,1300.0,1301.0,1302.0,1304.0,1305.0,1306.0,1307.0,1308.0,1.0
173.0,1286.0,1287.0,1288.0,1288.0,1289.0,1289.0,1290.0,1291.0,1292.0,1293.0,1294.0,1296.0,1297.0,1298.0,1299.0,1300.0,1301.0,1302.0,1304.0,1305.0,1306.0,1307.0,1308.0,1.0
174.0,3858.0,3860.0,3862.0,3863.0,3865.0,3867.0,3869.0,3872.0,3875.0,3879.0,3882.0,3886.0,3889.0,3893.0,3896.0,3900.0,3903.0,3906.0,3910.0,3913.0,3917.0,3920.0,3923.0,1.0
175.0,3858.0,3860.0,3862.0,3863.0,3865.0,3867.0,3869.0,3872.0,3875.0,3879.0,3882.0,3886.0,3889.0,3893.0,3896.0,3900.0,3903.0,3906.0,3910.0,3913.0,3917.0,3920.0,3923.0,1.0
176.0,398.0,398.0,399.0,399.0,399.0,399.0,399.0,399.0,400.0,400.0,400.0,401.0,401.0,401.0,402.0,402.0,402.0,402.0,403.0,403.0,403.0,403.0,404.0,1.0
177.0,398.0,398.0,399.0,399.0,399.0,399.0,399.0,399.0,400.0,400.0,400.0,401.0,401.0,401.0,402.0,402.0,402.0,402.0,403.0,403.0,403.0,403.0,404.0,1.0
178.0,1194.0,1194.0,1195.0,1195.0,1195.0,1196.0,1196.0,1197.0,1198.0,1199.0,1200.0,1201.0,1202.0,1203.0,1204.0,1204.0,1205.0,1206.0,1207.0,1208.0,1208.0,1209.0,1210.0,1.0
179.0,1194.0,1194.0,1195.0,1195.0,1195.0,1196.0,1196.0,1197.0,1198.0,1199.0,1200.0,1201.0,1202.0,1203.0,1204.0,1204.0,1205.0,1206.0,1207.0,1208.0,1208.0,1209.0,1210.0,1.0
180.0,308.0,308.0,308.0,308.0,308.0,308.0,308.0,309.0,309.0,309.0,310.0,310.0,310.0,310.0,311.0,311.0,311.0,312.0,312.0,312.0,312.0,312.0,312.0,1.0
181.0,308.0,308.0,308.0,308.0,308.0,308.0,308.0,309.0,309.0,309.0,310.0,310.0,310.0,310.0,311.0,311.0,311.0,312.0,312.0,312.0,312.0,312.0,312.0,1.0
182.0,922.0,922.0,923.0,923.0,923.0,924.0,924.0,925.0,926.0,927.0,928.0,928.0,929.0,930.0,931.0,932.0,933.0,934.0,934.0,935.0,935.0,936.0,936.0,1.0
183.0,922.0,922.0,923.0,923.0,923.0,924.0,924.0,925.0,926.0,927.0,928.0,928.0,929.0,930.0,931.0,932.0,933.0,934.0,934.0,935.0,935.0,936.0,936.0,1.0
184.0,12868.0,12874.0,12879.0,12884.0,12889.0,12895.0,12904.0,12914.0,12926.0,12938.0,12950.0,12962.0,12975.0,12988.0,13001.0,13013.0,13026.0,13038.0,13049.0,13060.0,13070.0,13080.0,13089.0,1.0
185.0,12868.0,12874.0,12879.0,12884.0,12889.0,12895.0,12904.0,12914.0,12926.0,12938.0,12950.0,12962.0,12975.0,12988.0,13001.0,13013.0,13026.0,13038.0,13049.0,13060.0,13070.0,13080.0,13089.0,1.0
186.0,38604.0,38622.0,38637.0,38652.0,38667.0,38685.0,38711.0,38742.0,38776.0,38812.0,38849.0,38886.0,38925.0,38964.0,39002.0,39039.0,39076.0,39113.0,39147.0,39179.0,39209.0,39238.0,39265.0,1.0
187.0,38604.0,38622.0,38637.0,38652.0,38667.0,38685.0,38711.0,38742.0,38776.0,38812.0,38849.0,38886.0,38925.0,38964.0,39002.0,39039.0,39076.0,39113.0,39147.0,39179.0,39209.0,39238.0,39265.0,1.0
188.0,312.0,313.0,313.0,313.0,313.0,313.0,313.0,314.0,314.0,314.0,314.0,315.0,315.0,315.0,315.0,316.0,316.0,316.0,316.0,317.0,317.0,317.0,318.0,1.0
189.0,312.0,313.0,313.0,313.0,313.0,313.0,313.0,314.0,314.0,314.0,314.0,315.0,315.0,315.0,315.0,316.0,316.0,316.0,316.0,317.0,317.0,317.0,318.0,1.0
190.0,936.0,937.0,937.0,938.0,938.0,938.0,939.0,940.0,940.0,941.0,942.0,943.0,943.0,944.0,945.0,946.0,947.0,947.0,948.0,949.0,950.0,951.0,952.0,1.0
191.0,936.0,937.0,937.0,938.0,938.0,938.0,939.0,940.0,940.0,941.0,942.0,943.0,943.0,944.0,945.0,946.0,947.0,947.0,948.0,949.0,950.0,951.0,952.0,1.0
192.0,87.0,87.0,87.0,87.0,87.0,87.0,87.0,87.0,87.0,87.0,87.0,88.0,88.0,88.0,88.0,88.0,88.0,88.0,88.0,88.0,88.0,88.0,88.0,1.0
193.0,87.0,87.0,87.0,87.0,87.0,87.0,87.0,87.0,87.0,87.0,87.0,88.0,88.0,88.0,88.0,88.0,88.0,88.0,88.0,88.0,88.0,88.0,88.0,1.0
194.0,259.0,260.0,260.0,260.0,260.0,260.0,260.0,260.0,261.0,261.0,261.0,262.0,262.0,262.0,262.0,263.0,263.0,263.0,264.0,264.0,264.0,264.0,264.0,1.0
195.0,259.0,260.0,260.0,260.0,260.0,260.0,260.0,260.0,261.0,261.0,261.0,262.0,262.0,262.0,262.0,263.0,263.0,263.0,264.0,264.0,264.0,264.0,264.0,1.0
196.0,172.0,173.0,173.0,173.0,173.0,173.0,173.0,173.0,173.0,173.0,174.0,174.0,174.0,174.0,174.0,175.0,175.0,175.0,175.0,175.0,175.0,175.0,176.0,1.0
197.0,172.0,173.0,173.0,173.0,173.0,173.0,173.0,173.0,173.0,173.0,174.0,174.0,174.0,174.0,174.0,175.0,175.0,175.0,175.0,175.0,175.0,175.0,176.0,1.0
198.0,516.0,517.0,517.0,517.0,517.0,517.0,518.0,518.0,519.0,519.0,520.0,520.0,521.0,522.0,522.0,523.0,523.0,523.0,524.0,524.0,525.0,525.0,526.0,1.0
199.0,516.0,517.0,517.0,517.0,517.0,517.0,518.0,518.0,519.0,519.0,520.0,520.0,521.0,522.0,522.0,523.0,523.0,523.0,524.0,524.0,525.0,525.0,526.0,1.0
200.0,288.0,289.0,289.0,289.0,289.0,289.0,289.0,289.0,290.0,290.0,290.0,291.0,291.0,291.0,292.0,292.0,292.0,292.0,293.0,293.0,293.0,293.0,293.0,1.0
201.0,288.0,289.0,289.0,289.0,289.0,289.0,289.0,289.0,290.0,290.0,290.0,291.0,291.0,291.0,292.0,292.0,292.0,292.0,293.0,293.0,293.0,293.0,293.0,1.0
202.0,864.0,865.0,865.0,865.0,865.0,866.0,866.0,867.0,868.0,869.0,870.0,871.0,872.0,873.0,874.0,875.0,876.0,876.0,877.0,878.0,878.0,879.0,879.0,1.0
203.0,864.0,865.0,865.0,865.0,865.0,866.0,866.0,867.0,868.0,869.0,870.0,871.0,872.0,873.0,874.0,875.0,876.0,876.0,877.0,878.0,878.0,879.0,879.0,1.0
204.0,302.0,302.0,302.0,302.0,303.0,303.0,303.0,303.0,303.0,304.0,304.0,304.0,304.0,305.0,305.0,305.0,306.0,306.0,306.0,307.0,307.0,307.0,307.0,1.0
205.0,302.0,302.0,302.0,302.0,303.0,303.0,303.0,303.0,303.0,304.0,304.0,304.0,304.0,305.0,305.0,305.0,306.0,306.0,306.0,307.0,307.0,307.0,307.0,1.0
206.0,905.0,906.0,906.0,906.0,907.0,907.0,908.0,909.0,909.0,910.0,911.0,911.0,912.0,913.0,914.0,915.0,916.0,917.0,918.0,919.0,919.0,920.0,921.0,1.0
207.0,905.0,906.0,906.0,906.0,907.0,907.0,908.0,909.0,909.0,910.0,911.0,911.0,912.0,913.0,914.0,915.0,916.0,917.0,918.0,919.0,919.0,920.0,921.0,1.0
