218,1
2272,2
444,3
2504,4
2314,5
273,6
2321,7
2078,8
1190,9
45,10
348,11
521,12
2085,13
2460,14
913,15
259,16
152,17
418,18
306,19
1630,20
1232,21
171,22
70,23
248,24
316,25
451,26
114,27
258,28
1971,29
697,30
647,31
1429,32
102,33
97,34
1828,35
117,36
779,37
289,38
588,39
75,40
359,41
297,42
849,43
923,44
1162,45
405,46
373,47
284,48
585,49
198,50
1250,51
167,52
409,53
1388,54
38,55
178,56
701,57
690,58
461,59
1410,60
1114,61
129,62
2348,63
82,64
30,65
15,66
16,67
18,68
323,69
153,70
175,71
239,72
699,73
551,74
542,75
51,76
231,77
889,78
2224,79
67,80
52,81
3,82
742,83
516,84
549,85
1043,86
1567,87
139,88
788,89
133,90
1336,91
1335,92
46,93
205,94
140,95
528,96
762,97
206,98
833,99
2029,100
625,101
486,102
871,103
386,104
148,105
1295,106
355,107
663,108
151,109
8,110
875,111
86,112
1454,113
2063,114
735,115
603,116
954,117
1002,118
191,119
1916,120
506,121
1010,122
399,123
979,124
1995,125
657,126
650,127
971,128
495,129
1555,130
1860,131
600,132
21,133
997,134
190,135
1020,136
