1,1
1,3
1,4
1,10
1,6
1,7
1,8
1,16
1,21
1,14
1,17
1,18
1,27
1,36
1,22
1,28
1,37
1,23
1,29
2,5
2,2
2,11
2,9
2,19
2,20
2,15
2,24
2,33
2,34
2,40
2,25
2,35
2,41
2,30
2,31
2,26
2,46
2,53
2,56
3,47
3,38
3,39
3,48
3,49
3,60
3,69
3,61
3,62
3,63
3,64
3,70
3,79
3,88
3,78
3,89
3,95
3,90
3,99
4,45
4,50
4,51
4,52
4,65
4,55
4,66
4,67
4,68
4,71
4,76
4,82
4,91
4,92
4,96
4,100
4,80
4,81
4,93
5,42
5,43
5,54
5,57
5,58
5,44
5,59
5,72
5,77
5,73
5,74
5,75
5,83
5,97
5,101
5,84
5,85
5,94
5,98
5,86
6,87
6,104
6,105
6,112
6,106
6,107
6,113
6,108
6,109
6,117
6,114
6,119
6,125
6,130
6,120
6,131
6,126
6,127
6,132
6,121
7,110
7,102
7,111
7,115
7,118
7,103
7,116
7,122
7,123
7,128
7,133
7,134
7,124
7,135
7,129
7,136
8,12
8,13
8,32
