module gitlab.com/mergetb/tech/reconcile

go 1.20

require (
	github.com/deckarep/golang-set/v2 v2.6.0
	github.com/edwingeng/deque/v2 v2.1.1
	github.com/golang/protobuf v1.5.3
	github.com/grpc-ecosystem/go-grpc-middleware/v2 v2.0.1
	github.com/jinzhu/copier v0.4.0
	github.com/maruel/natural v1.1.0
	github.com/puzpuzpuz/xsync/v3 v3.1.0
	github.com/sirupsen/logrus v1.8.1
	github.com/spf13/cobra v1.6.0
	github.com/stretchr/testify v1.8.4
	github.com/yourbasic/radix v0.0.0-20180308122924-cbe1cc82e907
	gitlab.com/mergetb/tech/shared/storage v1.2.0
	go.etcd.io/etcd/api/v3 v3.5.12
	go.etcd.io/etcd/client/v3 v3.5.12
	go.uber.org/zap v1.21.0
	google.golang.org/grpc v1.59.0
	google.golang.org/protobuf v1.31.0
)

require (
	github.com/coreos/go-semver v0.3.0 // indirect
	github.com/coreos/go-systemd/v22 v22.5.0 // indirect
	github.com/davecgh/go-spew v1.1.1 // indirect
	github.com/gogo/protobuf v1.3.2 // indirect
	github.com/inconshreveable/mousetrap v1.0.1 // indirect
	github.com/pmezard/go-difflib v1.0.0 // indirect
	github.com/spf13/pflag v1.0.5 // indirect
	github.com/tidwall/btree v1.7.0 // indirect
	go.etcd.io/etcd/client/pkg/v3 v3.5.12 // indirect
	go.uber.org/atomic v1.9.0 // indirect
	go.uber.org/goleak v1.1.12 // indirect
	go.uber.org/multierr v1.8.0 // indirect
	golang.org/x/net v0.19.0 // indirect
	golang.org/x/sys v0.15.0 // indirect
	golang.org/x/text v0.14.0 // indirect
	google.golang.org/genproto v0.0.0-20230822172742-b8732ec3820d // indirect
	google.golang.org/genproto/googleapis/api v0.0.0-20230822172742-b8732ec3820d // indirect
	google.golang.org/genproto/googleapis/rpc v0.0.0-20230822172742-b8732ec3820d // indirect
	gopkg.in/yaml.v3 v3.0.1 // indirect
)
