406444,
406448,
406448,
406448,
406448,
406448,
406448,
406448,
406448,
406448,
406448,
406448,
406448,
406448,
406448,
406448,
406448,
406448,
406448,
406448,
406448,
406448,
406448,
406448,
406448,
406448,
406448,
406448,
406448,
406448,
406448,
406448,
406448,
406448,
406448,
406448,
406448,
406448,
406448,
406448,
406448,
406448,
406448,
406448,
406448,
406448,
406448,
406448,
406448,
406448,
406448,
406448,
406448,
406448,
406448,
406448,
406448,
406448,
406448,
406448,
406448,
406448,
406448,
406448,
406448,
406448,
406448,
406448,
406448,
406448,
406448,
406448,
406448,
406448,
406448,
406448,
406448,
406448,
406448,
406448,
406448,
406448,
406448,
406448,
406448,
406448,
406448,
406448,
406448,
406448,
406448,
406448,
406448,
406448,
406448,
406448,
406448,
406448,
406448,
406448,
406448,
406448,
406448,
406448,
406448,
406448,
406448,
406448,
406448,
406448,
406448,
406448,
406448,
406448,
406448,
406448,
406448,
406448,
406448,
406448,
406448,
406448,
406448,
406448,
406448,
406448,
406448,
406448,
406448,
406448,
406448,
406448,
406448,
406448,
406448,
406448,
406448,
406448,
406448,
406448,
406448,
406448,
406448,
406448,
406448,
406448,
406448,
406448,
406448,
406448,
406448,
406448,
406448,
406448,
406448,
406448,
406448,
406448,
406448,
406448,
406448,
406448,
406448,
406448,
406448,
406448,
406448,
406448,
406448,
406448,
406448,
406448,
406448,
406448,
406448,
406448,
406448,
406448,
406448,
406448,
406448,
406448,
406448,
406448,
406448,
406448,
406448,
406448,
406448,
406448,
406448,
406448,
406448,
406448,
406448,
406448,
406448,
406448,
406448,
406448,
406448,
406448,
406448,
406448,
406448,
406448,
406448,
406448,
406448,
406448,
406448,
406448,
406448,
406448,
406448,
406448,
406448,
406448,
406448,
406448,
406448,
406448,
406448,
406448,
406448,
406448,
406448,
406448,
406448,
406448,
406448,
406448,
406448,
406448,
406448,
406448,
406448,
406448,
406448,
406448,
406448,
406448,
406448,
406448,
406448,
406448,
406448,
406448,
406448,
406448,
406448,
406448,
406448,
406448,
406448,
406448,
406448,
406448,
406448,
406448,
406448,
406448,
406448,
406448,
406448,
406448,
406448,
406448,
406448,
406448,
406448,
