{
	"title": "MergeTB News",
	"news": [
		{
			"id": "002-lighthousetb-maintenance",
			"title": "Upcoming Lighthouse Portal Maintenance",
			"desc": "<p>We will be performing maintenance on Wednesday 03/08/2023 at 10AM PST. The maintanance will provide more storage on XDCs and alleviate the recent issues we've seen with XDC instability. The maintenance will likely be quick, but may cause temporary disruption to the portal access and will require reboots of your XDCs.</p>",
			"timestamp": "2022-03-04T00:38:00Z",
			"level": "info"
		},
		{
			"id": "001-materialization-status-is-ready",
			"title": "Materialization Status is Ready!",
			"desc": "<p>Read all about it <a href=\"https://mergetb.org/blog/2022/11/22/materialization-status-is-ready/\">on the blog.</a><br><strong>Note that materializations before this feature was rolled will show \"Error\", as they do not have the metadata needed to support status trees, but they will still be running in whatever state they were before!</strong></p>",
			"timestamp": "2022-11-23T22:00:00Z"
		},
		{
			"id": "000-lighthousetb-status-maintainance",
			"title": "Completed! Scheduled LighthouseTB Maintainance for 2022-11-23",
			"desc": "Edit: This is now complete!<br>There will be maintainance on 2022-11-23 to upgrade the Lighthouse services for the materialization status feature. <br>Although we do not expect any issues, as it is a major upgrade, it is possible that issues could arise.",
			"timestamp": "2022-11-23T22:00:00Z",
			"level": "success"
		}
	]
}
