module gitlab.com/mergetb/portal/news

go 1.18

require (
	github.com/sirupsen/logrus v1.9.0
	github.com/spf13/cobra v1.6.1
	golang.org/x/net v0.0.0-20220722155237-a158d28d115b
	k8s.io/apimachinery v0.25.4
)

require (
	github.com/inconshreveable/mousetrap v1.0.1 // indirect
	github.com/spf13/pflag v1.0.5 // indirect
	golang.org/x/sys v0.0.0-20220715151400-c0bba94af5f8 // indirect
)
