{
    "testbeds": {
        "lighthouse": {
            "api": "https://api.dorvan.mergetb.net",
            "auth": "https://auth.dorvan.mergetb.net"
        },
        "redstar": {
            "api": "https://api.redstartb.net",
            "auth": "https://auth.redstartb.net"
        }
    }
}
