module gitlab.com/mergetb/tech/embiggen-disk

go 1.16

require (
	github.com/u-root/u-root v0.0.0-20180806213625-12f9029297cf
	golang.org/x/mod v0.2.0
	golang.org/x/sys v0.0.0-20190412213103-97732733099d
)

replace github.com/google/embiggen-disk => ./
