<?xml version="1.0" encoding="UTF-8" standalone="no"?>
<!-- Created with Inkscape (http://www.inkscape.org/) -->

<svg
   xmlns:dc="http://purl.org/dc/elements/1.1/"
   xmlns:cc="http://creativecommons.org/ns#"
   xmlns:rdf="http://www.w3.org/1999/02/22-rdf-syntax-ns#"
   xmlns:svg="http://www.w3.org/2000/svg"
   xmlns="http://www.w3.org/2000/svg"
   xmlns:sodipodi="http://sodipodi.sourceforge.net/DTD/sodipodi-0.dtd"
   xmlns:inkscape="http://www.inkscape.org/namespaces/inkscape"
   width="1024"
   height="1024"
   viewBox="0 0 270.93333 270.93333"
   version="1.1"
   id="svg5593"
   inkscape:version="0.92.3 (2405546, 2018-03-11)"
   sodipodi:docname="flower-logo.svg"
   inkscape:export-filename="/home/ry/code/ceftb/docs/logo/flower-logo.png"
   inkscape:export-xdpi="96"
   inkscape:export-ydpi="96">
  <defs
     id="defs5587" />
  <sodipodi:namedview
     id="base"
     pagecolor="#ffffff"
     bordercolor="#666666"
     borderopacity="1.0"
     inkscape:pageopacity="0.0"
     inkscape:pageshadow="2"
     inkscape:zoom="0.70710678"
     inkscape:cx="1143.1843"
     inkscape:cy="723.36002"
     inkscape:document-units="mm"
     inkscape:current-layer="layer1"
     showgrid="false"
     units="px"
     inkscape:window-width="2711"
     inkscape:window-height="1667"
     inkscape:window-x="3840"
     inkscape:window-y="288"
     inkscape:window-maximized="0" />
  <metadata
     id="metadata5590">
    <rdf:RDF>
      <cc:Work
         rdf:about="">
        <dc:format>image/svg+xml</dc:format>
        <dc:type
           rdf:resource="http://purl.org/dc/dcmitype/StillImage" />
        <dc:title></dc:title>
      </cc:Work>
    </rdf:RDF>
  </metadata>
  <g
     inkscape:label="Layer 1"
     inkscape:groupmode="layer"
     id="layer1"
     transform="translate(0,-26.0668)">
    <path
       style="fill:#c8201e;fill-opacity:1;stroke:#c8201e;stroke-width:0.19380316px;stroke-linecap:butt;stroke-linejoin:miter;stroke-opacity:1"
       d="M 84.456366,73.987724 138.16102,126.14609 126.32001,126.2204 83.020218,84.167298 Z"
       id="path4522-2-1-2-3-0-6-5-6-4-3-3-8-0-7"
       inkscape:connector-curvature="0"
       sodipodi:nodetypes="ccccc"
       inkscape:transform-center-x="-2.4261447"
       inkscape:transform-center-y="8.6122596"
       inkscape:export-xdpi="96"
       inkscape:export-ydpi="96" />
    <path
       style="fill:#cfb83d;fill-opacity:0.39215686;stroke:none;stroke-width:0.11501636px;stroke-linecap:butt;stroke-linejoin:miter;stroke-opacity:1"
       d="M 112.79692,132.6219 96.962779,75.162039 138.41686,39.649774 179.87117,75.161886 164.03704,132.62179 Z"
       id="path8815-3"
       inkscape:connector-curvature="0"
       sodipodi:nodetypes="cccccc"
       inkscape:export-xdpi="96"
       inkscape:export-ydpi="96" />
    <path
       style="fill:#00347c;fill-opacity:1;stroke:#00347c;stroke-width:0.19380313px;stroke-linecap:butt;stroke-linejoin:miter;stroke-opacity:1"
       d="m 170.24669,182.81922 19.63907,71.26741 -9.7916,-3.88132 -15.83412,-57.45986 z"
       id="path4522-2-1-2-3-0-6-5-6-4-3-1"
       inkscape:connector-curvature="0"
       sodipodi:nodetypes="ccccc"
       inkscape:transform-center-x="6.6012619"
       inkscape:transform-center-y="-3.8725197"
       inkscape:export-xdpi="96"
       inkscape:export-ydpi="96" />
    <path
       style="fill:#009d9a;fill-opacity:1;stroke:#009d9a;stroke-width:0.19380313px;stroke-linecap:butt;stroke-linejoin:miter;stroke-opacity:1"
       d="m 138.94047,199.4367 31.77643,-53.47505 5.63983,10.07059 -25.61995,43.11466 z"
       id="path4522-2-1-2-3-0-6-5-6-4-8-0"
       inkscape:connector-curvature="0"
       sodipodi:nodetypes="ccccc"
       inkscape:transform-center-x="6.7555773"
       inkscape:transform-center-y="3.6393779"
       inkscape:export-xdpi="96"
       inkscape:export-ydpi="96" />
    <path
       style="fill:#d0b83e;fill-opacity:1;stroke:#d0b83e;stroke-width:0.19380313px;stroke-linecap:butt;stroke-linejoin:miter;stroke-opacity:1"
       d="M 87.106301,71.516004 138.52174,27.470156 138.41686,39.649774 96.962779,75.162039 Z"
       id="path4522-2-1-2-3-0-6-5-6-4-3-3"
       inkscape:connector-curvature="0"
       sodipodi:nodetypes="ccccc"
       inkscape:transform-center-x="-0.82573047"
       inkscape:transform-center-y="-8.5602832"
       inkscape:export-xdpi="96"
       inkscape:export-ydpi="96" />
    <path
       style="fill:#d0b83e;fill-opacity:1;stroke:#d0b83e;stroke-width:0.19380315px;stroke-linecap:butt;stroke-linejoin:miter;stroke-opacity:1"
       d="m 138.31199,27.470226 51.41558,44.045569 -9.8564,3.646091 -41.45431,-35.512112 z"
       id="path4522-2-1-2-3-0-6-5-6-4-3-3-8"
       inkscape:connector-curvature="0"
       sodipodi:nodetypes="ccccc"
       inkscape:transform-center-x="-10.104969"
       inkscape:transform-center-y="-0.84424578"
       inkscape:export-xdpi="96"
       inkscape:export-ydpi="96" />
    <path
       style="fill:#d0b83e;fill-opacity:1;stroke:#d0b83e;stroke-width:0.19380316px;stroke-linecap:butt;stroke-linejoin:miter;stroke-opacity:1"
       d="m 189.66269,71.280461 -19.63893,71.267469 -5.98672,-9.92614 15.83406,-57.459981 z"
       id="path4522-2-1-2-3-0-6-5-6-4-3-3-8-0"
       inkscape:connector-curvature="0"
       sodipodi:nodetypes="ccccc"
       inkscape:transform-center-x="-2.426114"
       inkscape:transform-center-y="8.6122441"
       inkscape:export-xdpi="96"
       inkscape:export-ydpi="96" />
    <path
       style="fill:#179138;fill-opacity:0.39215686;stroke:none;stroke-width:0.11501636px;stroke-linecap:butt;stroke-linejoin:miter;stroke-opacity:1"
       d="m 149.95742,126.43583 43.29966,-42.053146 52.38085,17.124296 -10.92656,52.63651 -59.13385,15.40688 z"
       id="path8815-3-3"
       inkscape:connector-curvature="0"
       sodipodi:nodetypes="cccccc"
       inkscape:export-xdpi="96"
       inkscape:export-ydpi="96" />
    <path
       style="fill:#18923a;fill-opacity:1;stroke:#18923a;stroke-width:0.19380313px;stroke-linecap:butt;stroke-linejoin:miter;stroke-opacity:1"
       d="m 138.11634,126.36161 53.70451,-52.158478 1.43623,10.179552 -43.29966,42.053146 z"
       id="path4522-2-1-2-3-0-6-5-6-4-3-0"
       inkscape:connector-curvature="0"
       sodipodi:nodetypes="ccccc"
       inkscape:transform-center-x="6.601256"
       inkscape:transform-center-y="-3.8725119"
       inkscape:export-xdpi="96"
       inkscape:export-ydpi="96" />
    <path
       style="fill:#18923a;fill-opacity:1;stroke:#18923a;stroke-width:0.19380315px;stroke-linecap:butt;stroke-linejoin:miter;stroke-opacity:1"
       d="m 191.57869,74.266263 64.96795,21.239166 -10.90871,6.001551 -52.38085,-17.124296 z"
       id="path4522-2-1-2-3-0-6-5-6-4-3-3-3"
       inkscape:connector-curvature="0"
       sodipodi:nodetypes="ccccc"
       inkscape:transform-center-x="-0.82575888"
       inkscape:transform-center-y="-8.5602759"
       inkscape:export-xdpi="96"
       inkscape:export-ydpi="96" />
    <path
       style="fill:#18923a;fill-opacity:1;stroke:#18923a;stroke-width:0.19380315px;stroke-linecap:butt;stroke-linejoin:miter;stroke-opacity:1"
       d="m 256.44161,95.328953 -13.55214,65.284977 -8.1781,-6.47037 10.92656,-52.63658 z"
       id="path4522-2-1-2-3-0-6-5-6-4-3-3-8-09"
       inkscape:connector-curvature="0"
       sodipodi:nodetypes="ccccc"
       inkscape:transform-center-x="-10.10496"
       inkscape:transform-center-y="-0.8442377"
       inkscape:export-xdpi="96"
       inkscape:export-ydpi="96" />
    <path
       style="fill:#18923a;fill-opacity:1;stroke:#18923a;stroke-width:0.19380316px;stroke-linecap:butt;stroke-linejoin:miter;stroke-opacity:1"
       d="m 243.06683,160.44167 -73.34352,19.10911 5.85421,-10.00041 59.13385,-15.40688 z"
       id="path4522-2-1-2-3-0-6-5-6-4-3-3-8-0-2"
       inkscape:connector-curvature="0"
       sodipodi:nodetypes="ccccc"
       inkscape:transform-center-x="-2.426127"
       inkscape:transform-center-y="8.6122483"
       inkscape:export-xdpi="96"
       inkscape:export-ydpi="96" />
    <path
       style="fill:#009c99;fill-opacity:0.39215686;stroke:none;stroke-width:0.11501638px;stroke-linecap:butt;stroke-linejoin:miter;stroke-opacity:1"
       d="m 176.35673,156.03224 59.13386,15.40672 10.9267,52.63654 -52.38072,17.12449 -43.29979,-42.05309 z"
       id="path8815-3-8-8"
       inkscape:connector-curvature="0"
       sodipodi:nodetypes="cccccc"
       inkscape:export-xdpi="96"
       inkscape:export-ydpi="96" />
    <path
       style="fill:#18923a;fill-opacity:1;stroke:#18923a;stroke-width:0.1938031px;stroke-linecap:butt;stroke-linejoin:miter;stroke-opacity:1"
       d="m 169.93768,179.621 -31.77666,-53.47495 11.7964,0.28978 25.6201,43.11454 z"
       id="path4522-2-1-2-3-0-6-5-6-4-4"
       inkscape:connector-curvature="0"
       sodipodi:nodetypes="ccccc"
       inkscape:transform-center-x="6.7555959"
       inkscape:transform-center-y="3.6393826"
       inkscape:export-xdpi="96"
       inkscape:export-ydpi="96" />
    <path
       style="fill:#d0b83e;fill-opacity:1;stroke:#d0b83e;stroke-width:0.1938031px;stroke-linecap:butt;stroke-linejoin:miter;stroke-opacity:1"
       d="m 170.19359,142.40257 -63.55316,1.6e-4 6.15649,-9.78083 51.24012,-1.1e-4 z"
       id="path4522-2-1-2-3-0-6-5-6-4"
       inkscape:connector-curvature="0"
       sodipodi:nodetypes="ccccc"
       inkscape:transform-center-x="6.7555756"
       inkscape:transform-center-y="3.6393818"
       inkscape:export-xdpi="96"
       inkscape:export-ydpi="96" />
    <path
       style="fill:#009d9a;fill-opacity:1;stroke:#009d9a;stroke-width:0.19380313px;stroke-linecap:butt;stroke-linejoin:miter;stroke-opacity:1"
       d="m 170.50238,146.03182 73.34359,19.10893 -8.35538,6.29821 -59.13386,-15.40672 z"
       id="path4522-2-1-2-3-0-6-5-6-4-3-8-5"
       inkscape:connector-curvature="0"
       sodipodi:nodetypes="ccccc"
       inkscape:transform-center-x="6.6012837"
       inkscape:transform-center-y="-3.872511"
       inkscape:export-xdpi="96"
       inkscape:export-ydpi="96" />
    <path
       style="fill:#009d9a;fill-opacity:1;stroke:#009d9a;stroke-width:0.19380315px;stroke-linecap:butt;stroke-linejoin:miter;stroke-opacity:1"
       d="m 243.66868,164.96854 13.55245,65.28503 -10.80384,-6.17807 -10.9267,-52.63654 z"
       id="path4522-2-1-2-3-0-6-5-6-4-3-3-9-0"
       inkscape:connector-curvature="0"
       sodipodi:nodetypes="ccccc"
       inkscape:transform-center-x="-0.82578267"
       inkscape:transform-center-y="-8.5602799"
       inkscape:export-xdpi="96"
       inkscape:export-ydpi="96" />
    <path
       style="fill:#009d9a;fill-opacity:1;stroke:#009d9a;stroke-width:0.19380315px;stroke-linecap:butt;stroke-linejoin:miter;stroke-opacity:1"
       d="m 257.32592,230.07698 -64.96773,21.23943 1.67831,-10.11646 52.38079,-17.12445 z"
       id="path4522-2-1-2-3-0-6-5-6-4-3-3-8-7-6"
       inkscape:connector-curvature="0"
       sodipodi:nodetypes="ccccc"
       inkscape:transform-center-x="-10.104933"
       inkscape:transform-center-y="-0.84423759"
       inkscape:export-xdpi="96"
       inkscape:export-ydpi="96" />
    <path
       style="fill:#00347c;fill-opacity:0.4;stroke:none;stroke-width:0.11501636px;stroke-linecap:butt;stroke-linejoin:miter;stroke-opacity:1"
       d="M 164.26004,192.74545 180.09416,250.20531 138.64,285.71759 97.185842,250.20554 113.01984,192.74556 Z"
       id="path8815-3-2"
       inkscape:connector-curvature="0"
       sodipodi:nodetypes="cccccc"
       inkscape:export-xdpi="96"
       inkscape:export-ydpi="96" />
    <path
       style="fill:#009d9a;fill-opacity:1;stroke:#009d9a;stroke-width:0.19380316px;stroke-linecap:butt;stroke-linejoin:miter;stroke-opacity:1"
       d="m 192.60044,251.37949 -53.70467,-52.1583 11.84101,-0.0743 43.29979,42.05309 z"
       id="path4522-2-1-2-3-0-6-5-6-4-3-3-8-0-7-4"
       inkscape:connector-curvature="0"
       sodipodi:nodetypes="ccccc"
       inkscape:transform-center-x="-2.4260971"
       inkscape:transform-center-y="8.6122439"
       inkscape:export-xdpi="96"
       inkscape:export-ydpi="96" />
    <path
       style="fill:#00347c;fill-opacity:1;stroke:#00347c;stroke-width:0.1938031px;stroke-linecap:butt;stroke-linejoin:miter;stroke-opacity:1"
       d="m 106.86335,182.96478 63.5531,-1.5e-4 -6.15641,9.78082 -51.2402,1.1e-4 z"
       id="path4522-2-1-2-3-0-6-5-6-4-0"
       inkscape:connector-curvature="0"
       sodipodi:nodetypes="ccccc"
       inkscape:transform-center-x="6.7555905"
       inkscape:transform-center-y="3.6393821"
       inkscape:export-xdpi="96"
       inkscape:export-ydpi="96" />
    <path
       style="fill:#00347c;fill-opacity:1;stroke:#00347c;stroke-width:0.19380313px;stroke-linecap:butt;stroke-linejoin:miter;stroke-opacity:1"
       d="m 189.95056,253.85136 -51.41544,44.04582 0.10488,-12.17959 41.45416,-35.51228 z"
       id="path4522-2-1-2-3-0-6-5-6-4-3-3-0"
       inkscape:connector-curvature="0"
       sodipodi:nodetypes="ccccc"
       inkscape:transform-center-x="-0.82572762"
       inkscape:transform-center-y="-8.56027"
       inkscape:export-xdpi="96"
       inkscape:export-ydpi="96" />
    <path
       style="fill:#00347c;fill-opacity:1;stroke:#00347c;stroke-width:0.19380315px;stroke-linecap:butt;stroke-linejoin:miter;stroke-opacity:1"
       d="M 138.74496,297.8971 87.329381,253.85155 97.185771,250.20546 138.64,285.71759 Z"
       id="path4522-2-1-2-3-0-6-5-6-4-3-3-8-5"
       inkscape:connector-curvature="0"
       sodipodi:nodetypes="ccccc"
       inkscape:transform-center-x="-10.10497"
       inkscape:transform-center-y="-0.84423425"
       inkscape:export-xdpi="96"
       inkscape:export-ydpi="96" />
    <path
       style="fill:#7b377b;fill-opacity:1;stroke:#7b377b;stroke-width:0.19380313px;stroke-linecap:butt;stroke-linejoin:miter;stroke-opacity:1"
       d="M 138.94054,199.00508 85.236095,251.16355 83.799868,240.98397 127.09953,198.93086 Z"
       id="path4522-2-1-2-3-0-6-5-6-4-3-0-8"
       inkscape:connector-curvature="0"
       sodipodi:nodetypes="ccccc"
       inkscape:transform-center-x="6.6012863"
       inkscape:transform-center-y="-3.872515"
       inkscape:export-xdpi="96"
       inkscape:export-ydpi="96" />
    <path
       style="fill:#7b377b;fill-opacity:1;stroke:#7b377b;stroke-width:0.19380315px;stroke-linecap:butt;stroke-linejoin:miter;stroke-opacity:1"
       d="m 85.478183,251.10042 -64.967881,-21.23919 10.908721,-6.00152 52.380845,17.12426 z"
       id="path4522-2-1-2-3-0-6-5-6-4-3-3-3-6"
       inkscape:connector-curvature="0"
       sodipodi:nodetypes="ccccc"
       inkscape:transform-center-x="-0.82574769"
       inkscape:transform-center-y="-8.5602743"
       inkscape:export-xdpi="96"
       inkscape:export-ydpi="96" />
    <path
       style="fill:#7b377b;fill-opacity:1;stroke:#7b377b;stroke-width:0.19380315px;stroke-linecap:butt;stroke-linejoin:miter;stroke-opacity:1"
       d="m 20.615334,230.03774 13.552067,-65.28502 8.178181,6.47041 -10.926559,52.63658 z"
       id="path4522-2-1-2-3-0-6-5-6-4-3-3-8-09-2"
       inkscape:connector-curvature="0"
       sodipodi:nodetypes="ccccc"
       inkscape:transform-center-x="-10.104978"
       inkscape:transform-center-y="-0.84423096"
       inkscape:export-xdpi="96"
       inkscape:export-ydpi="96" />
    <path
       style="fill:#c8201e;fill-opacity:1;stroke:#c8201e;stroke-width:0.1938031px;stroke-linecap:butt;stroke-linejoin:miter;stroke-opacity:1"
       d="m 138.11634,125.93053 -31.77644,53.47509 -5.63991,-10.07059 25.62002,-43.11465 z"
       id="path4522-2-1-2-3-0-6-5-6-4-8"
       inkscape:connector-curvature="0"
       sodipodi:nodetypes="ccccc"
       inkscape:transform-center-x="6.755591"
       inkscape:transform-center-y="3.6393783"
       inkscape:export-xdpi="96"
       inkscape:export-ydpi="96" />
    <path
       style="fill:#7b377b;fill-opacity:1;stroke:#7b377b;stroke-width:0.19380316px;stroke-linecap:butt;stroke-linejoin:miter;stroke-opacity:1"
       d="m 33.990108,164.92498 73.343522,-19.10912 -5.85428,10.00043 -59.133838,15.40692 z"
       id="path4522-2-1-2-3-0-6-5-6-4-3-3-8-0-2-8"
       inkscape:connector-curvature="0"
       sodipodi:nodetypes="ccccc"
       inkscape:transform-center-x="-2.4261258"
       inkscape:transform-center-y="8.6122523"
       inkscape:export-xdpi="96"
       inkscape:export-ydpi="96" />
    <path
       style="fill:#7a367a;fill-opacity:0.39215686;stroke:none;stroke-width:0.11501638px;stroke-linecap:butt;stroke-linejoin:miter;stroke-opacity:1"
       d="M 127.09953,198.93086 83.799868,240.98397 31.419023,223.85971 42.345512,171.22321 101.47935,155.81629 Z"
       id="path8815-3-3-5"
       inkscape:connector-curvature="0"
       sodipodi:nodetypes="cccccc"
       inkscape:export-xdpi="96"
       inkscape:export-ydpi="96" />
    <path
       style="fill:#c8201e;fill-opacity:1;stroke:#c8201e;stroke-width:0.19380313px;stroke-linecap:butt;stroke-linejoin:miter;stroke-opacity:1"
       d="m 106.55435,179.33547 -73.343523,-19.10894 8.355377,-6.29821 59.133786,15.40671 z"
       id="path4522-2-1-2-3-0-6-5-6-4-3-8"
       inkscape:connector-curvature="0"
       sodipodi:nodetypes="ccccc"
       inkscape:transform-center-x="6.6012685"
       inkscape:transform-center-y="-3.8725044"
       inkscape:export-xdpi="96"
       inkscape:export-ydpi="96" />
    <path
       style="fill:#00347c;fill-opacity:1;stroke:#00347c;stroke-width:0.19380316px;stroke-linecap:butt;stroke-linejoin:miter;stroke-opacity:1"
       d="m 87.394256,254.08686 19.638854,-71.26744 5.98673,9.92614 -15.833998,57.45998 z"
       id="path4522-2-1-2-3-0-6-5-6-4-3-3-8-0-1"
       inkscape:connector-curvature="0"
       sodipodi:nodetypes="ccccc"
       inkscape:transform-center-x="-2.4261118"
       inkscape:transform-center-y="8.6122459"
       inkscape:export-xdpi="96"
       inkscape:export-ydpi="96" />
    <path
       style="fill:#c71f1c;fill-opacity:0.39215686;stroke:none;stroke-width:0.11501636px;stroke-linecap:butt;stroke-linejoin:miter;stroke-opacity:1"
       d="M 100.69999,169.33503 41.566204,153.92832 30.639513,101.29174 83.020218,84.167278 126.32001,126.22038 Z"
       id="path8815-3-8"
       inkscape:connector-curvature="0"
       sodipodi:nodetypes="cccccc"
       inkscape:export-xdpi="96"
       inkscape:export-ydpi="96" />
    <path
       style="fill:#d0b83e;fill-opacity:1;stroke:#d0b83e;stroke-width:0.19380313px;stroke-linecap:butt;stroke-linejoin:miter;stroke-opacity:1"
       d="m 106.81026,142.54812 -19.639155,-71.267381 9.791674,3.8813 15.834141,57.459861 z"
       id="path4522-2-1-2-3-0-6-5-6-4-3"
       inkscape:connector-curvature="0"
       sodipodi:nodetypes="ccccc"
       inkscape:transform-center-x="6.6012834"
       inkscape:transform-center-y="-3.8725002"
       inkscape:export-xdpi="96"
       inkscape:export-ydpi="96" />
    <path
       style="fill:#7b377b;fill-opacity:1;stroke:#7b377b;stroke-width:0.19380313px;stroke-linecap:butt;stroke-linejoin:miter;stroke-opacity:1"
       d="m 107.11919,145.74569 31.77672,53.47492 -11.79638,-0.28975 -25.62018,-43.11457 z"
       id="path4522-2-1-2-3-0-6-5-6-4-4-2"
       inkscape:connector-curvature="0"
       sodipodi:nodetypes="ccccc"
       inkscape:transform-center-x="6.7555769"
       inkscape:transform-center-y="3.6393819"
       inkscape:export-xdpi="96"
       inkscape:export-ydpi="96" />
    <path
       style="fill:#c8201e;fill-opacity:1;stroke:#c8201e;stroke-width:0.19380315px;stroke-linecap:butt;stroke-linejoin:miter;stroke-opacity:1"
       d="M 33.388121,160.39872 19.835667,95.113706 30.639513,101.29174 41.566204,153.92832 Z"
       id="path4522-2-1-2-3-0-6-5-6-4-3-3-9"
       inkscape:connector-curvature="0"
       sodipodi:nodetypes="ccccc"
       inkscape:transform-center-x="-0.82575189"
       inkscape:transform-center-y="-8.5602742"
       inkscape:export-xdpi="96"
       inkscape:export-ydpi="96" />
    <path
       style="fill:#c8201e;fill-opacity:1;stroke:#c8201e;stroke-width:0.19380315px;stroke-linecap:butt;stroke-linejoin:miter;stroke-opacity:1"
       d="M 19.730872,95.290293 84.698603,74.050815 83.02029,84.167278 30.639513,101.29174 Z"
       id="path4522-2-1-2-3-0-6-5-6-4-3-3-8-7"
       inkscape:connector-curvature="0"
       sodipodi:nodetypes="ccccc"
       inkscape:transform-center-x="-10.104969"
       inkscape:transform-center-y="-0.8442326"
       inkscape:export-xdpi="96"
       inkscape:export-ydpi="96" />
    <path
       style="fill:#1d2322;fill-opacity:1;stroke:#000000;stroke-width:0.10440642px;stroke-linecap:butt;stroke-linejoin:miter;stroke-opacity:1"
       d="m 128.24619,142.35275 19.32422,-0.12027 12.86193,21.31765 -11.19738,19.5534 -19.76904,0.0787 -13.0668,-21.39638 z"
       id="path9362"
       inkscape:connector-curvature="0"
       sodipodi:nodetypes="ccccccc"
       inkscape:export-xdpi="96"
       inkscape:export-ydpi="96" />
  </g>
</svg>
