<?xml version="1.0" encoding="utf-8"?>
<!-- Generator: Adobe Illustrator 23.0.2, SVG Export Plug-In . SVG Version: 6.00 Build 0)  -->
<svg version="1.1" id="Layer_1" xmlns="http://www.w3.org/2000/svg" xmlns:xlink="http://www.w3.org/1999/xlink" x="0px" y="0px"
	 width="360px" height="360px" viewBox="0 0 360 360" style="enable-background:new 0 0 360 360;" xml:space="preserve">
<polygon style="opacity:0.63;fill:#173D7A;" points="165.36,303.21 349.59,187.38 274.55,140.29 157.73,221.67 104.73,287.73 "/>
<g>
	
		<ellipse transform="matrix(0.3303 -0.9439 0.9439 0.3303 41.258 291.361)" style="opacity:0.5;fill:#4C4716;" cx="225.95" cy="116.61" rx="11.08" ry="36.13"/>
	<g>
		<g>
			<g>
				<polygon style="fill:#4F5BDD;" points="239.54,83.65 239.3,77.7 237.92,74.22 237.05,77.1 				"/>
			</g>
			<g>
				<path style="fill:#B992FF;" d="M177.16,84.78l-0.23-5.83c0,0,4.93,4.92,4.93,5.04C181.86,84.11,177.16,84.78,177.16,84.78z"/>
			</g>
			<g>
				<g>
					<path style="fill:#B992FF;" d="M208.78,102.08c17.22-0.41,30.89-9.17,30.53-24.37c-0.36-15.21-14.62-27.2-31.85-26.78
						c-17.22,0.41-30.89,13.07-30.53,28.28C177.3,94.4,191.55,102.49,208.78,102.08z"/>
				</g>
				<g>
					
						<ellipse transform="matrix(0.9997 -0.0239 0.0239 0.9997 -1.9601 5.0108)" style="fill:#B992FF;" cx="208.35" cy="84.39" rx="31.19" ry="27.54"/>
				</g>
				<g>
					<path style="fill:#4F5BDD;" d="M230.12,64.56c5.66,4.84,9.24,11.57,9.42,19.09c0.36,15.21-13.3,27.87-30.53,28.28
						c-8.52,0.2-16.31-2.63-22.06-7.38L230.12,64.56z"/>
				</g>
				<g>
					
						<ellipse transform="matrix(0.9997 -0.0239 0.0239 0.9997 -1.9604 5.0115)" style="fill:#8C66F9;" cx="208.35" cy="84.39" rx="29.8" ry="26.31"/>
				</g>
				<g>
					
						<ellipse transform="matrix(0.9997 -0.0239 0.0239 0.9997 -1.96 5.0105)" style="fill:#7F5FF2;" cx="208.35" cy="84.39" rx="23.93" ry="21.12"/>
				</g>
				<g>
					<path style="fill:#B992FF;" d="M184.44,84.97c-0.01-0.48,0-0.96,0.03-1.44c1.1,10.97,11.67,19.41,24.33,19.11
						c12.66-0.3,22.81-9.24,23.39-20.25c0.05,0.47,0.08,0.95,0.1,1.43c0.28,11.66-10.2,21.37-23.41,21.69
						C195.65,105.82,184.72,96.63,184.44,84.97z"/>
				</g>
				<g>
					<g>
						<path style="fill:#B992FF;" d="M203.77,86.17l4.91-4.54c4.72,1.07,13.53,3.08,20.56,4.73c-1.75,5.26-6.01,9.6-11.59,11.91
							L203.77,86.17z"/>
					</g>
					<g>
						<path style="fill:#B992FF;" d="M211.49,99.88c-0.78,0.09-1.57,0.16-2.38,0.18c-5.77,0.14-11.06-1.76-14.99-4.94l8.01-7.42
							L211.49,99.88z"/>
					</g>
					<g>
						<path style="fill:#B992FF;" d="M213.93,76.75l9.24-8.56c3.11,2.72,5.89,5.71,6.64,9.71L213.93,76.75z"/>
					</g>
				</g>
				<g>
					<path style="fill:#4F5BDD;" d="M209.1,65.8c-13.21,0.32-23.69,10.03-23.41,21.69c0.06,2.36,0.56,4.62,1.42,6.72
						c-1.63-2.77-2.59-5.91-2.67-9.25c-0.28-11.66,10.2-21.37,23.41-21.69c10.53-0.25,19.61,5.55,23,13.82
						C226.79,70.2,218.53,65.58,209.1,65.8z"/>
				</g>
			</g>
			<g>
				<path style="fill:#4F5BDD;" d="M239.3,77.7c0.05,2.26,0.27,3.9-0.27,6.02c-0.69-2.23-2.18-8.9-2.18-8.9l-2.37-5.3l-1.98-1.63
					l-3.35-2.44l-0.28-7.65C235.12,62.68,239.11,69.75,239.3,77.7z"/>
			</g>
		</g>
		<g>
			<g>
				<path style="fill:#4F5BDD;" d="M178.95,76.92l-0.13-1.57c-0.01-0.22-0.18-0.4-0.39-0.4l-0.12,0c-0.21,0.01-0.38,0.19-0.37,0.42
					l0.13,1.57c0.01,0.22,0.18,0.4,0.39,0.4l0.12,0C178.79,77.33,178.95,77.15,178.95,76.92z"/>
			</g>
			<g>
				<path style="fill:#4F5BDD;" d="M181.69,70.92l-0.16-2.82c-0.01-0.26-0.21-0.46-0.45-0.45l-0.27,0.01
					c-0.24,0.01-0.43,0.22-0.42,0.47l0.16,2.82c0.01,0.26,0.21,0.46,0.45,0.45l0.27-0.01C181.5,71.39,181.69,71.17,181.69,70.92z"/>
			</g>
			<g>
				<path style="fill:#4F5BDD;" d="M185.49,65.68l-0.16-2.73c-0.01-0.29-0.23-0.52-0.5-0.51l-0.48,0.01
					c-0.27,0.01-0.49,0.25-0.48,0.54l0.16,2.73c0.01,0.29,0.23,0.52,0.5,0.51l0.48-0.01C185.28,66.21,185.49,65.97,185.49,65.68z"/>
			</g>
			<g>
				<path style="fill:#4F5BDD;" d="M191.17,61.45L191,58.14c-0.01-0.29-0.23-0.52-0.5-0.51l-0.48,0.01
					c-0.27,0.01-0.49,0.25-0.48,0.54l0.17,3.31c0.01,0.29,0.23,0.52,0.5,0.51l0.48-0.01C190.96,61.98,191.18,61.74,191.17,61.45z"/>
			</g>
			<g>
				<path style="fill:#4F5BDD;" d="M196.89,58.68l-0.18-3.81c-0.01-0.29-0.23-0.52-0.5-0.51l-0.48,0.01
					c-0.27,0.01-0.49,0.25-0.48,0.54l0.18,3.81c0.01,0.29,0.23,0.52,0.5,0.51l0.48-0.01C196.69,59.21,196.9,58.97,196.89,58.68z"/>
			</g>
			<g>
				<path style="fill:#4F5BDD;" d="M202.64,56.98l-0.18-3.66c-0.01-0.29-0.23-0.52-0.5-0.51l-0.48,0.01
					c-0.27,0.01-0.49,0.25-0.48,0.54l0.18,3.66c0.01,0.29,0.23,0.52,0.5,0.51l0.48-0.01C202.43,57.51,202.65,57.27,202.64,56.98z"/>
			</g>
			<g>
				<path style="fill:#4F5BDD;" d="M208.41,56.4l-0.18-3.72c-0.01-0.29-0.23-0.52-0.5-0.51l-0.48,0.01
					c-0.27,0.01-0.49,0.25-0.48,0.54l0.18,3.72c0.01,0.29,0.23,0.52,0.5,0.51l0.48-0.01C208.21,56.93,208.42,56.69,208.41,56.4z"/>
			</g>
			<g>
				<path style="fill:#4F5BDD;" d="M214.21,56.53l-0.18-3.49c-0.01-0.29-0.23-0.52-0.5-0.51l-0.48,0.01
					c-0.27,0.01-0.49,0.25-0.48,0.54l0.18,3.49c0.01,0.29,0.23,0.52,0.5,0.51l0.48-0.01C214,57.06,214.21,56.82,214.21,56.53z"/>
			</g>
			<g>
				<path style="fill:#4F5BDD;" d="M220.02,57.79l-0.17-3.38c-0.01-0.29-0.23-0.52-0.5-0.51l-0.48,0.01
					c-0.27,0.01-0.49,0.25-0.48,0.54l0.17,3.38c0.01,0.29,0.23,0.52,0.5,0.51l0.48-0.01C219.82,58.32,220.03,58.08,220.02,57.79z"/>
			</g>
			<g>
				<path style="fill:#4F5BDD;" d="M225.88,60.64l-0.18-3.65c-0.01-0.29-0.23-0.52-0.5-0.51l-0.48,0.01
					c-0.27,0.01-0.49,0.25-0.48,0.54l0.18,3.65c0.01,0.29,0.23,0.52,0.5,0.51l0.48-0.01C225.67,61.17,225.89,60.93,225.88,60.64z"/>
			</g>
		</g>
	</g>
</g>
<path style="fill:#173D7A;" d="M145.02,330.69c-0.36,0-0.71-0.08-0.99-0.23L9.98,253.54c-0.35-0.2-0.55-0.51-0.55-0.86
	c0-0.39,0.24-0.75,0.67-1l21.85-12.69c0.66-0.39,1.61-0.42,2.21-0.08l134.05,76.92c0.35,0.2,0.55,0.51,0.55,0.87
	c0,0.39-0.24,0.75-0.67,1l-21.85,12.69C145.88,330.59,145.44,330.69,145.02,330.69z M33.16,239.68c-0.24,0-0.5,0.05-0.71,0.18
	L10.6,252.55c-0.14,0.08-0.17,0.14-0.17,0.15l134.1,76.88c0.25,0.14,0.82,0.14,1.2-0.07l21.85-12.69c0.14-0.08,0.17-0.14,0.17-0.14
	l-134.1-76.88C33.53,239.72,33.36,239.68,33.16,239.68z"/>
<g>
	<g>
		<g>
			
				<linearGradient id="SVGID_1_" gradientUnits="userSpaceOnUse" x1="1434.3169" y1="-360.8177" x2="1505.1315" y2="-488.3295" gradientTransform="matrix(-0.5023 -0.8647 0.8647 -0.5023 1206.4817 1333.4531)">
				<stop  offset="0" style="stop-color:#5761D7"/>
				<stop  offset="0.0398" style="stop-color:#5C66D9"/>
				<stop  offset="0.0867" style="stop-color:#6A73DF"/>
				<stop  offset="0.1372" style="stop-color:#8289E8"/>
				<stop  offset="0.1899" style="stop-color:#A3A7F5"/>
				<stop  offset="0.2237" style="stop-color:#BCBEFF"/>
			</linearGradient>
			<path style="fill:url(#SVGID_1_);" d="M9.94,231.72l0.05,12.33l0.01,0c-0.01,0.17,0.08,0.33,0.29,0.45l134.05,76.92
				c0.44,0.25,1.2,0.22,1.7-0.08l21.85-12.69c0.24-0.14,0.37-0.32,0.4-0.49l0,0v-0.01c0-0.01,0-0.03,0-0.04l-0.05-12.45l-10.6,6.06
				l-123.7-70.98c-0.44-0.25-1.2-0.22-1.7,0.08l-7.5,4.36L9.94,231.72z"/>
			
				<linearGradient id="SVGID_2_" gradientUnits="userSpaceOnUse" x1="1521.3138" y1="-360.3618" x2="1474.1771" y2="-452.5088" gradientTransform="matrix(-0.5023 -0.8647 0.8647 -0.5023 1206.4817 1333.4531)">
				<stop  offset="0" style="stop-color:#C0BFF6"/>
				<stop  offset="0.2938" style="stop-color:#C5C4F7"/>
				<stop  offset="0.6399" style="stop-color:#D3D2F9"/>
				<stop  offset="1" style="stop-color:#E9E9FD"/>
			</linearGradient>
			<path style="fill:url(#SVGID_2_);" d="M33.9,218.35l134.05,76.92c0.44,0.25,0.38,0.69-0.12,0.98l-21.85,12.69
				c-0.5,0.29-1.27,0.33-1.7,0.08L10.23,232.1c-0.44-0.25-0.38-0.69,0.12-0.98l21.85-12.69C32.7,218.13,33.46,218.1,33.9,218.35z"/>
			<path style="opacity:0.6;fill:#24126A;" d="M38.75,236.89l105.34,59.34c0.78-4.18,1.99-8.41,3.6-12.58L42.54,223.31
				C40.8,227.81,39.52,232.39,38.75,236.89z"/>
			<path style="fill:#24126A;" d="M29.26,225.46L155.66,298c0.3,0.17,0.26,0.47-0.08,0.67l-5.49,3.19c-0.34,0.2-0.87,0.22-1.17,0.05
				L22.52,229.38c-0.3-0.17-0.26-0.47,0.08-0.67l5.49-3.19C28.44,225.32,28.96,225.29,29.26,225.46z"/>
			<path style="fill:#453C9E;" d="M22.52,229.38l2.57,1.47l2.96-1.72c0.34-0.2,0.87-0.22,1.17-0.05l123.84,71.06l2.53-1.47
				c0.34-0.2,0.38-0.5,0.08-0.67L29.26,225.46c-0.3-0.17-0.82-0.15-1.17,0.05l-5.49,3.19C22.26,228.9,22.22,229.21,22.52,229.38z"/>
		</g>
		
			<linearGradient id="SVGID_3_" gradientUnits="userSpaceOnUse" x1="1589.942" y1="-166.205" x2="1442.2406" y2="-427.9182" gradientTransform="matrix(-0.5023 -0.8647 0.8647 -0.5023 1206.4817 1333.4531)">
			<stop  offset="0" style="stop-color:#C0BFF6"/>
			<stop  offset="0.1172" style="stop-color:#D0CFF9"/>
			<stop  offset="0.2627" style="stop-color:#E9E9FD"/>
			<stop  offset="0.5143" style="stop-color:#C0BFF6"/>
			<stop  offset="0.6217" style="stop-color:#D0CFF9"/>
			<stop  offset="0.755" style="stop-color:#E9E9FD"/>
			<stop  offset="1" style="stop-color:#C0BFF6"/>
		</linearGradient>
		<path style="opacity:0.96;fill:url(#SVGID_3_);" d="M347.9,100.54L242.74,40.2l0,0c0.05,18.84-13.12,41.79-29.41,51.25
			L68.42,175.64c-19.15,11.12-34.63,38.1-34.57,60.24v0l105.16,60.34v0c-0.06-22.15,15.42-49.12,34.57-60.24l144.92-84.19
			C334.79,142.33,347.95,119.38,347.9,100.54L347.9,100.54z"/>
		<path style="opacity:0.8;fill:#453C9E;" d="M33.85,235.88l105.16,60.34c0-0.97,0.04-1.96,0.09-2.95l-0.01,0L33.94,232.94
			C33.89,233.93,33.85,234.91,33.85,235.88z"/>
	</g>
	<g style="opacity:0.32;">
		<polygon style="fill:#453C9E;" points="186.13,190.63 209.95,204.3 207.66,205.63 183.84,191.96 		"/>
		<polygon style="fill:#453C9E;" points="173.91,183.62 182.49,188.54 180.2,189.88 171.62,184.95 		"/>
		<polygon style="fill:#453C9E;" points="164.45,178.19 170.27,181.54 167.98,182.87 162.16,179.52 		"/>
		<polygon style="fill:#453C9E;" points="202.2,193.81 215.18,201.26 212.89,202.59 199.91,195.14 		"/>
		<polygon style="fill:#453C9E;" points="182.66,182.6 198.56,191.72 196.27,193.06 180.37,183.93 		"/>
		<polygon style="fill:#453C9E;" points="173.19,177.17 179.02,180.51 176.73,181.84 170.9,178.5 		"/>
		<polygon style="fill:#453C9E;" points="164.18,172 170.01,175.34 167.72,176.67 161.89,173.33 		"/>
		<polygon style="fill:#453C9E;" points="211.03,192.83 220.42,198.22 218.12,199.55 208.73,194.16 		"/>
		<polygon style="fill:#453C9E;" points="204.18,188.9 207.39,190.74 205.1,192.07 201.89,190.23 		"/>
		<polygon style="fill:#453C9E;" points="194.71,183.47 200.54,186.81 198.25,188.14 192.42,184.8 		"/>
		<polygon style="fill:#453C9E;" points="190.99,175.29 225.65,195.18 223.36,196.51 188.7,176.62 		"/>
		<polygon style="fill:#453C9E;" points="178.78,168.28 187.35,173.2 185.06,174.53 176.48,169.61 		"/>
		<polygon style="fill:#453C9E;" points="221.49,186.75 230.89,192.14 228.59,193.47 219.2,188.08 		"/>
		<polygon style="fill:#453C9E;" points="199.46,174.1 217.86,184.66 215.56,185.99 197.17,175.43 		"/>
		<polygon style="fill:#453C9E;" points="189.99,168.67 195.82,172.02 193.53,173.35 187.7,170 		"/>
		<polygon style="fill:#453C9E;" points="216.91,178.07 236.12,189.1 233.83,190.43 214.62,179.4 		"/>
		<polygon style="fill:#453C9E;" points="199.37,168.01 213.27,175.98 210.98,177.31 197.08,169.34 		"/>
		<polygon style="fill:#453C9E;" points="186.34,160.54 195.73,165.92 193.44,167.25 184.05,161.87 		"/>
		<polygon style="fill:#453C9E;" points="234.86,182.33 241.35,186.06 239.06,187.39 232.57,183.66 		"/>
		<polygon style="fill:#453C9E;" points="222.65,175.32 231.23,180.24 228.93,181.57 220.36,176.65 		"/>
		<polygon style="fill:#453C9E;" points="205.19,165.31 219.01,173.24 216.72,174.57 202.9,166.64 		"/>
		<polygon style="fill:#453C9E;" points="226.71,171.61 246.59,183.01 244.3,184.35 224.42,172.94 		"/>
		<polygon style="fill:#453C9E;" points="204.45,158.83 223.07,169.52 220.78,170.85 202.16,160.17 		"/>
		<polygon style="fill:#453C9E;" points="194.98,153.4 200.81,156.75 198.52,158.08 192.69,154.73 		"/>
		<polygon style="fill:#453C9E;" points="185.9,148.19 191.72,151.53 189.43,152.86 183.6,149.52 		"/>
		<polygon style="fill:#453C9E;" points="239.91,173.14 251.82,179.97 249.53,181.3 237.62,174.47 		"/>
		<polygon style="fill:#453C9E;" points="137.81,162.91 121.3,153.43 119.01,154.77 135.52,164.24 		"/>
		<polygon style="fill:#453C9E;" points="139.51,157.84 126.53,150.39 124.24,151.72 137.22,159.17 		"/>
		<polygon style="fill:#453C9E;" points="141.16,152.74 131.77,147.35 129.48,148.68 138.87,154.07 		"/>
		<polygon style="fill:#453C9E;" points="150.66,152.15 137,144.31 134.71,145.64 148.37,153.48 		"/>
		<polygon style="fill:#453C9E;" points="151.63,146.66 142.24,141.27 139.95,142.6 149.34,147.99 		"/>
		<polygon style="fill:#453C9E;" points="159.38,145.06 147.47,138.23 145.18,139.56 157.09,146.39 		"/>
		<polygon style="fill:#453C9E;" points="159.2,138.91 152.71,135.19 150.42,136.52 156.9,140.24 		"/>
		<polygon style="fill:#453C9E;" points="170.52,139.36 157.94,132.15 155.65,133.48 168.22,140.69 		"/>
		<polygon style="fill:#453C9E;" points="175.08,135.94 163.18,129.11 160.88,130.44 172.79,137.27 		"/>
		<polygon style="fill:#453C9E;" points="231.21,168.15 236.27,171.05 233.98,172.38 228.92,169.48 		"/>
		<polygon style="fill:#453C9E;" points="216.17,159.52 227.57,166.06 225.28,167.39 213.88,160.85 		"/>
		<polygon style="fill:#453C9E;" points="230.41,136.19 249.65,147.23 247.36,148.56 228.12,137.52 		"/>
		<polygon style="fill:#453C9E;" points="217.23,128.63 224.81,132.97 222.52,134.3 214.94,129.96 		"/>
	</g>
</g>
<ellipse transform="matrix(0.3303 -0.9439 0.9439 0.3303 -65.3186 277.8137)" style="opacity:0.3;fill:#0F054C;" cx="163.12" cy="184.94" rx="14.27" ry="46.52"/>
<g>
	<g>
		<g>
			<polygon style="fill:#4058DD;" points="180.61,142.5 180.31,134.85 178.53,130.37 177.4,134.08 			"/>
		</g>
		<g>
			<path style="fill:#A580FF;" d="M100.3,143.97l-0.3-7.51c0,0,6.35,6.34,6.35,6.49C106.36,143.1,100.3,143.97,100.3,143.97z"/>
		</g>
		<g>
			<g>
				<path style="fill:#A580FF;" d="M141.01,166.23c22.17-0.53,39.77-11.8,39.3-31.38s-18.82-35.01-41-34.48
					c-22.17,0.53-39.77,16.83-39.3,36.41C100.48,156.35,118.83,166.77,141.01,166.23z"/>
			</g>
			<g>
				
					<ellipse transform="matrix(0.9997 -0.0239 0.0239 0.9997 -3.395 3.4045)" style="fill:#A580FF;" cx="140.46" cy="143.47" rx="40.16" ry="35.45"/>
			</g>
			<g>
				<path style="fill:#4058DD;" d="M168.48,117.93c7.28,6.23,11.9,14.89,12.13,24.58c0.47,19.58-17.13,35.88-39.3,36.41
					c-10.97,0.26-21-3.39-28.4-9.51L168.48,117.93z"/>
			</g>
			<g>
				
					<ellipse transform="matrix(0.9997 -0.0239 0.0239 0.9997 -3.3938 3.4032)" style="fill:#7455F9;" cx="140.46" cy="143.47" rx="38.37" ry="33.87"/>
			</g>
			<g>
				
					<ellipse transform="matrix(0.9997 -0.0239 0.0239 0.9997 -3.3945 3.404)" style="fill:#664EF2;" cx="140.46" cy="143.47" rx="30.8" ry="27.19"/>
			</g>
			<g>
				<path style="fill:#A580FF;" d="M109.67,144.2c-0.01-0.62,0-1.24,0.03-1.85c1.42,14.12,15.02,24.99,31.32,24.6
					c16.3-0.39,29.37-11.89,30.11-26.07c0.06,0.61,0.11,1.23,0.12,1.85c0.36,15.01-13.14,27.52-30.14,27.92
					C124.1,171.06,110.03,159.22,109.67,144.2z"/>
			</g>
			<g>
				<g>
					<path style="fill:#A580FF;" d="M134.55,145.76l6.32-5.85c6.08,1.38,17.42,3.96,26.47,6.09c-2.25,6.78-7.74,12.36-14.92,15.33
						L134.55,145.76z"/>
				</g>
				<g>
					<path style="fill:#A580FF;" d="M144.49,163.4c-1,0.12-2.02,0.2-3.06,0.23c-7.43,0.18-14.24-2.26-19.3-6.36l10.31-9.55
						L144.49,163.4z"/>
				</g>
				<g>
					<path style="fill:#A580FF;" d="M147.64,133.63l11.9-11.02c4,3.5,7.58,7.35,8.54,12.5L147.64,133.63z"/>
				</g>
			</g>
			<g>
				<path style="fill:#4058DD;" d="M141.42,119.53c-17.01,0.41-30.5,12.91-30.14,27.92c0.07,3.04,0.72,5.95,1.83,8.66
					c-2.1-3.57-3.34-7.61-3.44-11.91c-0.36-15.01,13.14-27.51,30.14-27.92c13.56-0.32,25.25,7.14,29.62,17.79
					C164.19,125.19,153.55,119.24,141.42,119.53z"/>
			</g>
		</g>
		<g>
			<path style="fill:#4058DD;" d="M180.31,134.85c0.07,2.91,0.34,5.02-0.34,7.75c-0.88-2.87-2.8-11.46-2.8-11.46l-3.06-6.83
				l-2.55-2.1l-4.31-3.14l-0.36-9.85C174.91,115.51,180.06,124.61,180.31,134.85z"/>
		</g>
	</g>
	<g>
		<g>
			<path style="fill:#4058DD;" d="M102.6,133.85l-0.17-2.02c-0.01-0.29-0.23-0.52-0.5-0.51l-0.15,0c-0.27,0.01-0.49,0.25-0.48,0.54
				l0.17,2.02c0.01,0.29,0.23,0.52,0.5,0.51l0.15,0C102.39,134.38,102.61,134.14,102.6,133.85z"/>
		</g>
		<g>
			<path style="fill:#4058DD;" d="M106.13,126.12l-0.21-3.63c-0.01-0.33-0.26-0.59-0.57-0.58l-0.35,0.01
				c-0.31,0.01-0.55,0.28-0.55,0.61l0.21,3.63c0.01,0.33,0.26,0.59,0.57,0.58l0.35-0.01C105.89,126.72,106.14,126.45,106.13,126.12z
				"/>
		</g>
		<g>
			<path style="fill:#4058DD;" d="M111.02,119.38l-0.2-3.52c-0.01-0.37-0.3-0.67-0.65-0.66l-0.61,0.01
				c-0.35,0.01-0.63,0.32-0.62,0.69l0.2,3.52c0.01,0.37,0.3,0.67,0.65,0.66l0.61-0.01C110.75,120.06,111.03,119.75,111.02,119.38z"
				/>
		</g>
		<g>
			<path style="fill:#4058DD;" d="M118.34,113.93l-0.22-4.26c-0.01-0.37-0.3-0.67-0.65-0.66l-0.61,0.01
				c-0.35,0.01-0.63,0.32-0.62,0.69l0.22,4.26c0.01,0.37,0.3,0.67,0.65,0.66l0.61-0.01C118.07,114.61,118.35,114.31,118.34,113.93z"
				/>
		</g>
		<g>
			<path style="fill:#4058DD;" d="M125.71,110.36l-0.24-4.91c-0.01-0.37-0.3-0.67-0.65-0.66l-0.61,0.01
				c-0.35,0.01-0.63,0.32-0.62,0.69l0.24,4.91c0.01,0.37,0.3,0.67,0.65,0.66l0.61-0.01C125.44,111.04,125.71,110.73,125.71,110.36z"
				/>
		</g>
		<g>
			<path style="fill:#4058DD;" d="M133.1,108.18l-0.23-4.72c-0.01-0.37-0.3-0.67-0.65-0.66l-0.61,0.01
				c-0.35,0.01-0.63,0.32-0.62,0.69l0.23,4.72c0.01,0.37,0.3,0.67,0.65,0.66l0.61-0.01C132.84,108.86,133.11,108.55,133.1,108.18z"
				/>
		</g>
		<g>
			<path style="fill:#4058DD;" d="M140.54,107.43l-0.24-4.79c-0.01-0.37-0.3-0.67-0.65-0.66l-0.61,0.01
				c-0.35,0.01-0.63,0.32-0.62,0.69l0.24,4.79c0.01,0.37,0.3,0.67,0.65,0.66l0.61-0.01C140.27,108.11,140.55,107.81,140.54,107.43z"
				/>
		</g>
		<g>
			<path style="fill:#4058DD;" d="M147.99,107.59l-0.23-4.49c-0.01-0.37-0.3-0.67-0.65-0.66l-0.61,0.01
				c-0.35,0.01-0.63,0.32-0.62,0.69l0.23,4.49c0.01,0.37,0.3,0.67,0.65,0.66l0.61-0.01C147.73,108.27,148,107.96,147.99,107.59z"/>
		</g>
		<g>
			<path style="fill:#4058DD;" d="M155.48,109.22l-0.22-4.35c-0.01-0.37-0.3-0.67-0.65-0.66l-0.61,0.01
				c-0.35,0.01-0.63,0.32-0.62,0.69l0.22,4.35c0.01,0.37,0.3,0.67,0.65,0.66l0.61-0.01C155.22,109.9,155.49,109.6,155.48,109.22z"/>
		</g>
		<g>
			<path style="fill:#4058DD;" d="M163.02,112.88l-0.23-4.7c-0.01-0.37-0.3-0.67-0.65-0.66l-0.61,0.01
				c-0.35,0.01-0.63,0.32-0.62,0.69l0.23,4.7c0.01,0.37,0.3,0.67,0.65,0.66l0.61-0.01C162.76,113.56,163.03,113.25,163.02,112.88z"
				/>
		</g>
	</g>
</g>
<path style="fill:#173D7A;" d="M280.69,290.81c-7.69,0-15.38-1.69-21.24-5.07c-5.77-3.33-8.95-7.79-8.95-12.55
	c0-4.76,3.18-9.22,8.95-12.55c11.71-6.76,30.76-6.76,42.47,0c5.77,3.33,8.95,7.79,8.95,12.55c0,4.76-3.18,9.22-8.94,12.55l0,0
	C296.07,289.12,288.38,290.81,280.69,290.81z M280.68,256.56c-7.51,0-15.01,1.65-20.73,4.95c-5.44,3.14-8.44,7.29-8.44,11.68
	c0,4.39,3,8.53,8.44,11.68c11.43,6.6,30.03,6.6,41.46,0l0,0c5.44-3.14,8.44-7.29,8.44-11.68c0-4.39-3-8.53-8.44-11.68
	C295.7,258.21,288.19,256.56,280.68,256.56z"/>
<g>
	<g>
		<g>
			<polygon style="fill:#1F3CDD;" points="316.74,244.49 316.47,237.77 314.91,233.84 313.92,237.09 			"/>
		</g>
		<g>
			<path style="fill:#8B5AFF;" d="M246.23,245.77l-0.26-6.59c0,0,5.57,5.56,5.58,5.7C251.55,245.01,246.23,245.77,246.23,245.77z"/>
		</g>
		<g>
			<g>
				<path style="fill:#8B5AFF;" d="M281.97,265.32c19.47-0.47,34.92-10.36,34.5-27.55c-0.41-17.19-16.53-30.74-35.99-30.27
					c-19.47,0.47-34.92,14.78-34.5,31.96S262.5,265.79,281.97,265.32z"/>
			</g>
			<g>
				
					<ellipse transform="matrix(0.9997 -0.0239 0.0239 0.9997 -5.7932 6.8099)" style="fill:#8B5AFF;" cx="281.49" cy="245.33" rx="35.26" ry="31.13"/>
			</g>
			<g>
				<path style="fill:#1F3CDD;" d="M306.09,222.91c6.39,5.47,10.44,13.08,10.65,21.58c0.41,17.19-15.04,31.5-34.5,31.96
					c-9.63,0.23-18.44-2.97-24.93-8.35L306.09,222.91z"/>
			</g>
			<g>
				
					<ellipse transform="matrix(0.9997 -0.0239 0.0239 0.9997 -5.7939 6.8107)" style="fill:#5730F9;" cx="281.49" cy="245.33" rx="33.69" ry="29.74"/>
			</g>
			<g>
				
					<ellipse transform="matrix(0.9997 -0.0239 0.0239 0.9997 -5.7905 6.8066)" style="fill:#482AF2;" cx="281.49" cy="245.33" rx="27.04" ry="23.87"/>
			</g>
			<g>
				<path style="fill:#8B5AFF;" d="M254.46,245.98c-0.01-0.55,0-1.09,0.03-1.63c1.24,12.4,13.19,21.94,27.5,21.6
					c14.31-0.34,25.78-10.44,26.43-22.89c0.05,0.54,0.1,1.08,0.11,1.62c0.32,13.18-11.53,24.16-26.46,24.51
					C267.13,269.56,254.77,259.16,254.46,245.98z"/>
			</g>
			<g>
				<g>
					<path style="fill:#8B5AFF;" d="M276.3,247.35l5.54-5.14c5.34,1.21,15.29,3.48,23.24,5.35c-1.98,5.95-6.8,10.85-13.09,13.46
						L276.3,247.35z"/>
				</g>
				<g>
					<path style="fill:#8B5AFF;" d="M285.03,262.83c-0.88,0.11-1.78,0.18-2.69,0.2c-6.53,0.16-12.5-1.98-16.95-5.58l9.05-8.38
						L285.03,262.83z"/>
				</g>
				<g>
					<path style="fill:#8B5AFF;" d="M287.8,236.7l10.45-9.68c3.51,3.07,6.65,6.45,7.5,10.97L287.8,236.7z"/>
				</g>
			</g>
			<g>
				<path style="fill:#1F3CDD;" d="M282.33,224.32c-14.93,0.36-26.78,11.33-26.46,24.51c0.06,2.67,0.63,5.22,1.6,7.6
					c-1.85-3.13-2.93-6.68-3.02-10.45c-0.32-13.18,11.53-24.16,26.46-24.51c11.91-0.29,22.17,6.27,26,15.62
					C302.33,229.29,292.99,224.07,282.33,224.32z"/>
			</g>
		</g>
		<g>
			<path style="fill:#1F3CDD;" d="M316.47,237.77c0.06,2.56,0.3,4.41-0.3,6.8c-0.78-2.52-2.46-10.06-2.46-10.06l-2.68-5.99
				l-2.24-1.84l-3.78-2.76l-0.31-8.64C311.74,220.79,316.26,228.78,316.47,237.77z"/>
		</g>
	</g>
	<g>
		<g>
			<path style="fill:#1F3CDD;" d="M248.25,236.89l-0.15-1.77c-0.01-0.25-0.2-0.46-0.44-0.45l-0.13,0c-0.24,0.01-0.43,0.22-0.42,0.47
				l0.15,1.77c0.01,0.25,0.2,0.46,0.44,0.45l0.13,0C248.07,237.36,248.26,237.14,248.25,236.89z"/>
		</g>
		<g>
			<path style="fill:#1F3CDD;" d="M251.35,230.1l-0.18-3.18c-0.01-0.29-0.23-0.52-0.5-0.51l-0.31,0.01
				c-0.27,0.01-0.49,0.25-0.48,0.54l0.18,3.18c0.01,0.29,0.23,0.52,0.5,0.51l0.31-0.01C251.14,230.63,251.36,230.39,251.35,230.1z"
				/>
		</g>
		<g>
			<path style="fill:#1F3CDD;" d="M255.64,224.18l-0.18-3.09c-0.01-0.33-0.26-0.59-0.57-0.58l-0.54,0.01
				c-0.31,0.01-0.55,0.28-0.54,0.61l0.18,3.09c0.01,0.33,0.26,0.59,0.57,0.58l0.54-0.01C255.41,224.78,255.65,224.51,255.64,224.18z
				"/>
		</g>
		<g>
			<path style="fill:#1F3CDD;" d="M262.07,219.41l-0.2-3.74c-0.01-0.33-0.26-0.59-0.57-0.58l-0.54,0.01
				c-0.31,0.01-0.55,0.28-0.54,0.61l0.2,3.74c0.01,0.33,0.26,0.59,0.57,0.58l0.54-0.01C261.84,220,262.08,219.73,262.07,219.41z"/>
		</g>
		<g>
			<path style="fill:#1F3CDD;" d="M268.54,216.27l-0.21-4.31c-0.01-0.33-0.26-0.59-0.57-0.58l-0.54,0.01
				c-0.31,0.01-0.55,0.28-0.54,0.61l0.21,4.31c0.01,0.33,0.26,0.59,0.57,0.58l0.54-0.01C268.3,216.86,268.54,216.59,268.54,216.27z"
				/>
		</g>
		<g>
			<path style="fill:#1F3CDD;" d="M275.03,214.35l-0.2-4.14c-0.01-0.33-0.26-0.59-0.57-0.58l-0.54,0.01
				c-0.31,0.01-0.55,0.28-0.54,0.61l0.2,4.14c0.01,0.33,0.26,0.59,0.57,0.58l0.54-0.01C274.8,214.95,275.04,214.68,275.03,214.35z"
				/>
		</g>
		<g>
			<path style="fill:#1F3CDD;" d="M281.56,213.7l-0.21-4.21c-0.01-0.33-0.26-0.59-0.57-0.58l-0.54,0.01
				c-0.31,0.01-0.55,0.28-0.54,0.61l0.21,4.21c0.01,0.33,0.26,0.59,0.57,0.58l0.54-0.01C281.32,214.3,281.57,214.03,281.56,213.7z"
				/>
		</g>
		<g>
			<path style="fill:#1F3CDD;" d="M288.1,213.84l-0.2-3.94c-0.01-0.33-0.26-0.59-0.57-0.58l-0.54,0.01
				c-0.31,0.01-0.55,0.28-0.54,0.61l0.2,3.94c0.01,0.33,0.26,0.59,0.57,0.58l0.54-0.01C287.87,214.44,288.11,214.17,288.1,213.84z"
				/>
		</g>
		<g>
			<path style="fill:#1F3CDD;" d="M294.68,215.27l-0.2-3.82c-0.01-0.33-0.26-0.59-0.57-0.58l-0.54,0.01
				c-0.31,0.01-0.55,0.28-0.54,0.61l0.2,3.82c0.01,0.33,0.26,0.59,0.57,0.58l0.54-0.01C294.45,215.87,294.69,215.6,294.68,215.27z"
				/>
		</g>
		<g>
			<path style="fill:#1F3CDD;" d="M301.3,218.48l-0.2-4.13c-0.01-0.33-0.26-0.59-0.57-0.58l-0.54,0.01
				c-0.31,0.01-0.55,0.28-0.54,0.61l0.2,4.13c0.01,0.33,0.26,0.59,0.57,0.58l0.54-0.01C301.07,219.08,301.31,218.81,301.3,218.48z"
				/>
		</g>
	</g>
</g>
</svg>
