<?xml version="1.0" encoding="utf-8"?>
<!-- Generator: Adobe Illustrator 23.0.2, SVG Export Plug-In . SVG Version: 6.00 Build 0)  -->
<svg version="1.1" id="Layer_1" xmlns="http://www.w3.org/2000/svg" xmlns:xlink="http://www.w3.org/1999/xlink" x="0px" y="0px"
	 width="360px" height="360px" viewBox="0 0 360 360" style="enable-background:new 0 0 360 360;" xml:space="preserve">
<g>
	<polygon style="fill:#BBD4FF;" points="344.06,225.85 342.36,257.55 339.18,300.34 334.42,300.68 328.64,261.82 320.64,228.93 	"/>
	<polygon style="fill:#BBD4FF;" points="334.59,302.68 339.92,304.89 342.31,302.13 339.55,299.74 334.41,300.11 	"/>
</g>
<g>
	<polygon style="fill:#BBD4FF;" points="307.58,223.48 306.54,242.5 309.64,299.06 314.4,299.3 321.55,262.2 327.85,221.52 	"/>
	<polygon style="fill:#BBD4FF;" points="314.28,300.19 308.99,302.51 306.55,300.92 309.25,298.47 314.41,298.73 	"/>
</g>
<g>
	<path style="fill:#1C3896;" d="M333.47,165.06l-14.92-0.98c0,0-8.23,1.22-13.03,21.08c-2.67,11.05-2.91,28.29-2.6,41.42
		c0.43,1.86,2.8,9.97,11.37,8.22c14.7-3,22.49-5.71,28.98-4.78c5.54,0.97,4.76-6.57,3.92-12.32l-2.92-17.76L333.47,165.06z"/>
</g>
<g>
	<path style="fill:#CE7361;" d="M329.84,146.69c-3.78-0.67-7.66-1.25-11.38-0.35c-0.81,0.2-1.68,0.52-2.1,1.25
		c-0.16,0.28-0.24,0.6-0.31,0.92c-0.8,3.56-1.79,8.82,0.66,11.96c0.47,0.6,1.08,1.07,1.73,1.44c0.87,0.5,1.83,0.82,2.82,0.97
		c-0.17,0.88-0.41,1.75-0.73,2.59c0.91,1.26,4.92,1.25,5.6-0.02c0-1.07-0.01-2.15-0.01-3.22c0.48-0.22,0.94-0.48,1.37-0.78
		c1.66-1.2,2.72-2.95,3.29-4.89c0.63-2.11,1.55-4.13,2.11-6.28c0.21-0.78,0.36-1.67-0.08-2.35c-0.46-0.73-1.41-0.94-2.26-1.09
		C330.32,146.77,330.08,146.73,329.84,146.69z"/>
	<path style="fill:#33435A;" d="M317.46,149.21c1.8-1.27,4.56-1.89,6.3-1.84c5.28,0.16,7.36,3.95,7.85,8.78
		c1.37-1.9,4-4.33,4.06-6.71c0.05-1.95-0.32-4.58-1.48-6.21c-1.08-1.53-3.72-2.28-5.3-3.13c-1.49-0.8-2.99-1.59-4.48-2.39
		c-0.31-0.17-0.63-0.33-0.98-0.38c-0.41-0.05-0.83,0.07-1.22,0.19c-3.41,1.03-6.82,2.07-10.23,3.1c-0.65,0.2-1.4,0.48-1.62,1.13
		c-0.13,0.39-0.03,0.83,0.08,1.23c0.47,1.77,1.29,3.57,1.55,5.38c0.25,1.04,1.1,6.42,2.94,5.72c0.51-0.92,0.55-2.02,0.93-3
		C316.15,150.34,316.72,149.73,317.46,149.21z"/>
</g>
<polygon style="fill:#1C3896;" points="318.55,164.08 313.12,165.98 293.93,187.82 293.03,194.79 303.27,210.23 305.62,204.32 
	301.07,192.79 307.33,187.99 315.13,168.29 "/>
<polygon style="fill:#1C3896;" points="330.37,166.46 340.13,155.01 336.49,125.21 340.9,123.05 348.25,153.13 346.69,160.77 
	335.9,177.04 "/>
<polygon style="fill:#CE7361;" points="339.95,123.51 339.84,120.77 336.51,116.73 334.44,118.75 336,122.4 335.16,123.71 
	336.49,125.21 "/>
<polygon style="fill:#FFBFA4;" points="74.45,159.49 79.38,156.05 78.68,152.91 73.69,154.63 71.28,156.2 71.28,157.94 "/>
<g id="XMLID_547_">
	<g id="XMLID_551_">
		<path style="fill:#06529C;" d="M27.66,292.3c-0.51-0.56-1.1-0.86-1.77-0.76c-0.64,0.1-1.22,0.54-1.49,1.12
			c-0.18,0.4-0.22,0.84-0.26,1.28c-0.19,2.25-0.17,7.58,2.82,8.35c1.26,0.32,2.3-1.69,2.63-2.82
			C30.1,297.77,29.35,294.17,27.66,292.3z"/>
	</g>
	<g id="XMLID_549_">
		<path style="fill:#FFBFA4;" d="M28.72,258.41l-0.16,13.7c0.18,6.09-0.77,12.21-0.59,18.3c0.04,1.4,0.41,2.88,0.05,4.26
			c-0.34,1.36-1.45,1.6-2.58,0.91c-1.52-0.92-1.27-3.07-1.52-4.64c-0.69-4.31-1.51-8.6-2.23-12.91c-0.36-2.11,0.38-5.07,0.22-7.21
			l-2.21-11.49L28.72,258.41z"/>
	</g>
</g>
<g id="XMLID_546_">
	<polygon style="fill:#1C3896;" points="13.06,236.26 19.03,262.76 20.29,287.78 29.75,287.57 32.32,217.58 13.99,217.91 	"/>
</g>
<g id="XMLID_543_">
	<g id="XMLID_545_">
		<path style="fill:#06529C;" d="M41.18,290.69c-0.53-0.53-1.13-0.8-1.8-0.66c-0.64,0.14-1.2,0.61-1.44,1.21
			c-0.16,0.41-0.18,0.86-0.2,1.29c-0.09,2.26,0.16,7.6,3.17,8.19c1.27,0.25,2.27-0.71,2.55-1.86
			C43.91,297.14,42.96,292.46,41.18,290.69z"/>
	</g>
	<g id="XMLID_544_">
		<path style="fill:#FFBFA4;" d="M36.2,260.33l0.8,13.68c0.07,3.8,0.57,7.58,0.97,11.35c0.37,3.51-0.2,7.16,1.63,10.35
			c0.57,1,1.74,1.67,2.55,0.45c0.63-0.94,0.25-2.5,0.37-3.56c0.49-4.34,1.1-8.66,1.62-13c0.26-2.13-0.62-5.05-0.56-7.19l1.67-11.58
			L36.2,260.33z"/>
	</g>
</g>
<g id="XMLID_542_">
	<polygon style="fill:#1C3896;" points="48.17,234.64 48.94,260.36 44.9,286.37 35.28,286.66 35.7,258.51 30.61,235.17 28.9,219.89 
		44.17,218.09 	"/>
</g>
<g id="XMLID_540_">
	<polygon style="fill:#BBD4FF;" points="36.09,165.45 19.64,165.06 10.11,182.79 13.5,199.4 14.1,219.28 37.56,219.6 45.28,218.35 
		43.23,197.11 44.3,171.19 	"/>
</g>
<g id="XMLID_539_">
	<polygon style="fill:#BBD4FF;" points="19.1,166.28 5.75,186.62 7.76,197.94 28.43,212.27 32.32,208.87 18.5,191.39 19.04,180.35 	
		"/>
</g>
<g id="XMLID_538_">
	<polygon style="fill:#BBD4FF;" points="35.09,176.93 50.9,182.63 60.04,180.38 75.84,159.65 70.34,157.25 53.74,171.5 38.72,167 	
		"/>
</g>
<g id="XMLID_536_">
	<polygon style="fill:#BBD4FF;" points="24.51,165.36 29.61,172.57 32.01,172.37 36.01,165.06 	"/>
</g>
<g id="XMLID_535_">
	<polygon style="fill:#FFBFA4;" points="28.55,209.73 28.46,212.5 33.36,214.29 36.18,212.15 36.18,208.92 33.46,208.77 
		33.37,208.06 32.48,207.48 	"/>
</g>
<path style="fill:#FFBFA4;" d="M30.54,150.88c1.07-0.94,2.29-1.11,3.65-1.12c0.64,0,0.86,0.16,1.19,0.1
	c0.15-0.03,0.32-0.1,0.57-0.25c0.49-0.3,0.92-1.1,1.15-1.74c1.26,0.8,2.18,2.24,2.43,4.43c0.27,2.39,0.27,4.9-0.55,7.29
	c-0.82,2.39-2.56,4.63-4.83,5.52c-0.13,0.05-0.26,0.1-0.39,0.14c-0.97,0.32-1.89,0.38-2.75,0.25l-2.85-1.36
	c-0.14-0.12-0.28-0.25-0.41-0.38C26.81,159.69,27.82,153.28,30.54,150.88z"/>
<path style="fill:#263548;" d="M6.83,200.57c0.22,1.27,0.87,2.42,1.77,3.35c0.07-0.44,0.15-0.87,0.22-1.3
	c-0.08,0.43-0.15,0.86-0.22,1.3c0.58,0.6,1.26,1.11,1.99,1.5c1.87,1,4.03,1.31,6.15,1.31c1.7,0,3.42-0.2,5.07,0.17
	c1.66,0.36,3.3,1.44,3.72,3.09c0.23,0.91,0.16,2.05,0.94,2.56c0.37,0.24,0.83,0.26,1.27,0.27c1.34,0.04,2.87,0,3.77-0.99
	c1.39-1.54,0.58-4.63,2.46-5.51c0.55-0.26,1.19-0.22,1.79-0.32c2.55-0.43,3.8-3.32,3.55-5.96c-0.05-0.55-0.16-1.09-0.34-1.59
	c-1.05-2.94-3.49-5.12-5.34-7.64c-3.61-4.91-6.05-11.47-3.83-17.29c0.21-0.55,0.44-1.1,0.59-1.66c0.08-0.31,0.13-0.63,0.14-0.95
	c0.03-1.73-1.26-3.16-2.09-4.68c-0.08-0.14-0.15-0.29-0.22-0.45c-0.17-0.38-0.31-0.81-0.43-1.27c-0.02-0.07-0.03-0.14-0.05-0.21
	c-2.56-2.55-3.59-7.3-1.9-10.84c0.1-0.2,0.2-0.4,0.3-0.59c-0.11,0.19-0.21,0.39-0.3,0.59c-1.68,3.54-0.66,8.29,1.9,10.84
	c-0.94-4.06,0.08-10.48,2.79-12.87c1.07-0.94,2.29-1.11,3.65-1.12c0.64,0,0.86,0.16,1.19,0.1c0.15-0.03,0.32-0.1,0.57-0.25
	c0.49-0.3,0.92-1.1,1.15-1.74c1.26,0.8,2.18,2.24,2.43,4.43c0.28,2.39,0.27,4.9-0.55,7.29c-0.82,2.39-2.56,4.63-4.83,5.52
	c-0.13,0.05-0.26,0.1-0.39,0.14c0.11,0.2,0.25,0.41,0.44,0.61c1.24,1.36,3.23,1.68,5.06,1.92c0.22,0.03,0.45,0.06,0.66-0.02
	c0.34-0.13,0.52-0.53,0.52-0.9c0-0.37-0.13-0.72-0.23-1.07c-1.06-3.7,0.82-7.92,1.13-11.65c0.31-3.72-0.45-7.77-3.44-10.29
	c-0.51,0.14-1,0.33-1.47,0.56c-0.05-0.06-0.09-0.12-0.14-0.18c-4.32-5.19-10.43-0.75-13.71,3.21c-2.71,3.27-4.96,7.02-6,11.17
	c-0.97,3.88-1.29,9.58-0.88,13.54c0.24,2.31,1.15,4.59,1.64,6.85c0.3,1.41,0.44,2.82,0.14,4.24c-0.63,2.95-2.96,5.11-5.24,7.16
	c-0.21,0.53-0.41,1.07-0.62,1.62c-0.21,0.55-0.41,1.1-0.61,1.67c-0.13,0.36-0.26,0.73-0.38,1.11c0.12-0.37,0.25-0.74,0.38-1.11
	c0.2-0.56,0.41-1.12,0.61-1.67c0.21-0.55,0.41-1.09,0.62-1.62c-0.32,0.28-0.63,0.56-0.94,0.84C8.75,194.09,6.26,197.18,6.83,200.57z
	 M29.56,149.19c0.34-0.22,0.68-0.42,1.03-0.6C30.25,148.76,29.9,148.96,29.56,149.19z"/>
<rect x="263.25" y="56.87" style="fill:#BBD4FF;" width="69.35" height="54.13"/>
<g>
	<path style="fill:#1C3896;" d="M260.05,85.63l0.33,45.62l66.4-0.48c5.02-0.04,9.06-4.42,9.02-9.78l-0.26-35.9l-37.58,23.81
		L260.05,85.63z"/>
</g>
<g>
	<rect x="275.8" y="66.95" style="fill:#1C3896;" width="51.34" height="1.11"/>
	<rect x="268.72" y="75.56" style="fill:#1C3896;" width="58.42" height="1.15"/>
	<rect x="268.72" y="84.2" style="fill:#1C3896;" width="58.42" height="1.15"/>
</g>
<g>
	<polygon style="fill:#1C3896;" points="74.8,118.95 65.24,138.88 65.21,110.68 159.06,52.09 	"/>
	<polygon style="opacity:0.13;fill:#1C3896;" points="65.24,110.9 121.6,81.65 74.53,119.51 65.31,138.57 	"/>
</g>
<polygon style="fill:#0D2463;" points="65.24,138.88 74.51,119.26 158.85,52.38 "/>
<g>
	<polygon style="fill:#BBD4FF;" points="158.85,52.38 159.06,52.09 157.96,52.93 	"/>
	<polygon style="fill:#BBD4FF;" points="158.85,52.38 157.96,52.93 74.54,119.13 74.44,119.19 101.33,143.34 	"/>
	<polygon style="fill:#BBD4FF;" points="159.06,52.09 42.13,90.18 65.08,110.78 157.96,52.93 	"/>
</g>
<polygon style="fill:#06529C;" points="112.4,297.23 112.02,300.16 117.49,302.71 120.79,301.28 118.24,297.98 112.77,294.31 "/>
<g>
	<polygon style="fill:#BCBEC0;" points="112.21,296.25 116.43,258.97 111.36,217.24 112.5,208.37 135.17,207.5 135.99,221.95 
		132.18,259.03 117.86,298.16 	"/>
</g>
<polygon style="fill:#BBD4FF;" points="137.3,166.26 148.7,169.36 161.89,192.73 155.64,198.52 146.85,188.11 "/>
<g>
	<polygon style="fill:#BCBEC0;" points="151.8,211.68 151.86,249.3 144.29,297.73 138.84,297.67 135.84,252.89 128.83,208.06 	"/>
	<polygon style="fill:#06529C;" points="138.85,299.97 144.71,301.86 147.69,300.06 144.77,297.08 138.88,297.02 	"/>
</g>
<g>
	<path style="fill:#BBD4FF;" d="M109.01,224.48c0.05-1.63,0.14-2.99,0.16-3.48c0.12-4.37,0.51-8.74,1.05-13.08
		c0.49-3.89,1.11-13.55,1.78-17.42c0.55-3.19,2.47-11.16,3.85-14.12c3.44-7.36,2.38-8.04,17.5-10.23c6.63-0.96,8.19,3.17,13.61,7.92
		c0.53,0.47,0.5,3.26,0.63,4c0.22,1.3,0.45,2.6,0.72,3.89c0.21,1.02,0.44,2.03,0.7,3.03l0,0c0,0,4.55,20.7,7.56,25.09
		c3.01,4.4,9.22,10.54-1.17,14.29c-1.84,0.6-3.7,1.16-5.61,1.46c0,0-8.5-0.94-12.87-0.91c-4.03,0.03-8.07,0.44-12.03,1.12
		c-2.65,0.44-5.35,1.09-7.72,2.32c-2.26,1.18-3.89,2.92-6.18,4.14c-0.22,0.12-0.46,0.24-0.7,0.2
		C108.96,232.53,108.9,227.91,109.01,224.48z"/>
</g>
<g>
	<path style="fill:#CE7361;" d="M133.36,168.23c-0.76,0.38-2.56,0.51-4.44-0.22c-0.38-0.15-0.63-0.51-0.63-0.92
		c0.01-1.14,0.11-2.28,0.27-3.41c-1.41-0.5-3.04-1.24-3.28-2.71c-0.08-0.46,0-0.94,0.08-1.4c0.33-1.92,0.66-3.83,0.99-5.75
		c0.11-0.66,0.24-1.35,0.6-1.91c0.63-1,1.86-1.43,3.02-1.63c2.97-0.52,6.2,0.13,8.5,2.07c0.61,0.52,1.17,1.14,1.44,1.89
		c0.42,1.16,0.1,2.45-0.21,3.64c-0.29,1.1-0.58,2.21-0.87,3.31c-0.33,1.27-0.81,2.71-2.04,3.19c-0.65,0.25-1.42,0.18-2,0.55
		C133.76,165.58,133.9,167.12,133.36,168.23z"/>
	<path style="fill:#33435A;" d="M150.49,149.67c0.29-0.48,0.61-0.94,0.96-1.37c0.76-0.94,1.7-1.74,2.31-2.78
		c0.61-1.04,0.83-2.45,0.09-3.41c-0.47-0.62-1.24-0.93-1.99-1.15c-2.46-0.73-5.12-0.77-7.61-0.14c-2.37,0.6-4.49,1.6-6.88,0.71
		c-2.24-0.84-3.86-0.5-6.21,0.34c-2.54,0.9-5.94,1.12-8.24,2.4c-0.96,0.53-1.72,1.37-2.32,2.29c-2.07,3.19-2.08,7.59-0.03,10.79
		c0.46,0.72,1.01,1.37,1.59,2c1.2,1.3,2.63,2.9,4.27,3.38c0.04-1.47-1.3-6.12-0.17-7.32c1.79-1.92,5.85-1.25,8.08-0.78
		c2.43,0.51,4.59,2.23,7,2.6c1.73,0.26,3.94-0.59,5.42-1.48C148.58,154.64,149.43,151.41,150.49,149.67z"/>
</g>
<polygon style="fill:#BBD4FF;" points="120.79,168.98 111.36,177.25 100.83,199.36 114.13,215.18 116.41,206.34 "/>
<g>
	<polygon style="fill:#06529C;" points="185.45,177.26 68.82,186.04 129.87,218 	"/>
	<path style="fill:#06529C;" d="M65.17,188.72l5.65,75.11l109.33-8.23c8.27-0.62,14.43-8.29,13.77-17.13l-4.45-59.1l-59.23,43.43
		L65.17,188.72z"/>
	<path style="fill:#242449;" d="M164.52,178.83c-0.08,1-0.08,2.02,0,3.05c0.24,3.18,1.21,6.14,2.73,8.71l18.19-13.34L164.52,178.83z
		"/>
	<path style="fill:#242449;" d="M186.07,200.42c1.71-0.13,3.35-0.47,4.9-0.99l-1.51-20.07l-19.8,14.51
		C173.69,198.3,179.64,200.9,186.07,200.42z"/>
</g>
<ellipse transform="matrix(0.652 -0.7582 0.7582 0.652 -68.7101 205.3179)" style="fill:#BBD4FF;" cx="189.33" cy="177.52" rx="20.1" ry="20.1"/>
<g>
	<polygon style="fill:#1C3896;" points="193.51,188.5 188.8,188.78 187.88,173.29 184.94,173.47 184.66,168.76 192.31,168.3 	"/>
</g>
<g id="XMLID_531_">
	<path style="fill:#1C3896;" d="M260,295.2c0.51-0.56,1.1-0.86,1.77-0.76c0.64,0.1,1.22,0.54,1.49,1.12
		c0.18,0.4,0.22,0.84,0.25,1.27c-0.06-0.67,0.41,7.5-2.82,8.33c-1.25,0.32-2.29-0.57-2.63-1.7C257.55,301.77,258.3,297.07,260,295.2
		z"/>
</g>
<g id="XMLID_528_">
	<path style="fill:#FFBFA4;" d="M258.94,261.38l0.16,13.67c-0.18,6.07,0.77,12.18,0.58,18.26c-0.04,1.4-0.41,2.87-0.05,4.25
		c0.34,1.35,1.44,1.59,2.57,0.91c1.51-0.92,1.27-3.06,1.52-4.63c0.69-4.3,1.5-8.58,2.23-12.88c0.35-2.11-0.38-5.06-0.22-7.19
		c0,0,2.21-11.46,2.21-11.46L258.94,261.38z"/>
</g>
<polygon style="fill:#1C3896;" points="274.56,239.29 268.61,265.72 267.34,290.69 257.91,290.48 255.34,220.64 273.63,220.97 "/>
<g id="XMLID_518_">
	<path style="fill:#1C3896;" d="M246.5,294.7c0.53-0.53,1.13-0.8,1.79-0.65c0.64,0.14,1.19,0.61,1.43,1.21
		c0.16,0.41,0.18,0.85,0.2,1.29c-0.03-0.7-0.04,7.56-3.16,8.17c-1.26,0.25-2.26-0.71-2.55-1.85
		C243.78,301.14,244.73,296.47,246.5,294.7z"/>
</g>
<g id="XMLID_515_">
	<path style="fill:#FFBFA4;" d="M251.47,263.3l-0.8,13.65c-0.07,3.79-0.57,7.56-0.96,11.33c-0.36,3.5,0.2,7.15-1.63,10.33
		c-0.57,1-1.73,1.66-2.54,0.45c-0.62-0.93-0.25-2.49-0.37-3.55c-0.49-4.33-1.1-8.64-1.62-12.97c-0.25-2.12,0.61-5.03,0.56-7.17
		c0,0-1.67-11.55-1.67-11.55L251.47,263.3z"/>
</g>
<g id="XMLID_500_">
	<polygon style="fill:#1C3896;" points="239.53,237.67 238.76,263.33 242.79,289.28 252.39,289.57 251.97,261.48 257.05,238.19 
		258.75,222.95 243.52,221.15 	"/>
</g>
<g id="XMLID_498_">
	<polygon style="fill:#BBD4FF;" points="251.58,168.63 267.99,168.24 277.5,185.93 274.12,202.51 273.52,222.34 250.11,222.66 
		242.41,221.41 244.46,200.22 243.28,171.91 	"/>
</g>
<g id="XMLID_497_">
	<polygon style="fill:#BBD4FF;" points="268.53,169.46 281.86,189.75 279.85,201.05 259.22,215.34 255.34,211.95 269.13,194.51 
		268.6,183.49 	"/>
</g>
<g id="XMLID_496_">
	<polygon style="fill:#BBD4FF;" points="250.76,179.35 242.21,196.44 233,198.27 210.03,188.24 213.99,183.75 234.94,187.58 
		243.28,171.91 	"/>
</g>
<g id="XMLID_20_">
	<g id="XMLID_469_">
		<path style="fill:#FFBFA4;" d="M252.61,154.88c2.47-7.19,11.97-4.5,13.93,1.91c1.28,4.18-1.95,9.6-6.28,10.8
			c-0.02,0.16-0.03,0.32-0.03,0.45c0,0.67-0.09,1.33-0.19,2c-0.04,0.25-3.83-0.48-4.25-0.56c-0.15-0.03-0.31-0.07-0.39-0.19
			c-0.15-0.24,0.1-0.94,0.12-1.2c0.03-0.31,0.07-0.62,0.1-0.94c-2.14-1.04-3.48-3.26-3.86-5.52
			C251.38,159.35,251.86,157.04,252.61,154.88z"/>
	</g>
	<g id="XMLID_21_">
		<g id="XMLID_24_">
			<path style="fill:#263548;" d="M258.8,148.38c0.51,0.52,0.71,1.24,0.86,1.93c0.09,0.41,0.16,0.84,0.07,1.25
				c-0.35,1.63-1.97,1.55-3.22,2.07c-1.54,0.65-2.88,1.84-3.74,3.22c-1.35,2.15-0.74,4.93-0.2,7.3c0.19,0.84,0.58,2.08-0.07,2.83
				c-0.66,0.76-2.19,0.64-2.98,0.25c-0.72-0.36-1.32-1.02-2.11-1.15c-0.84-0.14-1.97,0.23-2.36-0.54c-0.11-0.21-0.12-0.48-0.26-0.67
				c-0.46-0.66-1.62,0.11-2.27-0.35c-0.4-0.29-0.4-0.9-0.26-1.39c0.14-0.49,0.36-0.98,0.27-1.47c-0.08-0.42-0.39-0.76-0.58-1.14
				c-0.37-0.76-0.24-1.75,0.31-2.4c1.03-1.2,3.03-0.97,4.14-2.09c0.58-0.59,0.8-1.43,1.02-2.23c0.22-0.8,0.47-1.64,1.09-2.19
				c0.76-0.67,1.86-0.56,2.61-1.35c0.44-0.47,0.74-1.07,1.23-1.48c0.65-0.54,1.93-0.95,2.74-1.22
				C256.4,147.13,257.84,147.4,258.8,148.38z"/>
		</g>
		<g id="XMLID_23_">
			<path style="fill:#263548;" d="M264.81,159.86c0.04,2.37-1.13,4.93-0.04,7.01c1.1,2.1,3.84,2.48,6.18,2.59
				c0.38,0.02,5.32,0.44,5.34,0.35c0.37-1.65,0.75-3.33,1.61-4.78c0.86-1.45,2.3-2.65,3.95-2.75c-0.48-0.08-0.72-0.67-0.66-1.16
				c0.05-0.49,0.31-0.93,0.46-1.41c0.36-1.16,0.01-2.51-0.87-3.33c-1.75-1.63-4.91-0.95-6.41-2.82c-0.93-1.16-0.82-2.84-1.3-4.25
				c-0.94-2.74-3.93-3.31-6.17-4.54c-2.36-1.3-4.59-2.02-7.31-1.56c-3.38,0.56-5.89,4.01-4.59,7.24c1.67,4.15,8.36,3.8,9.61,8.01
				C264.74,158.92,264.8,159.39,264.81,159.86z"/>
		</g>
	</g>
</g>
<g id="XMLID_18_">
	<polygon style="fill:#33435A;" points="263.14,168.54 258.05,175.73 255.65,175.53 251.66,168.24 	"/>
</g>
<g>
	<g>
		<path style="fill:#FFFFFF;" d="M237.32,222.67c-0.4,0-0.77-0.15-1.04-0.43l-11.59-11.88l-7.2,9.22c-0.26,0.33-0.62,0.51-1.03,0.51
			c-0.63,0-1.27-0.46-1.5-1.06l-17.07-45.97c-0.21-0.55-0.08-1.1,0.32-1.48c0.25-0.32,0.61-0.5,1-0.5c0.18,0,0.36,0.04,0.54,0.11
			l45.53,18.21c0.56,0.22,0.93,0.69,1.01,1.24c0.07,0.54-0.17,1.08-0.65,1.43l-9.23,6.85l11.57,11.86c0.57,0.58,0.57,1.55,0,2.11
			l-9.59,9.36C238.11,222.51,237.72,222.67,237.32,222.67L237.32,222.67z M224.53,206.6c0.42,0,0.82,0.16,1.09,0.44l11.74,12.03
			l7.46-7.27l-11.72-12.01c-0.31-0.32-0.46-0.72-0.43-1.14c0.04-0.45,0.28-0.87,0.67-1.17l8.46-6.28l-39.94-15.97l14.98,40.33
			l6.61-8.47C223.7,206.78,224.09,206.6,224.53,206.6z"/>
		<g>
			<path style="fill:#FFFFFF;" d="M248.38,210.38l-5.6-5.74l-5.52-5.66l3.84-2.85l4.87-3.62c0.64-0.48,0.97-1.21,0.87-1.96
				c-0.1-0.76-0.6-1.38-1.35-1.68l-15.48-6.19l-24.46-9.78l-3.33-1.33l-2.27-0.91c-0.25-0.1-0.5-0.15-0.75-0.15
				c-0.56,0-1.06,0.25-1.42,0.68c-0.55,0.53-0.71,1.3-0.43,2.05l0.62,1.66l5.19,13.97l9.17,24.69l1.06,2.85l1.04,2.8
				c0.31,0.83,1.16,1.43,2.02,1.43c0.58,0,1.1-0.26,1.47-0.72l3.67-4.69l3.14-4.02l4.34,4.45l5.24,5.37l1.57,1.61
				c0.38,0.39,0.89,0.6,1.44,0.6c0.54,0,1.07-0.21,1.46-0.59l4.72-4.61l4.87-4.75C249.17,212.5,249.18,211.19,248.38,210.38z
				 M247.58,212.48c-3.2,3.12-6.39,6.24-9.59,9.36c-0.18,0.18-0.43,0.27-0.67,0.27c-0.23,0-0.47-0.08-0.64-0.26
				c-0.52-0.54-1.05-1.07-1.57-1.61c-3.49-3.58-6.98-7.16-10.47-10.74c-2.53,3.24-5.06,6.48-7.6,9.73
				c-0.16,0.21-0.37,0.29-0.58,0.29c-0.41,0-0.83-0.31-0.97-0.69c-0.7-1.88-1.4-3.77-2.1-5.65c-3.06-8.23-6.11-16.46-9.17-24.69
				c-1.93-5.21-3.87-10.42-5.8-15.63c-0.14-0.39-0.02-0.7,0.21-0.9c0.13-0.19,0.34-0.32,0.59-0.32c0.1,0,0.22,0.02,0.34,0.07
				c1.87,0.75,3.73,1.49,5.6,2.24c8.15,3.26,16.3,6.52,24.46,9.78c5.16,2.06,10.32,4.13,15.48,6.19c0.77,0.31,0.91,1.2,0.23,1.7
				c-3.25,2.41-6.5,4.82-9.74,7.23c0.27,0.28,0.54,0.56,0.82,0.84c3.73,3.83,7.47,7.65,11.2,11.48
				C247.92,211.52,247.95,212.12,247.58,212.48z"/>
			<path style="fill:#FFFFFF;" d="M233.5,199.4c-0.45-0.46-0.3-1.1,0.18-1.46c3.09-2.29,6.18-4.59,9.27-6.88
				c-1.32-0.53-2.64-1.06-3.96-1.58c-8.15-3.26-16.3-6.52-24.46-9.78c-4.55-1.82-9.09-3.64-13.64-5.45c0.47,1.25,0.93,2.51,1.4,3.76
				c3.06,8.23,6.11,16.46,9.17,24.69c1.73,4.67,3.47,9.34,5.2,14c2.41-3.09,4.82-6.17,7.23-9.26c0.15-0.19,0.39-0.27,0.63-0.27
				c0.26,0,0.52,0.1,0.69,0.27c0.52,0.54,1.05,1.07,1.57,1.61c3.52,3.61,7.04,7.22,10.56,10.83c2.75-2.69,5.51-5.37,8.26-8.06
				c-0.3-0.31-0.61-0.62-0.91-0.93C240.97,207.05,237.23,203.22,233.5,199.4z M237.37,218.28l-2.33-2.39l-7.45-7.63l-0.24-0.24
				l-1.33-1.36c-0.38-0.38-0.92-0.61-1.49-0.61c-0.61,0-1.16,0.26-1.51,0.71l-3.62,4.63l-2.38,3.04l-1.8-4.85l-2.7-7.27l-9.17-24.69
				l-0.52-1.39l11.29,4.51l12.23,4.89l12.23,4.89l2.03,0.81l0.07,0.03l-2.94,2.18l-4.72,3.5c-0.52,0.39-0.85,0.96-0.9,1.57
				c-0.05,0.58,0.16,1.14,0.58,1.57l5.6,5.74l5.6,5.74l0.12,0.13L237.37,218.28z"/>
		</g>
	</g>
	<polygon style="fill:#33435A;" points="199.31,172.6 216.38,218.57 224.56,208.09 237.33,221.18 242.13,216.5 246.92,211.82 
		234.15,198.73 244.83,190.81 	"/>
</g>
<g id="XMLID_6_">
	<polygon style="fill:#FFBFA4;" points="250.79,213.73 250.88,216.5 245.99,218.28 243.18,216.15 243.17,212.92 245.89,212.77 
		245.98,212.06 246.87,211.49 	"/>
</g>
<polygon style="fill:#CE7361;" points="102.74,184.94 105.51,181.25 111.11,180.16 114.13,183.18 108.79,188.74 "/>
<polygon style="fill:#CE7361;" points="147.39,179.61 150.15,175.92 155.76,174.83 158.78,177.84 153.43,183.41 "/>
</svg>
