<?xml version="1.0" encoding="utf-8"?>
<!-- Generator: Adobe Illustrator 23.0.2, SVG Export Plug-In . SVG Version: 6.00 Build 0)  -->
<svg version="1.1" id="Layer_1" xmlns="http://www.w3.org/2000/svg" xmlns:xlink="http://www.w3.org/1999/xlink" x="0px" y="0px"
	 width="117.38px" height="206.07px" viewBox="0 0 117.38 206.07" style="enable-background:new 0 0 117.38 206.07;"
	 xml:space="preserve">
<rect x="-443.38" y="-285.37" style="fill:none;" width="568.97" height="510.8"/>
<ellipse style="fill:#E2E2E2;" cx="77.82" cy="197.81" rx="39.29" ry="8.17"/>
<g>
	<g>
		<path style="fill:#F8BEA7;" d="M77.99,24.91v10.82h11.45c0,0-2.82-4.29-1.41-10.82H77.99z"/>
		<path style="fill:#F8BEA7;" d="M75.98,27.65c-3.2,0.21-3.73-2.78-3.73-2.78c-1.96-6.03-1.52-9.83-1.52-9.83
			c0.26-0.92,0.46-1.88,0.32-2.89c-0.7-4.89,2.02-7.35,2.02-7.35c3.16-4.22,9.8-3.7,9.8-3.7c0.19,0.02,0.36,0.06,0.54,0.09
			c8.18,0.41,9.46,5.41,9.46,5.41c0.87,2.18,1.07,4.63,0.61,6.92c-0.52,2.65-1.65,4.83-2.99,7.12c-1.46,2.5-4.41,4.23-7.55,5.37
			v3.11h-3.99c-0.56-1.66-1.98-1.49-1.98-1.49L75.98,27.65z"/>
		<path style="fill:#E59E85;" d="M76.99,27.64c0,0,0.48-0.08,1.01,0.23v5.29H81c-0.65-2-0.57-4.39-0.09-6.18
			c1.95-1.85,5.01-2.96,7.66-5.69c-0.76,0.01-3.56,0.03-4.32,0.07c-1.4,0.08-2.82-0.03-4.22,0.13c-1.25,0.14-1.19,1.2-1.39,2.24
			c-0.08,0.41-0.17,0.81-0.3,1.18c-0.04,0.12-0.09,0.24-0.15,0.35l0,0c-0.06,0.11-0.12,0.22-0.19,0.32
			c-0.27,0.41-0.66,0.72-1.28,0.86c-1.56,0.35-2.91,0.34-4.11-0.62c0.46,0.89,1.4,1.93,3.37,1.82L76.99,27.64z"/>
		<path style="fill:#0E1E59;" d="M88.99,1.09c4.45,2.16,6.49,5.86,6.37,11.05c-0.12,5.21-6.77,14.05-6.77,14.05
			c-0.62,1.38-1.63,1.49-1.63,1.49h-3.6c-1.58-0.05-2.12-1.06-2.12-1.06c-2.84-3.32-3.89-6.11-3.89-6.11
			c-1.36-1.51,0.38-4.46,0.38-4.46c1.29-3.48-2.26-3.18-2.26-3.18c-1.45,0.73-1,3.55-1,3.55c-0.61-0.05-1.22-0.72-1.22-0.72
			l0.16-4.2c-0.2-1.12,0.04-1.36-0.91-2.07c-4.98-2.61-4.26-5.19-4.26-5.19S69.6-1.82,88.99,1.09z"/>
	</g>
	<g>
		<g>
			<path style="fill:#F8BEA7;" d="M2.9,54.32"/>
			<path style="fill:#F8BEA7;" d="M8.66,57.9c0,0-0.85-2.21,2.1-3.01c4.18,2.65,10.44,3.91,10.44,3.91
				c7.21,2.42,22.06-0.67,28.81-2.07c7.59-1.58,11.1,7,3.83,9.81c-13.62,5.25-35.2-0.45-45.25-8.35"/>
			<g>
				<path style="fill:#F8BEA7;" d="M3.96,51.44c0.94-0.34,0.8-0.97,1.73-0.34c1.07,0.72,2.37,0.89,3.06,1.42
					c1.21,0.93,5.06,5.39,0.01,5.78c-1.18,0.09-5.27,1.36-6.11-0.51c-1.24-2.76-0.84-1.79,0-5.22L3.96,51.44z"/>
			</g>
			<path style="fill:#F8BEA7;" d="M6.37,51.53l-6.06-3.3c0,0-1.33,1.25,4.95,4.61L6.37,51.53z"/>
		</g>
		<path style="fill:#F8BEA7;" d="M108.11,65.12c0,0,0.2,6.63-1.61,10.37c0,0-4.03,4.75-10.49,2.23
			C96.01,77.73,92.38,65.12,108.11,65.12z"/>
		<path style="fill:#338FC0;" d="M91.84,37.5c-4.91,4.52-0.76,13.86-0.76,13.86l3.55,16.33c0,0,11.57,2.74,15.83-1.55
			c0,0,0.35-16.27-4.91-24.82C105.55,41.32,102.88,35.7,91.84,37.5z"/>
		<path style="fill:#2B070C;" d="M95.98,190.05l-2.35,5.23l-3.33,1.19c0,0-3.25,0.72-3.49,3.75h16.43l-2.14-10.27L95.98,190.05z"/>
		<g>
			<path style="fill:#223E82;" d="M98.86,103.37c0.55,5.43-1.39,10.08-6.65,10.62c-5.26,0.54-9.97-3.43-10.53-8.87
				c-0.55-5.43,3.26-10.27,8.52-10.81C95.47,93.78,98.31,97.94,98.86,103.37z"/>
			<path style="fill:#223E82;" d="M81.63,110.53l6.39,37.72c0,0,11.22,5.25,13.08-1.25c0,0-0.24-29.19-2.24-43.62
				C98.86,103.37,83.63,97.07,81.63,110.53z"/>
		</g>
		<path style="fill:#223E82;" d="M103.24,194.97l-0.03-30.38c0.33-10.38-2.11-21.04-2.11-21.04c-7.47-7.04-13.26,3.65-13.26,3.65
			l5.77,48.08C93.62,195.27,99.86,196.35,103.24,194.97z"/>
		<path style="fill:#2B070C;" d="M72.81,199.73l-0.64-9.41l-4.29-0.6c0,0-1.73,3.88-3.2,4.77c-1.47,0.88-6.63,1.67-6.63,1.67
			s-3.06-0.36-3.06,3.44C54.99,199.6,56.94,200.91,72.81,199.73z"/>
		<path style="fill:#374996;" d="M72.1,79.99c0,0-3.1,7.08-3.85,23.36c0,0,24.1,13.71,30.66,0l0.04-23.36H72.1z"/>
		<g>
			<path style="fill:#374996;" d="M87.4,103.28c0.04,5.46-4.21,9.92-9.5,9.96c-5.29,0.04-9.61-4.36-9.65-9.82
				c-0.04-5.46,4.21-9.92,9.5-9.96C83.04,93.42,87.36,97.82,87.4,103.28z"/>
			<path style="fill:#374996;" d="M68.26,104.62l-2.66,42.15c0,0,6.41,10.03,14.37,3.38l8.75-41.84
				C88.71,108.31,82.61,93.21,68.26,104.62z"/>
		</g>
		<path style="fill:#374996;" d="M73.56,194.49l4.27-28.96c2.58-13.9,2.5-17.1,2.5-17.1c-3.79-10.85-14.73-1.67-14.73-1.67
			l-1.72,47.18C63.88,193.95,69.02,196.4,73.56,194.49z"/>
		<path style="fill:#45C3F9;" d="M98.91,91.99l0.04-12l5.47-33.42c0,0,1.88-5.02-1.88-7.53l-14.36-6.75c0,0-3.63,1.45-10.13,0
			l-13.28,7.85l4.44,37.59l-0.96,14.27C68.25,91.99,83.84,96.71,98.91,91.99z"/>
		<path style="fill:#338FC0;" d="M77.99,30.32c0,0,6.38-0.62,9.74,0l4.47,3.87c0,0-8.49,1.28-17.74,0.22L77.99,30.32z"/>
		<path style="fill:#45C3F9;" d="M70.05,40c-6.33-2.12-12.5,6.03-12.5,6.03l-12.58,11c0,0,3.19,11.45,9,13.11
			c0,0,14.42-7.55,19.36-16.29C73.33,53.85,76.95,48.79,70.05,40z"/>
	</g>
</g>
</svg>
