<?xml version="1.0" encoding="utf-8"?>
<!-- Generator: Adobe Illustrator 23.0.2, SVG Export Plug-In . SVG Version: 6.00 Build 0)  -->
<svg version="1.1" id="Слой_1" xmlns="http://www.w3.org/2000/svg" xmlns:xlink="http://www.w3.org/1999/xlink" x="0px" y="0px"
	 viewBox="0 0 36.78 36.8" style="enable-background:new 0 0 36.78 36.8;" xml:space="preserve">
<style type="text/css">
	.st0{fill:#464545;}
</style>
<g id="XMLID_5_">
	<g>
		<path class="st0" d="M33.25,25.75c1.29,0.39,2.7,1.74,3.15,2.98l0.17,0.56c0.45,1.29,0,3.09-0.96,4.05l-2.59,2.64
			c-0.45,0.45-1.86,0.73-1.86,0.73c-8.26,0.06-16.19-3.15-22.04-9s-9.05-13.77-9-22.04c0,0,0.34-1.35,0.79-1.8l2.59-2.64
			c0.96-0.96,2.81-1.35,4.1-0.96L8.12,0.5c1.29,0.39,2.64,1.8,2.98,3.15l1.29,4.78c0.39,1.29-0.11,3.15-1.07,4.1l-1.74,1.74
			c1.74,6.35,6.69,11.3,12.99,12.99l1.74-1.74c0.96-0.96,2.81-1.41,4.16-1.07L33.25,25.75z"/>
	</g>
	<g>
	</g>
</g>
</svg>
