<svg width="22" height="22" viewBox="0 0 22 22" fill="none" xmlns="http://www.w3.org/2000/svg">
<path d="M20.625 16.1562H8.79553C8.71792 16.1563 8.64259 16.13 8.5818 16.0818C8.52101 16.0335 8.47834 15.9661 8.46072 15.8905L6.42813 7.17201C6.34111 6.79331 6.12782 6.45548 5.82333 6.21409C5.51883 5.97269 5.14126 5.84209 4.75269 5.84377H1.375C1.1015 5.84377 0.839193 5.95241 0.645796 6.14581C0.452399 6.33921 0.34375 6.60151 0.34375 6.87501C0.34375 7.14852 0.452399 7.41082 0.645796 7.60422C0.839193 7.79761 1.1015 7.90626 1.375 7.90626H4.26697C4.34453 7.90624 4.41982 7.93244 4.48061 7.98062C4.54139 8.0288 4.5841 8.09612 4.60178 8.17164L6.512 16.3594C6.63385 16.8891 6.93216 17.3617 7.35797 17.6996C7.78378 18.0374 8.31178 18.2205 8.85534 18.2187H9.46688C9.20019 18.5151 9.02511 18.8824 8.96282 19.2762C8.90054 19.67 8.95372 20.0734 9.11593 20.4376C9.27814 20.8017 9.54243 21.1111 9.8768 21.3282C10.2112 21.5453 10.6013 21.6609 11 21.6609C11.3987 21.6609 11.7888 21.5453 12.1232 21.3282C12.4576 21.1111 12.7219 20.8017 12.8841 20.4376C13.0463 20.0734 13.0995 19.67 13.0372 19.2762C12.9749 18.8824 12.7998 18.5151 12.5331 18.2187H16.3419C16.0752 18.5151 15.9001 18.8824 15.8378 19.2762C15.7755 19.67 15.8287 20.0734 15.9909 20.4376C16.1531 20.8017 16.4174 21.1111 16.7518 21.3282C17.0862 21.5453 17.4763 21.6609 17.875 21.6609C18.2737 21.6609 18.6638 21.5453 18.9982 21.3282C19.3326 21.1111 19.5969 20.8017 19.7591 20.4376C19.9213 20.0734 19.9745 19.67 19.9122 19.2762C19.8499 18.8824 19.6748 18.5151 19.4081 18.2187H20.625C20.8985 18.2187 21.1608 18.1101 21.3542 17.9167C21.5476 17.7233 21.6562 17.461 21.6562 17.1875C21.6562 16.914 21.5476 16.6517 21.3542 16.4583C21.1608 16.2649 20.8985 16.1562 20.625 16.1562ZM12.375 19.5937C12.375 19.8657 12.2944 20.1315 12.1433 20.3577C11.9922 20.5838 11.7774 20.76 11.5262 20.8641C11.2749 20.9681 10.9985 20.9954 10.7318 20.9423C10.465 20.8893 10.22 20.7583 10.0277 20.566C9.83543 20.3737 9.70447 20.1287 9.65142 19.862C9.59837 19.5953 9.6256 19.3188 9.72967 19.0676C9.83374 18.8163 10.01 18.6016 10.2361 18.4505C10.4622 18.2994 10.7281 18.2187 11 18.2187C11.3647 18.2187 11.7144 18.3636 11.9723 18.6215C12.2301 18.8793 12.375 19.2291 12.375 19.5937ZM19.25 19.5937C19.25 19.8657 19.1694 20.1315 19.0183 20.3577C18.8672 20.5838 18.6524 20.76 18.4012 20.8641C18.1499 20.9681 17.8735 20.9954 17.6068 20.9423C17.34 20.8893 17.095 20.7583 16.9027 20.566C16.7104 20.3737 16.5795 20.1287 16.5264 19.862C16.4734 19.5953 16.5006 19.3188 16.6047 19.0676C16.7087 18.8163 16.885 18.6016 17.1111 18.4505C17.3372 18.2994 17.6031 18.2187 17.875 18.2187C18.2397 18.2187 18.5894 18.3636 18.8473 18.6215C19.1051 18.8793 19.25 19.2291 19.25 19.5937ZM20.625 17.5312H8.85534C8.46707 17.5325 8.08989 17.4018 7.78575 17.1604C7.48161 16.919 7.26857 16.5814 7.18162 16.203L5.27106 8.01558C5.21889 7.78856 5.09109 7.58603 4.90863 7.44124C4.72617 7.29645 4.4999 7.21799 4.26697 7.21876H1.375C1.28383 7.21876 1.1964 7.18255 1.13193 7.11808C1.06747 7.05362 1.03125 6.96618 1.03125 6.87501C1.03125 6.78385 1.06747 6.69641 1.13193 6.63195C1.1964 6.56748 1.28383 6.53126 1.375 6.53126H4.75269C4.98564 6.53054 5.21193 6.609 5.39444 6.75378C5.57694 6.89856 5.70483 7.10106 5.75712 7.32808L7.79144 16.0469C7.84361 16.2739 7.97141 16.4765 8.15387 16.6213C8.33633 16.7661 8.5626 16.8445 8.79553 16.8437H20.625C20.7162 16.8437 20.8036 16.88 20.8681 16.9444C20.9325 17.0089 20.9688 17.0963 20.9688 17.1875C20.9688 17.2787 20.9325 17.3661 20.8681 17.4306C20.8036 17.495 20.7162 17.5312 20.625 17.5312Z" fill="black"/>
<path d="M7.29372 7.34754C7.26153 7.38791 7.23885 7.43503 7.22736 7.48537C7.21588 7.53572 7.21588 7.588 7.22738 7.63835L8.94613 15.2008C8.96342 15.2768 9.006 15.3446 9.06689 15.3932C9.12779 15.4418 9.20338 15.4683 9.28128 15.4683H19.5938C19.6717 15.4683 19.7473 15.4418 19.8082 15.3932C19.8691 15.3446 19.9116 15.2768 19.9289 15.2008L21.6477 7.63835C21.6591 7.58801 21.6591 7.53574 21.6476 7.48541C21.6361 7.43509 21.6134 7.388 21.5812 7.34765C21.549 7.30729 21.5081 7.27471 21.4616 7.25231C21.4151 7.22992 21.3642 7.21829 21.3125 7.21829H17.5065C18.0391 6.62533 18.3885 5.89076 18.5125 5.10343C18.6365 4.31609 18.5297 3.5097 18.2051 2.78177C17.8804 2.05384 17.3519 1.43555 16.6833 1.00165C16.0147 0.567761 15.2347 0.336853 14.4377 0.336853C13.6407 0.336853 12.8607 0.567761 12.1921 1.00165C11.5235 1.43555 10.995 2.05384 10.6703 2.78177C10.3457 3.5097 10.2389 4.31609 10.3629 5.10343C10.4869 5.89076 10.8363 6.62533 11.3689 7.21829H7.56253C7.51089 7.21826 7.45991 7.22986 7.41338 7.25224C7.36684 7.27461 7.32594 7.30719 7.29372 7.34754ZM13.4812 8.47985L14.0532 9.62454H11.6281L11.394 7.90579H12.1623C12.5644 8.17351 13.0109 8.36787 13.4809 8.47985H13.4812ZM16.7132 7.90579H17.4814L17.247 9.62454H14.8218L15.3942 8.47985C15.8643 8.36782 16.3108 8.17347 16.7132 7.90579ZM16.872 12.3745H14.7813V10.312H17.1532L16.872 12.3745ZM17.8468 10.312H20.3349L19.8664 12.3745H17.5657L17.8468 10.312ZM14.7813 13.062H16.7781L16.5437 14.7808H14.7813V13.062ZM14.0938 14.7808H12.3314L12.0969 13.062H14.0938V14.7808ZM14.0938 10.312V12.3745H12.0031L11.7219 10.312H14.0938ZM11.3094 12.3745H9.00869L8.54016 10.312H11.0282L11.3094 12.3745ZM9.16509 13.062H11.4033L11.6377 14.7808H9.55628L9.16509 13.062ZM19.3188 14.7808H17.2374L17.4718 13.062H19.71L19.3188 14.7808ZM20.4906 9.62454H17.94L18.1744 7.90579H20.8811L20.4906 9.62454ZM14.4375 1.03079C15.291 1.03222 16.1134 1.35112 16.7448 1.92542C17.3762 2.49973 17.7713 3.28837 17.8533 4.1379C17.9354 4.98743 17.6984 5.83711 17.1886 6.5216C16.6788 7.20609 15.9326 7.67645 15.0951 7.84116C15.0436 7.85141 14.9952 7.87331 14.9535 7.90519C14.9118 7.93707 14.8779 7.97807 14.8545 8.02507L14.4375 8.85591L14.0223 8.02507C13.9989 7.97807 13.965 7.93707 13.9233 7.90519C13.8816 7.87331 13.8331 7.85141 13.7817 7.84116C12.9444 7.67648 12.1982 7.20626 11.6884 6.52195C11.1786 5.83764 10.9416 4.98816 11.0234 4.13875C11.1052 3.28934 11.5 2.50072 12.131 1.92628C12.7621 1.35184 13.5842 1.03265 14.4375 1.03079ZM10.6999 7.90579L10.9344 9.62454H8.38375L7.99325 7.90579H10.6999Z" fill="black"/>
<path d="M11 20.2812C11.3797 20.2812 11.6875 19.9734 11.6875 19.5938C11.6875 19.2141 11.3797 18.9062 11 18.9062C10.6203 18.9062 10.3125 19.2141 10.3125 19.5938C10.3125 19.9734 10.6203 20.2812 11 20.2812Z" fill="black"/>
<path d="M17.875 20.2812C18.2547 20.2812 18.5625 19.9734 18.5625 19.5938C18.5625 19.2141 18.2547 18.9062 17.875 18.9062C17.4953 18.9062 17.1875 19.2141 17.1875 19.5938C17.1875 19.9734 17.4953 20.2812 17.875 20.2812Z" fill="black"/>
<path d="M12.7284 5.55448L14.2175 6.79542C14.2793 6.84686 14.3571 6.87504 14.4375 6.87504C14.5179 6.87504 14.5957 6.84686 14.6575 6.79542L16.1466 5.55448C16.3651 5.37294 16.5408 5.14546 16.6613 4.88825C16.7818 4.63104 16.8441 4.35042 16.8438 4.06638C16.8438 3.80604 16.7667 3.55152 16.6221 3.33502C16.4775 3.11853 16.2719 2.9498 16.0314 2.85018C15.7909 2.75056 15.5262 2.72452 15.2709 2.77538C15.0155 2.82623 14.781 2.95168 14.597 3.13585L14.4375 3.29535L14.278 3.13585C14.094 2.95168 13.8595 2.82623 13.6042 2.77538C13.3488 2.72452 13.0841 2.75056 12.8436 2.85018C12.6031 2.9498 12.3975 3.11853 12.2529 3.33502C12.1083 3.55152 12.0312 3.80604 12.0313 4.06638C12.0309 4.35042 12.0932 4.63104 12.2137 4.88825C12.3342 5.14546 12.5099 5.37294 12.7284 5.55448ZM13.3475 3.43767C13.4301 3.43745 13.5119 3.45362 13.5882 3.48525C13.6645 3.51688 13.7337 3.56333 13.7919 3.62192L14.1945 4.02445C14.2589 4.08889 14.3464 4.12509 14.4375 4.12509C14.5287 4.12509 14.6161 4.08889 14.6805 4.02445L15.0831 3.62192C15.171 3.53403 15.283 3.47418 15.4049 3.44994C15.5269 3.4257 15.6532 3.43815 15.7681 3.48572C15.883 3.53329 15.9811 3.61384 16.0502 3.71719C16.1193 3.82055 16.1562 3.94207 16.1563 4.06638C16.1565 4.24966 16.1163 4.43073 16.0385 4.59668C15.9607 4.76263 15.8473 4.90938 15.7063 5.02648L14.4375 6.08454L13.1687 5.02717C13.0276 4.91 12.9142 4.76313 12.8364 4.59705C12.7586 4.43098 12.7184 4.24978 12.7188 4.06638C12.7188 3.89967 12.7851 3.7398 12.903 3.62191C13.0209 3.50403 13.1808 3.43776 13.3475 3.43767Z" fill="black"/>
</svg>
