<svg width="12" height="20" viewBox="0 0 12 20" fill="none" xmlns="http://www.w3.org/2000/svg">
<path d="M1.07734 19.7558C1.40289 20.0814 1.93023 20.0814 2.2557 19.7558L11.4223 10.5892C11.7479 10.2637 11.7479 9.73631 11.4223 9.41084L2.2557 0.244203C2.09297 0.0814697 1.87969 6.20869e-05 1.66648 6.20683e-05C1.45328 6.20496e-05 1.24008 0.0814696 1.07726 0.244203C0.751717 0.569751 0.751717 1.09709 1.07726 1.42256L9.65477 9.99998L1.07726 18.5775C0.751794 18.9029 0.751794 19.4303 1.07734 19.7558Z" fill="#2A2A2A"/>
</svg>
