<svg id="global" xmlns="http://www.w3.org/2000/svg" width="18" height="18" viewBox="0 0 18 18">
  <path id="Shape" d="M2.636,15.364A9,9,0,1,1,15.364,2.636,9,9,0,1,1,2.636,15.364Z" fill="#fff"/>
</svg>
