<svg xmlns="http://www.w3.org/2000/svg" width="72.119" height="64.719" viewBox="0 0 72.119 64.719">
  <g id="Group_1" data-name="Group 1" transform="translate(-60.023 -35.301)">
    <path id="Path_9" data-name="Path 9" d="M16.519,0,0,16.871H10.543l-7.592,14.9L22.463,13.465H9.843Z" transform="translate(97.855 68.249)" fill="#fff"/>
    <path id="Oval_1" data-name="Oval 1" d="M40.364,43.539h-28V43.5a13.814,13.814,0,0,1-8.849-3.918A11.56,11.56,0,0,1,0,31.388,12.989,12.989,0,0,1,13.394,18.225a11.592,11.592,0,0,1,1.371.082A21.829,21.829,0,0,1,22.355,5.194a22.284,22.284,0,0,1,6.71-3.818A23.67,23.67,0,0,1,37.09,0,21.1,21.1,0,0,1,49.784,4.245a22.08,22.08,0,0,1,7.829,10.943h.082a14.458,14.458,0,0,1,10.2,4.152,14,14,0,0,1,.335,19.706,14.469,14.469,0,0,1-9.5,4.457v.035H52.543l5.151-16.2-17.33,16.2Z" transform="translate(60.023 35.301)" fill="#fff"/>
    <path id="Line" d="M.3,6.479a1.026,1.026,0,0,0,0,1.456,1.038,1.038,0,0,0,1.463,0L7.973,1.758A1.026,1.026,0,0,0,7.973.3,1.038,1.038,0,0,0,6.51.3Z" transform="translate(70.663 82.37)" fill="#fff"/>
    <path id="Line_2" data-name="Line 2" d="M.3,6.479a1.026,1.026,0,0,0,0,1.456,1.038,1.038,0,0,0,1.463,0L7.973,1.758A1.026,1.026,0,0,0,7.973.3,1.038,1.038,0,0,0,6.51.3Z" transform="translate(78.939 82.37)" fill="#fff"/>
    <path id="Line_3" data-name="Line 3" d="M.3,6.479a1.026,1.026,0,0,0,0,1.456,1.038,1.038,0,0,0,1.463,0L7.973,1.758A1.026,1.026,0,0,0,7.973.3,1.038,1.038,0,0,0,6.51.3Z" transform="translate(87.215 82.37)" fill="#fff"/>
  </g>
</svg>
