<svg xmlns="http://www.w3.org/2000/svg" width="114.09" height="97.356" viewBox="0 0 114.09 97.356">
  <g id="icon2" transform="translate(-0.91 -0.904)">
    <path id="Shape" d="M75.19,97.356H40.35a1.312,1.312,0,0,1-1.31-1.31v-3.29A58.725,58.725,0,0,1,13.53,76.9,52.64,52.64,0,0,1,.14,51.1L0,50.436a1.469,1.469,0,0,1,1.45-1.45H112.64a1.469,1.469,0,0,1,1.45,1.45v.26A51.1,51.1,0,0,1,101.4,76.47,58.082,58.082,0,0,1,76.5,92.486v3.42A1.355,1.355,0,0,1,75.19,97.356Zm12.48-53.1H80.31c2.024-4.793.917-9.566-3.289-14.189a19.379,19.379,0,0,1-4.841-9.258,21.576,21.576,0,0,1,.127-8.823A32.093,32.093,0,0,1,76.664,1.568c.049-.077.081-.126.1-.152A3.6,3.6,0,0,1,79.675,0,4.1,4.1,0,0,1,81.62.5a2.836,2.836,0,0,1,1.64,1.837,2.621,2.621,0,0,1-.46,2.233,24.9,24.9,0,0,0-3.332,7.509c-1,3.9-1.28,9.55,3.072,14.311,6.516,6.936,6.386,13.545,5.13,17.869Zm-22.08,0H58.23c2.039-4.795.932-9.525-3.29-14.06A19.453,19.453,0,0,1,50,20.547a22.011,22.011,0,0,1,.322-9.109A30.083,30.083,0,0,1,54.68,1.546,3.736,3.736,0,0,1,57.722.1,4.364,4.364,0,0,1,59.54.5,2.836,2.836,0,0,1,61.18,2.332a2.622,2.622,0,0,1-.459,2.233,24.8,24.8,0,0,0-3.333,7.509c-1,3.9-1.28,9.55,3.073,14.311,6.516,6.936,6.386,13.545,5.13,17.869Zm-22.21,0H36.02c2.024-4.793.917-9.566-3.289-14.189a19.454,19.454,0,0,1-4.937-9.649,22.012,22.012,0,0,1,.322-9.109A30.129,30.129,0,0,1,32.47,1.416,3.635,3.635,0,0,1,35.44,0a3.738,3.738,0,0,1,1.89.5,2.837,2.837,0,0,1,1.64,1.837,2.621,2.621,0,0,1-.46,2.233,24.8,24.8,0,0,0-3.333,7.509c-1,3.9-1.279,9.55,3.072,14.311,6.516,6.936,6.386,13.545,5.13,17.869Z" transform="translate(0.91 0.904)" fill="#fff"/>
  </g>
</svg>
