<svg xmlns="http://www.w3.org/2000/svg" width="178.172" height="76.588" viewBox="0 0 178.172 76.588">
  <g id="icon1" transform="translate(0.088 -0.708)">
    <g id="_2166741110032" transform="translate(147.142 0.708)">
      <path id="Path" d="M0,6.515A6.456,6.456,0,0,1,6.434,0a6.445,6.445,0,0,1,6.375,6.515,6.483,6.483,0,0,1-6.375,6.515A6.456,6.456,0,0,1,0,6.515Z" transform="translate(9.3)" fill="#449adb"/>
      <path id="Path-2" data-name="Path" d="M22.636.026a8.636,8.636,0,0,1,7.779,8.588V26.562a2.487,2.487,0,0,1-2.457,2.488A2.45,2.45,0,0,1,25.5,26.562v-15.4c0-.592-.175-1.362-1.228-1.362-.7,0-.877.77-.877,1.244V57.362a3.568,3.568,0,1,1-7.136,0V30.708a.976.976,0,0,0-.994-1.066h0c-.936,0-.994.77-1.053,1.066V57.362a3.568,3.568,0,1,1-7.136,0V11.043C7.077,10.569,6.9,9.8,6.2,9.8c-1.053,0-1.228.77-1.228,1.362V26.621a2.486,2.486,0,1,1-4.972,0V8.674A8.548,8.548,0,0,1,7.779.086c.117,0,.292-.059.468-.059H22.285c.058-.059.234,0,.351,0Z" transform="translate(0.526 15.492)" fill="#449adb"/>
    </g>
    <g id="_2166741109872" transform="translate(94.142 4.708)">
      <path id="Path-3" data-name="Path" d="M12.275,6.123a6.138,6.138,0,1,0-6.138,6.123,6.125,6.125,0,0,0,6.138-6.123Z" transform="translate(11.744 0.235)" fill="#449adb"/>
      <path id="Path-4" data-name="Path" d="M5.225,4.769.15,21.311s-.885,3,1.652,3.768S5.166,22.9,5.166,22.9L9.3,9.125s.236-1.06,1-.824c.826.235.472,1.354.472,1.354L3.631,35.5h6.61V53.985a3.187,3.187,0,0,0,6.374,0V35.5h1.77V53.985a3.187,3.187,0,0,0,6.374,0V35.5h6.728L24.346,9.655s-.3-1.119.472-1.354c.826-.235,1,.824,1,.824L29.953,22.9s.767,2.944,3.364,2.178,1.652-3.768,1.652-3.768L29.894,4.769S28.064,0,24.051,0H11.068C7.054,0,5.225,4.769,5.225,4.769Z" transform="translate(0.382 15.424)" fill="#449adb"/>
    </g>
    <g id="_2166741108496" transform="translate(56.142 4.708)">
      <path id="Path-5" data-name="Path" d="M12.48,6.123A6.177,6.177,0,0,0,6.24,0,6.216,6.216,0,0,0,0,6.123a6.177,6.177,0,0,0,6.24,6.123,6.177,6.177,0,0,0,6.24-6.123Z" transform="translate(11.88 0.235)" fill="#449adb"/>
      <path id="Path-6" data-name="Path" d="M5.312,4.769.152,21.311s-.9,3,1.68,3.768S5.252,22.9,5.252,22.9l4.2-13.776s.24-1.06,1.02-.824c.84.235.48,1.354.48,1.354L3.692,35.5h6.78V53.985a3.241,3.241,0,0,0,6.48,0V35.5h1.8V53.985a3.241,3.241,0,0,0,6.48,0V35.5h6.78L24.752,9.655s-.3-1.119.48-1.354c.84-.235,1.02.824,1.02.824L30.392,22.9s.78,2.944,3.42,2.178,1.68-3.768,1.68-3.768L30.332,4.769S28.472,0,24.392,0h-13.2c-4.02,0-5.88,4.769-5.88,4.769Z" transform="translate(0.268 15.424)" fill="#449adb"/>
    </g>
    <g id="_2166741108208" transform="translate(126.142 34.708)">
      <path id="Path-7" data-name="Path" d="M5,10.132a5.033,5.033,0,0,0,5-5.066A5.033,5.033,0,0,0,5,0,5.033,5.033,0,0,0,0,5.066,4.96,4.96,0,0,0,5,10.132Z" transform="translate(7.557 0.353)" fill="#449adb"/>
      <path id="Path-8" data-name="Path" d="M.186,13.869a1.77,1.77,0,0,0,.756,2.415,1.652,1.652,0,0,0,2.151-.707L5.826,6.741s.465-.589.465,0V27.475h0a2.56,2.56,0,0,0,2.558,2.592,2.6,2.6,0,0,0,2.558-2.592V19.288s-.174-1.178.756-1.178.756,1.178.756,1.178v8.188a2.56,2.56,0,0,0,2.558,2.592,2.6,2.6,0,0,0,2.558-2.592V6.741c0-.589.291-.177.291-.177l2.151,6.008A14.359,14.359,0,0,0,21.7,15.4a1.9,1.9,0,0,0,2.5-1.06,1.833,1.833,0,0,0-.233-1.885h0c-.058-.177-3.2-8.011-3.547-9.071-1.1-3.358-3.2-3.3-5.174-3.358s-3.2,0-3.2,0-1.279-.059-3.9,0S4.721,1.44,1.814,8.98C1.581,10.1.186,13.633.186,13.869Z" transform="translate(0.337 12.461)" fill="#449adb"/>
    </g>
    <g id="_2166741106576" transform="translate(0.142 0.708)">
      <g id="Group" transform="translate(3.559)">
        <path id="Path-9" data-name="Path" d="M12.992,6.515a6.5,6.5,0,1,0-6.525,6.515,6.5,6.5,0,0,0,6.525-6.515Z" transform="translate(9.551)" fill="#449adb"/>
        <path id="Path-10" data-name="Path" d="M7.89.026A8.684,8.684,0,0,0,0,8.615V26.562a2.5,2.5,0,0,0,2.492,2.488,2.5,2.5,0,0,0,2.492-2.488v-15.4c0-.592.178-1.362,1.246-1.362.712,0,.89.77.89,1.244V57.362a3.619,3.619,0,0,0,7.237,0V30.708a.981.981,0,0,1,1.008-1.066h0c.949,0,1.008.77,1.068,1.066V57.362a3.619,3.619,0,0,0,7.237,0V11.043c0-.474.178-1.244.89-1.244,1.068,0,1.246.77,1.246,1.362V26.621a2.492,2.492,0,0,0,4.983,0V8.674A8.6,8.6,0,0,0,22.9.086c-.119,0-.3-.059-.475-.059H8.364a1.279,1.279,0,0,0-.475,0Z" transform="translate(0.534 15.492)" fill="#449adb"/>
      </g>
      <path id="Path-11" data-name="Path" d="M5.814,0,0,30.563" transform="translate(0.534 44.719)" fill="none" stroke="#449adb" stroke-linecap="round" stroke-miterlimit="10" stroke-width="1.307"/>
    </g>
    <g id="_2166741103312" transform="translate(34.142 34.708)">
      <path id="Path-12" data-name="Path" d="M3.48.884A1.9,1.9,0,0,0,1.86,0,1.853,1.853,0,0,0,0,1.826a3.547,3.547,0,0,0,.18.825L5.4,11.958a3.48,3.48,0,0,1,.3,1.237V33.1h0a2.55,2.55,0,0,0,5.1,0V25.27s-.12-1.119.78-1.119.78,1.119.78,1.119V33.1a2.538,2.538,0,0,0,2.58,2.533A2.576,2.576,0,0,0,17.52,33.1V13.195a3.48,3.48,0,0,1,.3-1.237l4.8-8.541a8.284,8.284,0,0,0,.6-1.532A1.853,1.853,0,0,0,21.36.059a1.978,1.978,0,0,0-1.62.884h0c-.18.118-2.58,4.359-3.36,5.125a2.28,2.28,0,0,1-1.62.766H8.52A2.01,2.01,0,0,1,6.9,6.067C6.06,5.242,3.66,1,3.48.884Z" transform="translate(0.3 6.951)" fill="#449adb"/>
      <path id="Path-13" data-name="Path" d="M5.16,10.132a5.113,5.113,0,0,0,5.16-5.066A5.113,5.113,0,0,0,5.16,0,5.113,5.113,0,0,0,0,5.066,5.076,5.076,0,0,0,5.16,10.132Z" transform="translate(6.72 0.353)" fill="#449adb"/>
      <path id="Path-14" data-name="Path" d="M8.64,0l5.88,4.241,2.76,10.014H0L2.82,4.241Z" transform="translate(3.24 17.612)" fill="#449adb"/>
    </g>
  </g>
</svg>
