<svg xmlns="http://www.w3.org/2000/svg" width="121.575" height="85.001" viewBox="0 0 121.575 85.001">
  <g id="icon3" transform="translate(-0.028 -0.064)">
    <path id="Path" d="M30.651,9.277c.01-5.1-3.257-9.245-8.216-9.249-2.479-.005-5.474,2.706-7.1,4.372C13.713,2.726,10.923.005,8.443,0,3.488-.006.007,4.124,0,9.228a9.334,9.334,0,0,0,2.617,6.537L15.308,28.518l12.712-12.7-.01-.01a9.338,9.338,0,0,0,2.641-6.531Z" transform="translate(90.952 35.82)" fill="#fff"/>
    <path id="Path-2" data-name="Path" d="M67.4,85a2.086,2.086,0,0,1-2.056-1.737l-6.4-37.609L49.145,63.77a2.087,2.087,0,0,1-3.9-.7L41.137,34.046,33.513,51.1a2.086,2.086,0,0,1-1.907,1.235L2.084,52.286a2.087,2.087,0,0,1,.007-4.174l28.165.043L40.282,25.729a2.087,2.087,0,0,1,3.973.56l4.234,29.926L58.16,38.349a2.088,2.088,0,0,1,3.894.644l5.925,34.83,21.9-72.344a2.09,2.09,0,0,1,3.88-.3l11.43,23.784a2.089,2.089,0,0,1-3.765,1.81l-9.1-18.95L69.4,83.52A2.087,2.087,0,0,1,67.4,85Z" transform="translate(0.028 0.064)" fill="#fff"/>
  </g>
</svg>
