<svg xmlns="http://www.w3.org/2000/svg" width="75" height="50" viewBox="0 0 75 50">
  <path id="Shape" d="M18.75,50a18.742,18.742,0,0,1-2.031-37.375,23.414,23.414,0,0,1,43.75,6.25A15.581,15.581,0,0,1,59.375,50Z" fill="#449adb"/>
</svg>
