<?xml version="1.0" encoding="utf-8"?>
<!-- Generator: Adobe Illustrator 23.0.3, SVG Export Plug-In . SVG Version: 6.00 Build 0)  -->
<svg version="1.1" id="Слой_1" xmlns="http://www.w3.org/2000/svg" xmlns:xlink="http://www.w3.org/1999/xlink" x="0px" y="0px"
	 viewBox="0 0 19.4 19.1" style="enable-background:new 0 0 19.4 19.1;" xml:space="preserve">
<style type="text/css">
	.st0{filter:url(#filter-1);}
	.st1{fill:#FFFFFF;}
</style>
<filter  filterUnits="objectBoundingBox" height="472.2%" id="filter-1" width="472.2%" x="-186.1%" y="-186.1%">
	<feOffset  dx="0" dy="2" in="SourceAlpha" result="shadowOffsetOuter1"></feOffset>
	<feGaussianBlur  in="shadowOffsetOuter1" result="shadowBlurOuter1" stdDeviation="7.5"></feGaussianBlur>
	
		<feColorMatrix  in="shadowBlurOuter1" result="shadowMatrixOuter1" type="matrix" values="0 0 0 0 0.125490196   0 0 0 0 0.207843137   0 0 0 0 0.305882353  0 0 0 0.5 0">
		</feColorMatrix>
	<feMerge>
		<feMergeNode  in="shadowMatrixOuter1"></feMergeNode>
		<feMergeNode  in="SourceGraphic"></feMergeNode>
	</feMerge>
</filter>
<title>global</title>
<desc>Created with Sketch.</desc>
<g id="Landing-Page">
	<g id="MINFINMAIN" transform="translate(-1272.000000, -51.000000)">
		<g id="global" transform="translate(1287.000000, 64.000000)" class="st0">
			<path id="Shape_1_" class="st1" d="M1-9.8c-1.7-1.7-4-2.6-6.4-2.6s-4.7,0.9-6.4,2.6c-1.7,1.7-2.6,4-2.6,6.4s0.9,4.7,2.6,6.4
				c1.7,1.7,4,2.6,6.4,2.6S-0.7,4.6,1,2.9c1.7-1.7,2.6-4,2.6-6.4S2.7-8.1,1-9.8z M-7-11.2c-0.3,0.3-0.6,0.6-1,1.1
				c-0.6,0.7-1,1.5-1.4,2.3h-2.5C-10.8-9.5-9.1-10.7-7-11.2z M-12.5-6.8h2.7c-0.3,0.9-0.5,1.9-0.5,2.9h-2.9
				C-13.2-5-12.9-5.9-12.5-6.8z M-13.3-2.9h2.9c0,1,0.2,1.9,0.5,2.9h-2.7C-12.9-0.9-13.2-1.9-13.3-2.9z M-11.9,1h2.5
				C-9,1.8-8.6,2.6-8,3.3C-7.7,3.7-7.3,4-7,4.3C-9.1,3.9-10.8,2.7-11.9,1z M-5.9,4c-0.4-0.3-0.8-0.8-1.3-1.4c-0.4-0.5-0.8-1-1.1-1.6
				h2.4V4z M-5.9,0h-2.8C-9-0.9-9.2-1.9-9.3-2.9h3.4V0z M-5.9-3.9h-3.4c0.1-1,0.2-2,0.6-2.9h2.8V-3.9z M-5.9-7.9h-2.4
				c0.3-0.5,0.6-1.1,1-1.6c0.5-0.6,1-1.1,1.3-1.4V-7.9z M2.6-3.9h-2.9c0-1-0.2-1.9-0.5-2.9h2.7C2.3-5.9,2.5-5,2.6-3.9z M1.2-7.9
				h-2.5c-0.4-0.8-0.8-1.6-1.4-2.3c-0.3-0.4-0.7-0.8-1-1.1C-1.6-10.7,0.1-9.5,1.2-7.9z M-4.8-10.8c0.4,0.3,0.8,0.8,1.3,1.4
				c0.4,0.5,0.8,1,1.1,1.6h-2.4V-10.8z M-4.8-6.8H-2c0.3,0.9,0.5,1.9,0.6,2.9h-3.4V-6.8z M-4.8-2.9h3.4c-0.1,1-0.2,2-0.6,2.9h-2.8
				V-2.9z M-4.8,4V1h2.4c-0.3,0.5-0.6,1.1-1,1.6C-3.9,3.2-4.4,3.7-4.8,4z M-3.6,4.3C-3.3,4-3,3.7-2.7,3.3c0.6-0.7,1-1.5,1.4-2.3h2.5
				C0.1,2.7-1.6,3.9-3.6,4.3z M1.8,0h-2.7c0.3-0.9,0.5-1.9,0.5-2.9h2.9C2.5-1.9,2.3-0.9,1.8,0z"/>
		</g>
	</g>
</g>
</svg>
