<svg xmlns="http://www.w3.org/2000/svg" width="7.456" height="3.808" viewBox="0 0 7.456 3.808">
  <path id="_" data-name="&lt;&lt;" d="M6.88,3.768,3.912,2.5a.6.6,0,0,1-.265-.212.592.592,0,0,1,0-.644.534.534,0,0,1,.265-.208L6.88.168a.554.554,0,0,1,.2-.041.379.379,0,0,1,.267.1.339.339,0,0,1,.108.26.3.3,0,0,1-.2.3L4.432,1.968,7.256,3.152a.3.3,0,0,1,.2.3.337.337,0,0,1-.108.26.379.379,0,0,1-.267.1A.493.493,0,0,1,6.88,3.768ZM3.328,3.64.36,2.376A.594.594,0,0,1,.1,2.164.557.557,0,0,1,0,1.84a.565.565,0,0,1,.1-.32A.536.536,0,0,1,.36,1.312L3.328.04a.567.567,0,0,1,.2-.04A.379.379,0,0,1,3.8.1.337.337,0,0,1,3.9.36a.3.3,0,0,1-.2.3L.88,1.84,3.7,3.024a.3.3,0,0,1,.2.3.339.339,0,0,1-.108.26.379.379,0,0,1-.268.1A.472.472,0,0,1,3.328,3.64Z" fill="#449adb"/>
</svg>
