<svg xmlns="http://www.w3.org/2000/svg" width="12" height="7.029" viewBox="0 0 12 7.029">
  <path id="arrow" d="M-3.182,6.885-.354,4.056a.5.5,0,0,0,.088-.12A.5.5,0,0,0,0,3.5a.5.5,0,0,0-.3-.46.5.5,0,0,0-.05-.058L-3.182.149a.5.5,0,0,0-.707,0,.5.5,0,0,0,0,.707L-1.75,3H-11.5a.5.5,0,0,0-.5.5.5.5,0,0,0,.5.5h9.793L-3.889,6.178a.5.5,0,0,0,0,.707.5.5,0,0,0,.354.146A.5.5,0,0,0-3.182,6.885Z" transform="translate(12 -0.003)" fill="#ff771e"/>
</svg>
