<svg xmlns="http://www.w3.org/2000/svg" width="13.628" height="13.626" viewBox="0 0 13.628 13.626">
  <g id="edit" transform="translate(0.703 0.821)">
    <path id="Shape" d="M.1,12a.356.356,0,0,1-.1-.316L.554,8.724a.365.365,0,0,1,.1-.186L8.814.376a1.287,1.287,0,0,1,1.818,0l1.1,1.1a1.285,1.285,0,0,1,0,1.818L3.567,11.453a.358.358,0,0,1-.185.1L.419,12.1a.363.363,0,0,1-.064.006A.355.355,0,0,1,.1,12Z" transform="translate(0 0)" fill="none" stroke="#fff" stroke-width="1.4"/>
  </g>
</svg>
