<svg xmlns="http://www.w3.org/2000/svg" width="18.672" height="18.4" viewBox="0 0 18.672 18.4">
  <g id="home" transform="translate(0.82 0.7)">
    <path id="Shape" d="M10.634,17a.5.5,0,0,1-.5-.5v-4a.837.837,0,0,0-.835-.836H7.7a.837.837,0,0,0-.836.836v4a.5.5,0,0,1-.5.5H3.652a1.834,1.834,0,0,1-1.831-1.832v-5.1H1.544l-.049,0A1.564,1.564,0,0,1,.455,7.4l.007-.007L7.393.458a1.565,1.565,0,0,1,2.213,0L16.54,7.393l0,0a1.566,1.566,0,0,1-1.108,2.671h-.257v5.1A1.834,1.834,0,0,1,13.346,17Z" transform="translate(0.017)" fill="none" stroke="#ca7c00" stroke-width="1.4"/>
  </g>
</svg>
