<svg id="user_icn" xmlns="http://www.w3.org/2000/svg" width="22" height="22" viewBox="0 0 22 22">
  <rect id="bg" width="22" height="22" transform="translate(0 0)" fill="none"/>
  <path id="user_icn-2" data-name="user_icn" d="M15.111,19.091A6.491,6.491,0,0,0,8.5,12.728a6.491,6.491,0,0,0-6.611,6.363A.927.927,0,0,1,.944,20,.927.927,0,0,1,0,19.091a8.345,8.345,0,0,1,8.5-8.182A8.345,8.345,0,0,1,17,19.091a.945.945,0,0,1-1.889,0ZM3.777,4.546A4.642,4.642,0,0,1,8.5,0a4.641,4.641,0,0,1,4.722,4.546A4.641,4.641,0,0,1,8.5,9.091,4.642,4.642,0,0,1,3.777,4.546Zm1.889,0A2.785,2.785,0,0,0,8.5,7.273a2.785,2.785,0,0,0,2.833-2.727A2.785,2.785,0,0,0,8.5,1.818,2.786,2.786,0,0,0,5.666,4.546Z" transform="translate(3 1)" fill="#1b2437"/>
</svg>
