<svg width="4188" height="4189" viewBox="0 0 4188 4189" fill="none" xmlns="http://www.w3.org/2000/svg">
<g filter="url(#filter0_d)">
<path fill-rule="evenodd" clip-rule="evenodd" d="M2346.82 680.945C2381.23 671.872 2417.86 681.767 2443.03 706.929L4072.27 2336.17C4111.32 2375.22 4111.32 2438.54 4072.27 2477.59L2492.59 4057.27C2446.8 4103.05 2370.24 4093.92 2336.51 4038.64L643.128 1263.16C608.27 1206.03 638.282 1131.44 702.997 1114.38L2346.82 680.945Z" fill="#F7B500" fill-opacity="0.01"/>
</g>
<defs>
<filter id="filter0_d" x="0.945068" y="0.97937" width="4187.03" height="4187.03" filterUnits="userSpaceOnUse" color-interpolation-filters="sRGB">
<feFlood flood-opacity="0" result="BackgroundImageFix"/>
<feColorMatrix in="SourceAlpha" type="matrix" values="0 0 0 0 0 0 0 0 0 0 0 0 0 0 0 0 0 0 127 0"/>
<feOffset dy="15"/>
<feGaussianBlur stdDeviation="22.5"/>
<feColorMatrix type="matrix" values="0 0 0 0 0.968627 0 0 0 0 0.709804 0 0 0 0 0 0 0 0 0.21 0"/>
<feBlend mode="normal" in2="BackgroundImageFix" result="effect1_dropShadow"/>
<feBlend mode="normal" in="SourceGraphic" in2="effect1_dropShadow" result="shape"/>
</filter>
</defs>
</svg>
