{
	"admins": ["greg", "FeeLing", "IvanZ"],
	"testdata": true,
	"prng": "static",
	"public": {
		"siteName": "Hmmm",
		"siteStage": "DEV",
		"headerLogo": { "src": "openki-logo-web-2020.svg", "alt": "Openki Logo" },
		"headerLogoKiosk": { "src": "openki-logo-kiosk-2020.svg", "alt": "Openki Logo" },
		"avatarLogo": { "src": "openki-logo-web-avatar-2020.svg", "alt": "User Avatar" },
		"ogLogo": { "src": "openki_logo_2018.png" },
		"emailLogo": "emails/openki.png",
		"publicTenants": ["8410c099a7"],
		"regionSelection": { "minNumber": 5 },
		"contribution": 
		    { "icon": "fa-solid fa-heart"
			, "forbiddenChars": ["🖤", "💖", "💔", "💚", "💜", "❤️", "🧡", "💕", "💛", "💝"]
			, "link": 
				{ "en": "https://about.openki.net/en/ueber-uns/spenden/"
				, "de": "https://about.openki.net/ueber-uns/spenden/"
				}
			},
		"categories": {
			"misc":
			[
				"♥undefined♥"
			]
		},
		"s3": {
			"publicUrlBase": "https://cz42.objectstorage.nineapis.ch/v1/AUTH_cda71cf5c64a4609b0ff99ffc399666f/bucket-openkitest"
		}
	},
	"siteEmail": "HMMM@legit.example",
	"s3": {
		"region": "nine-cz42",
		"bucketEndpoint": "https://cz42.objectstorage.nineapis.ch/bucket-openkitest",
		"bucketName": "bucket-openkitest",
		"accessKeyId": "ce3d4a03ab704cf0912092c1de53c222",
		"secretAccessKey": "47eb64d858604ba69269986b10581708"
	},
	"startup": { "buildDbCacheAsync": false }
}
