{
    "extensions": [
      "ttf",
      "woff2"
    ],
    "map": {
        "node_modules/@fortawesome/fontawesome-free/webfonts/fa-regular-400.ttf": "webfonts/fa-regular-400.ttf",
        "node_modules/@fortawesome/fontawesome-free/webfonts/fa-regular-400.woff2": "webfonts/fa-regular-400.woff2",
        "node_modules/@fortawesome/fontawesome-free/webfonts/fa-brands-400.ttf": "webfonts/fa-brands-400.ttf",
        "node_modules/@fortawesome/fontawesome-free/webfonts/fa-brands-400.woff2": "webfonts/fa-brands-400.woff2",
        "node_modules/@fortawesome/fontawesome-free/webfonts/fa-solid-400.ttf": "webfonts/fa-solid-400.ttf",
        "node_modules/@fortawesome/fontawesome-free/webfonts/fa-solid-400.woff2": "webfonts/fa-solid-400.woff2",
        "node_modules/@fortawesome/fontawesome-free/webfonts/fa-regular-900.ttf": "webfonts/fa-regular-900.ttf",
        "node_modules/@fortawesome/fontawesome-free/webfonts/fa-regular-900.woff2": "webfonts/fa-regular-900.woff2",
        "node_modules/@fortawesome/fontawesome-free/webfonts/fa-brands-900.ttf": "webfonts/fa-brands-900.ttf",
        "node_modules/@fortawesome/fontawesome-free/webfonts/fa-brands-900.woff2": "webfonts/fa-brands-900.woff2",
        "node_modules/@fortawesome/fontawesome-free/webfonts/fa-solid-900.ttf": "webfonts/fa-solid-900.ttf",
        "node_modules/@fortawesome/fontawesome-free/webfonts/fa-solid-900.woff2": "webfonts/fa-solid-900.woff2"
    }
  }
