{
    "mappings": {
        "properties": {
            "name": {
                "type": "text"
            },
            "description": {
                "type": "text"
            },
            "short_description": {
                "type": "text"
            },
            "friendly_url": {
                "type": "text"
            },
            "weight": {
                "type": "long"
            },
            "width": {
                "type": "long"
            },
            "height": {
                "type": "long"
            },
            "length": {
                "type": "long"
            },
            "before_sale_price": {
                "type": "long"
            },
            "sale_price": {
                "type": "long"
            },
            "quantity": {
                "type": "long"
            },
            "deleted_at": {
                "type": "date"
            },
            "allow_to_sell": {
                "type": "boolean"
            },
            "is_approved": {
                "type": "text"
            },
            "is_pre_order": {
                "type": "boolean"
            },
            "shop_id": {
                "type": "text"
            },
            "category_id": {
                "type": "text"
            },
            "images": {
                "type": "text"
            },
            "list_category_id": {
                "type": "text"
            },
            "category": {
                "type": "nested",
                "properties": {}
            },
            "shop": {
                "properties": {
                    "_id": {
                        "type": "text"
                    },
                    "name": {
                        "type": "text"
                    },
                    "description": {
                        "type": "text"
                    },
                    "user_id": {
                        "type": "text"
                    },
                    "pause_mode": {
                        "type": "text"
                    },
                    "shop_type": {
                        "type": "text"
                    },
                    "createdAt": {
                        "type": "date"
                    },
                    "refund_money_mode": {
                        "type": "boolean"
                    },
                    "refund_money_regulations": {
                        "properties": {
                            "refund_max": {
                                "type": "long"
                            },
                            "regulations": {
                                "type": "text"
                            }
                        }
                    },
                    "shipping_methods": {
                        "type": "nested",
                        "properties": {
                            "_id": {
                                "type": "text"
                            },
                            "shipping_method_id": {
                                "type": "text"
                            },
                            "name": {
                                "type": "text"
                            },
                            "is_active": {
                                "type": "boolean"
                            },
                            "token": {
                                "type": "text"
                            },
                            "pick_address": {
                                "type": "text"
                            },
                            "name_query": {
                                "type": "text"
                            },
                            "code": {
                                "type": "text"
                            }
                        }
                    },
                    "country": {
                        "type": "text"
                    },
                    "refund_conditions": {
                        "type": "nested",
                        "properties": {
                            "active": {
                                "type": "boolean"
                            },
                            "code": {
                                "type": "integer"
                            },
                            "vn_name": {
                                "type": "text"
                            },
                            "ko_name": {
                                "type": "text"
                            },
                            "en_name": {
                                "type": "text"
                            }
                        }
                    },
                    "is_approved": {
                        "type": "boolean"
                    },
                    "ranking": {
                        "type": "integer"
                    },
                    "ranking_today": {
                        "type": "integer"
                    },
                    "ranking_yesterday": {
                        "type": "integer"
                    },
                    "avg_rating": {
                        "type": "float"
                    },
                    "shorten_link": {
                        "type": "text"
                    },
                    "allow_show_on_top": {
                        "type": "boolean"
                    },
                    "rank_policy": {
                        "type": "object"
                    },
                    "ranking_criteria": {
                        "type": "object"
                    },
                    "system_banner": {
                        "type": "text"
                    },
                    "user": {
                        "properties": {
                            "_id": {
                                "type": "text"
                            },
                            "nameOrganizer": {
                                "properties": {
                                    "userName": {
                                        "type": "text"
                                    },
                                    "unsigneduserName": {
                                        "type": "text"
                                    }
                                }
                            },
                            "avatar": {
                                "type": "text"
                            },
                            "email": {
                                "type": "text"
                            },
                            "userName": {
                                "type": "text"
                            },
                            "follow_count": {
                                "type": "integer"
                            },
                            "following_count": {
                                "type": "integer"
                            },
                            "saved_vouchers": {
                                "type": "nested"
                            },
                            "referral_code": {
                                "type": "text"
                            },
                            "is_newbie": {
                                "type": "boolean"
                            },
                            "shorten_link": {
                                "type": "text"
                            },
                            "phoneNumber": {
                                "type": "text"
                            },
                            "birthday": {
                                "type": "text"
                            },
                            "address": {
                                "type": "text"
                            },
                            "totalPosts": {
                                "type": "integer"
                            },
                            "total_product": {
                                "type": "integer"
                            },
                            "email_verified": {
                                "type": "boolean"
                            },
                            "phone_verified": {
                                "type": "boolean"
                            },
                            "createdAt": {
                                "type": "date"
                            },
                            "updatedAt": {
                                "type": "date"
                            }
                        }
                    }
                },
                "user": {
                    "properties": {
                        "_id": {
                            "type": "text"
                        },
                        "userName": {
                            "type": "text"
                        },
                        "avatar": {
                            "type": "text"
                        },
                        "email": {
                            "type": "text"
                        },
                        "gender": {
                            "type": "integer"
                        },
                        "is_newbie": {
                            "type": "boolean"
                        },
                        "shorten_link": {
                            "type": "integer"
                        }
                    },
                    "order_items": {
                        "type": "nested"
                    },
                    "createdAt": {
                        "type": "date"
                    },
                    "updatedAt": {
                        "type": "date"
                    },
                    "detail_size": {
                        "type": "nested",
                        "properties": {
                            "type_size": {
                                "type": "text"
                            },
                            "size_infos": {
                                "type": "nested",
                                "properties": {
                                    "name": {
                                        "type": "text"
                                    },
                                    "unit": {
                                        "type": "text"
                                    }
                                }
                            }
                        }
                    },
                    "is_bookmarked": {
                        "type": "boolean"
                    },
                    "option_types": {
                        "type": "object"
                    },
                    "limit_sale_price_order": {
                        "type": "integer"
                    },
                    "sale_price_order_available": {
                        "type": "integer"
                    },
                    "shipping_information": {
                        "type": "object"
                    },
                    "delivery_instruction": {
                        "type": "object"
                    },
                    "exchange_information": {
                        "type": "object"
                    },
                    "delivery_information": {
                        "type": "object"
                    },
                    "allow_refund": {
                        "type": "boolean"
                    },
                    "duration_refund": {
                        "type": "integer"
                    },
                    "description_images": {
                        "type": "nested"
                    },
                    "refund_conditions": {
                        "type": "nested",
                        "properties": {
                            "active": {
                                "type": "boolean"
                            },
                            "code": {
                                "type": "integer"
                            },
                            "vn_name": {
                                "type": "text"
                            },
                            "ko_name": {
                                "type": "text"
                            },
                            "en_name": {
                                "type": "text"
                            }
                        }
                    },
                    "sold": {
                        "type": "integer"
                    },
                    "shorten_link": {
                        "type": "text"
                    },
                    "discount_percent": {
                        "type": "float"
                    },
                    "custom_images": {
                        "type": "nested",
                        "properties": {
                            "url": {
                                "type": "text"
                            },
                            "x_percent_offset": {
                                "type": "double"
                            },
                            "y_percent_offset": {
                                "type": "double"
                            }
                        }
                    },
                    "popular_mark": {
                        "type": "integer"
                    },
                    "is_guaranteed_item": {
                        "type": "boolean"
                    },
                    "is_genuine_item": {
                        "type": "boolean"
                    },
                    "authen_images": {
                        "type": "boolean"
                    },
                    "top_photo_display_full_mode": {
                        "type": "boolean"
                    },
                    "update_price_remaining": {
                        "type": "integer"
                    },
                    "next_date_update_price": {
                        "type": "date"
                    },
                    "is_sold_out": {
                        "type": "boolean"
                    },
                    "price_updated_dates": {
                        "type": "date"
                    },
                    "price_min_max": {
                        "properties": {
                            "min": {
                                "type": "long"
                            },
                            "max": {
                                "type": "long"
                            }
                        }
                    },
                    "product_detail_infos": {
                        "type": "nested",
                        "properties": {
                            "name": {
                                "type": "text"
                            },
                            "code": {
                                "type": "integer"
                            },
                            "vn_name": {
                                "type": "text"
                            },
                            "ko_name": {
                                "type": "text"
                            },
                            "en_name": {
                                "type": "text"
                            }
                        }
                    },
                    "feedbacks": {
                        "properties": {
                            "totalByMedia": {
                                "type": "integer"
                            },
                            "totalByComment": {
                                "type": "integer"
                            },
                            "totalByStar": {
                                "type": "nested",
                                "properties": {
                                    "vote_star": {
                                        "type": "integer"
                                    },
                                    "total": {
                                        "type": "integer"
                                    }
                                }
                            }
                        }
                    },
                    "vouchers": {
                        "type": "nested",
                        "properties": {
                            "_id": {
                                "type": "text"
                            },
                            "name": {
                                "type": "text"
                            },
                            "target": {
                                "type": "text"
                            },
                            "type": {
                                "type": "text"
                            },
                            "max_discount_value": {
                                "type": "long"
                            },
                            "display_mode": {
                                "type": "text"
                            },
                            "code": {
                                "type": "text"
                            },
                            "start_time": {
                                "type": "date"
                            },
                            "end_time": {
                                "type": "date"
                            },
                            "save_quantity": {
                                "type": "integer"
                            },
                            "use_quantity": {
                                "type": "integer"
                            },
                            "available_quantity": {
                                "type": "integer"
                            },
                            "value": {
                                "type": "integer"
                            },
                            "min_order_value": {
                                "type": "integer"
                            },
                            "max_budget": {
                                "type": "integer"
                            },
                            "shop_id": {
                                "type": "text"
                            },
                            "created_at": {
                                "type": "date"
                            },
                            "updated_at": {
                                "type": "date"
                            },
                            "used_by": {
                                "type": "nested"
                            },
                            "is_public": {
                                "type": "boolean"
                            }
                        }
                    },
                    "max_voucher_discount": {
                        "type": "long"
                    },
                    "time_prepare_orders": {
                        "type": "nested",
                        "properties": {
                            "day": {
                                "type": "text"
                            },
                            "value": {
                                "type": "float"
                            },
                            "unit": {
                                "type": "text"
                            }
                        }
                    },
                    "expected_shipping_fee": {
                        "type": "nested",
                        "properties": {
                            "name": {
                                "type": "text"
                            },
                            "min": {
                                "type": "long"
                            },
                            "max": {
                                "type": "long"
                            }
                        }
                    }
                }
            }
        }
    }
}