[
  { "inputs": [], "name": "InvalidInitialization", "type": "error" },
  { "inputs": [], "name": "NotInitializing", "type": "error" },
  {
    "inputs": [
      { "internalType": "address", "name": "owner", "type": "address" }
    ],
    "name": "OwnableInvalidOwner",
    "type": "error"
  },
  {
    "inputs": [
      { "internalType": "address", "name": "account", "type": "address" }
    ],
    "name": "OwnableUnauthorizedAccount",
    "type": "error"
  },
  {
    "anonymous": false,
    "inputs": [
      {
        "indexed": true,
        "internalType": "address",
        "name": "caller",
        "type": "address"
      },
      {
        "indexed": false,
        "internalType": "uint256",
        "name": "tablesCount",
        "type": "uint256"
      },
      {
        "indexed": false,
        "internalType": "uint256",
        "name": "tablePrice",
        "type": "uint256"
      }
    ],
    "name": "AddTables",
    "type": "event"
  },
  {
    "anonymous": false,
    "inputs": [
      {
        "indexed": true,
        "internalType": "address",
        "name": "caller",
        "type": "address"
      },
      {
        "indexed": false,
        "internalType": "uint256",
        "name": "claimedAmount",
        "type": "uint256"
      }
    ],
    "name": "ClaimRewards",
    "type": "event"
  },
  {
    "anonymous": false,
    "inputs": [
      {
        "indexed": true,
        "internalType": "address",
        "name": "caller",
        "type": "address"
      },
      {
        "indexed": true,
        "internalType": "address",
        "name": "tablesOwner",
        "type": "address"
      },
      {
        "indexed": false,
        "internalType": "uint256",
        "name": "tableFulfillAmount",
        "type": "uint256"
      },
      {
        "indexed": false,
        "internalType": "uint256",
        "name": "fulfilled",
        "type": "uint256"
      }
    ],
    "name": "FulfillTable",
    "type": "event"
  },
  {
    "anonymous": false,
    "inputs": [
      {
        "indexed": false,
        "internalType": "uint64",
        "name": "version",
        "type": "uint64"
      }
    ],
    "name": "Initialized",
    "type": "event"
  },
  {
    "anonymous": false,
    "inputs": [
      {
        "indexed": true,
        "internalType": "address",
        "name": "previousOwner",
        "type": "address"
      },
      {
        "indexed": true,
        "internalType": "address",
        "name": "newOwner",
        "type": "address"
      }
    ],
    "name": "OwnershipTransferred",
    "type": "event"
  },
  {
    "inputs": [],
    "name": "alchemestry",
    "outputs": [
      { "internalType": "contract Alchemestry", "name": "", "type": "address" }
    ],
    "stateMutability": "view",
    "type": "function"
  },
  {
    "inputs": [
      { "internalType": "uint256", "name": "level", "type": "uint256" },
      { "internalType": "uint256", "name": "amount", "type": "uint256" },
      { "internalType": "address", "name": "referral", "type": "address" }
    ],
    "name": "buyTables",
    "outputs": [],
    "stateMutability": "payable",
    "type": "function"
  },
  {
    "inputs": [
      {
        "components": [
          { "internalType": "uint256", "name": "level", "type": "uint256" },
          { "internalType": "uint256", "name": "amount", "type": "uint256" },
          { "internalType": "uint256", "name": "value", "type": "uint256" },
          { "internalType": "address", "name": "referral", "type": "address" }
        ],
        "internalType": "struct QueuePool.BuyTablesMultInput[]",
        "name": "buyInfo",
        "type": "tuple[]"
      }
    ],
    "name": "buyTablesMult",
    "outputs": [],
    "stateMutability": "payable",
    "type": "function"
  },
  {
    "inputs": [
      { "internalType": "uint256", "name": "level", "type": "uint256" },
      { "internalType": "uint256", "name": "amount", "type": "uint256" },
      { "internalType": "address", "name": "referral", "type": "address" }
    ],
    "name": "calculateFees",
    "outputs": [
      { "internalType": "uint256", "name": "globalFee", "type": "uint256" },
      { "internalType": "uint256", "name": "governanceFee", "type": "uint256" },
      { "internalType": "uint256", "name": "referralFee", "type": "uint256" },
      {
        "internalType": "uint256",
        "name": "singleTablePriceWithoutFees",
        "type": "uint256"
      }
    ],
    "stateMutability": "view",
    "type": "function"
  },
  {
    "inputs": [
      { "internalType": "address", "name": "collectTo", "type": "address" }
    ],
    "name": "claimGovernanceFees",
    "outputs": [{ "internalType": "uint256", "name": "", "type": "uint256" }],
    "stateMutability": "nonpayable",
    "type": "function"
  },
  {
    "inputs": [
      { "internalType": "uint256", "name": "level", "type": "uint256" },
      { "internalType": "address", "name": "claimFor", "type": "address" }
    ],
    "name": "claimTableRewards",
    "outputs": [
      { "internalType": "uint256", "name": "claimed", "type": "uint256" }
    ],
    "stateMutability": "nonpayable",
    "type": "function"
  },
  {
    "inputs": [
      { "internalType": "address", "name": "claimFor", "type": "address" }
    ],
    "name": "claimTableRewardsAll",
    "outputs": [
      { "internalType": "uint256", "name": "claimed", "type": "uint256" }
    ],
    "stateMutability": "nonpayable",
    "type": "function"
  },
  {
    "inputs": [],
    "name": "getCurrentActiveLevel",
    "outputs": [{ "internalType": "uint256", "name": "", "type": "uint256" }],
    "stateMutability": "view",
    "type": "function"
  },
  {
    "inputs": [{ "internalType": "uint256", "name": "", "type": "uint256" }],
    "name": "getMaxTablesPerTransactionForLevel",
    "outputs": [{ "internalType": "uint256", "name": "", "type": "uint256" }],
    "stateMutability": "pure",
    "type": "function"
  },
  {
    "inputs": [{ "internalType": "uint256", "name": "", "type": "uint256" }],
    "name": "getPoolLevelDuration",
    "outputs": [{ "internalType": "uint256", "name": "", "type": "uint256" }],
    "stateMutability": "view",
    "type": "function"
  },
  {
    "inputs": [
      { "internalType": "uint256", "name": "level", "type": "uint256" }
    ],
    "name": "getTableFulFillForLevel",
    "outputs": [{ "internalType": "uint256", "name": "", "type": "uint256" }],
    "stateMutability": "pure",
    "type": "function"
  },
  {
    "inputs": [
      { "internalType": "uint256", "name": "level", "type": "uint256" }
    ],
    "name": "getTablePriceForLevel",
    "outputs": [{ "internalType": "uint256", "name": "", "type": "uint256" }],
    "stateMutability": "pure",
    "type": "function"
  },
  {
    "inputs": [],
    "name": "governanceFeesCollected",
    "outputs": [{ "internalType": "uint256", "name": "", "type": "uint256" }],
    "stateMutability": "view",
    "type": "function"
  },
  {
    "inputs": [
      { "internalType": "address", "name": "_owner", "type": "address" },
      {
        "internalType": "address payable",
        "name": "_alchemestry",
        "type": "address"
      }
    ],
    "name": "initialize",
    "outputs": [],
    "stateMutability": "nonpayable",
    "type": "function"
  },
  {
    "inputs": [],
    "name": "owner",
    "outputs": [{ "internalType": "address", "name": "", "type": "address" }],
    "stateMutability": "view",
    "type": "function"
  },
  {
    "inputs": [],
    "name": "renounceOwnership",
    "outputs": [],
    "stateMutability": "nonpayable",
    "type": "function"
  },
  {
    "inputs": [],
    "name": "totalGovernanceFees",
    "outputs": [{ "internalType": "uint256", "name": "", "type": "uint256" }],
    "stateMutability": "view",
    "type": "function"
  },
  {
    "inputs": [
      { "internalType": "address", "name": "newOwner", "type": "address" }
    ],
    "name": "transferOwnership",
    "outputs": [],
    "stateMutability": "nonpayable",
    "type": "function"
  },
  {
    "inputs": [
      { "internalType": "uint256", "name": "_level", "type": "uint256" },
      { "internalType": "address", "name": "_user", "type": "address" }
    ],
    "name": "userLevelInfo",
    "outputs": [
      {
        "components": [
          { "internalType": "address", "name": "referrer", "type": "address" },
          {
            "internalType": "uint256",
            "name": "tablesCount",
            "type": "uint256"
          },
          {
            "internalType": "uint256",
            "name": "referralRewards",
            "type": "uint256"
          },
          {
            "internalType": "uint256",
            "name": "totalFilledAmount",
            "type": "uint256"
          },
          {
            "internalType": "uint256",
            "name": "totalClaimedAmount",
            "type": "uint256"
          }
        ],
        "internalType": "struct TableQueueLibrary.QueueUserInfo",
        "name": "",
        "type": "tuple"
      }
    ],
    "stateMutability": "view",
    "type": "function"
  },
  {
    "inputs": [
      { "internalType": "uint256", "name": "_level", "type": "uint256" },
      { "internalType": "address", "name": "_user", "type": "address" }
    ],
    "name": "userTablesCount",
    "outputs": [{ "internalType": "uint256", "name": "", "type": "uint256" }],
    "stateMutability": "view",
    "type": "function"
  }
]
