{
    "basename": "llvm-doloop_02-afcd91e",
    "cmd": "lfortran --show-llvm {infile} -o {outfile}",
    "infile": "tests/../integration_tests/doloop_02.f90",
    "infile_hash": "3180c4fce9fa3d7573920ef7e507bc76d0a7c47207414db8393b93ff",
    "outfile": null,
    "outfile_hash": null,
    "stdout": "llvm-doloop_02-afcd91e.stdout",
    "stdout_hash": "d809991bf04c35d08b1072df326d75313711be911e34e9fce1fbe085",
    "stderr": null,
    "stderr_hash": null,
    "returncode": 0
}