{
    "basename": "llvm-arrays_op_1-9abaebf",
    "cmd": "lfortran --show-llvm {infile} -o {outfile}",
    "infile": "tests/../integration_tests/arrays_op_1.f90",
    "infile_hash": "be5b09f7d22cbcd7a3e696dd73d60576efa0c24ad30f580af6465613",
    "outfile": null,
    "outfile_hash": null,
    "stdout": "llvm-arrays_op_1-9abaebf.stdout",
    "stdout_hash": "b39c7c78670c9f3b85b79607a4e54234540c7d158492bcad36034336",
    "stderr": null,
    "stderr_hash": null,
    "returncode": 0
}