{
    "basename": "ast_f90-close1-f48fde2",
    "cmd": "lfortran --show-ast-f90 --no-color {infile}",
    "infile": "tests/close1.f90",
    "infile_hash": "b6174b7e66a7b9dea6c59e0e40b1786dc0721bf2b248b292f3576c9c",
    "outfile": null,
    "outfile_hash": null,
    "stdout": "ast_f90-close1-f48fde2.stdout",
    "stdout_hash": "426f94c0d4cfea85485a972ff31ffe66c5bafcd60721894023ca333c",
    "stderr": null,
    "stderr_hash": null,
    "returncode": 0
}