{
    "basename": "ast_f90-interface2-0af5c92",
    "cmd": "lfortran --show-ast-f90 --no-color {infile}",
    "infile": "tests/interface2.f90",
    "infile_hash": "708e539c3b559554e522379a3dd84fbbef89eb01ea66bf9ded4a5fcb",
    "outfile": null,
    "outfile_hash": null,
    "stdout": "ast_f90-interface2-0af5c92.stdout",
    "stdout_hash": "2ca823df4be56508bd2dacbfd981433d4570192a65dd1f9d6ebdc5b3",
    "stderr": null,
    "stderr_hash": null,
    "returncode": 0
}