{
    "basename": "ast_f90-case_02-d3e3cac",
    "cmd": "lfortran --show-ast-f90 --no-color {infile}",
    "infile": "tests/../integration_tests/case_02.f90",
    "infile_hash": "7bbee224aea840614c0a2aef486a632a1120b0926e9f038ef87d47c1",
    "outfile": null,
    "outfile_hash": null,
    "stdout": "ast_f90-case_02-d3e3cac.stdout",
    "stdout_hash": "4a8b17baee41792a283b25929c2dc575d6642e0402d7d91ac331992b",
    "stderr": null,
    "stderr_hash": null,
    "returncode": 0
}