{
    "basename": "asr-string2-86eecd9",
    "cmd": "lfortran --show-asr --no-color {infile} -o {outfile}",
    "infile": "tests/../integration_tests/string2.f90",
    "infile_hash": "e51c4f0399fd44637cd5a7c06c32e7f6525c83b16722b837bc767909",
    "outfile": null,
    "outfile_hash": null,
    "stdout": "asr-string2-86eecd9.stdout",
    "stdout_hash": "e5612e91b1b1bb11054c1d311f7751229975927a38a13694a64e20b2",
    "stderr": null,
    "stderr_hash": null,
    "returncode": 0
}