{
    "basename": "asr-global_scope9-f638dd0",
    "cmd": "lfortran --show-asr --no-color {infile} -o {outfile}",
    "infile": "tests/global_scope9.f90",
    "infile_hash": "29e87c62bbe7f9efedd2e3cf348e80153367ecc0369b16de6f4db296",
    "outfile": null,
    "outfile_hash": null,
    "stdout": "asr-global_scope9-f638dd0.stdout",
    "stdout_hash": "f4defe0c9e5799515dc4dab58bb47033ab44e9f3eb1cfc3420f59a04",
    "stderr": null,
    "stderr_hash": null,
    "returncode": 0
}