{
    "basename": "llvm-init_values-e37737a",
    "cmd": "lfortran --show-llvm {infile} -o {outfile}",
    "infile": "tests/../integration_tests/init_values.f90",
    "infile_hash": "1cafced706fa2754f92f2d460867d6c84638fd10447df12f124fd419",
    "outfile": null,
    "outfile_hash": null,
    "stdout": "llvm-init_values-e37737a.stdout",
    "stdout_hash": "1833fd2a9f0e50d287363e46ab018d09c29be0be9d62df49f7d57def",
    "stderr": null,
    "stderr_hash": null,
    "returncode": 0
}