{
    "basename": "tokens-expr8-70ccdd2",
    "cmd": "lfortran --show-tokens {infile} -o {outfile}",
    "infile": "tests/expr8.f90",
    "infile_hash": "b0f7cfaa460c9319f7cc7b0fa470fbbce940f7f4eef3156b55897b51",
    "outfile": null,
    "outfile_hash": null,
    "stdout": "tokens-expr8-70ccdd2.stdout",
    "stdout_hash": "f7ec05a11cafd75b4ddbbe0cbb606e0da8c6cec70baad1b3647519f7",
    "stderr": null,
    "stderr_hash": null,
    "returncode": 0
}