{
    "basename": "ast_f90-selectrank1-284d675",
    "cmd": "lfortran --show-ast-f90 --no-color {infile}",
    "infile": "tests/selectrank1.f90",
    "infile_hash": "7bd5ab94da79a773b306a0b17ac6754bf7d5bb9dc2df46631d00593c",
    "outfile": null,
    "outfile_hash": null,
    "stdout": "ast_f90-selectrank1-284d675.stdout",
    "stdout_hash": "db099b153262def12daafba5104a11867a3db5cc6c1693d88833e2a2",
    "stderr": null,
    "stderr_hash": null,
    "returncode": 0
}