{
    "basename": "asr-associate_02-ca5c9ec",
    "cmd": "lfortran --show-asr --no-color {infile} -o {outfile}",
    "infile": "tests/../integration_tests/associate_02.f90",
    "infile_hash": "dbb8b4f2546c33b093c6e6bff2a4af346405121ccb63b2bb42d761d6",
    "outfile": null,
    "outfile_hash": null,
    "stdout": "asr-associate_02-ca5c9ec.stdout",
    "stdout_hash": "4b416d96f8a102c310bc85df60c7a4e2bd25a40894aed1429b534055",
    "stderr": null,
    "stderr_hash": null,
    "returncode": 0
}