{
    "basename": "ast-if1-6e771a0",
    "cmd": "lfortran --show-ast --no-color {infile} -o {outfile}",
    "infile": "tests/if1.f90",
    "infile_hash": "52db0c880c11effc03c530998302e40daa23a4e191ee0dbf7fa5e631",
    "outfile": null,
    "outfile_hash": null,
    "stdout": "ast-if1-6e771a0.stdout",
    "stdout_hash": "248c0352490cbf51a14fa8adc50e497041b83ded5125603d145cbda1",
    "stderr": null,
    "stderr_hash": null,
    "returncode": 0
}