; ModuleID = 'LFortran'
source_filename = "LFortran"

@0 = private unnamed_addr constant [6 x i8] c"I've \00", align 1
@1 = private unnamed_addr constant [9 x i8] c"learned \00", align 1
@2 = private unnamed_addr constant [6 x i8] c"from \00", align 1
@3 = private unnamed_addr constant [5 x i8] c"Dr. \00", align 1
@4 = private unnamed_addr constant [8 x i8] c"Fortran\00", align 1
@5 = private unnamed_addr constant [4 x i8] c"%s\0A\00", align 1

define i32 @main() {
.entry:
  %combined = alloca i8*, align 8
  %intro = alloca i8*, align 8
  %last_name = alloca i8*, align 8
  %posit = alloca i8*, align 8
  %title = alloca i8*, align 8
  %verb = alloca i8*, align 8
  store i8* getelementptr inbounds ([6 x i8], [6 x i8]* @0, i32 0, i32 0), i8** %intro, align 8
  store i8* getelementptr inbounds ([9 x i8], [9 x i8]* @1, i32 0, i32 0), i8** %verb, align 8
  store i8* getelementptr inbounds ([6 x i8], [6 x i8]* @2, i32 0, i32 0), i8** %posit, align 8
  store i8* getelementptr inbounds ([5 x i8], [5 x i8]* @3, i32 0, i32 0), i8** %title, align 8
  store i8* getelementptr inbounds ([8 x i8], [8 x i8]* @4, i32 0, i32 0), i8** %last_name, align 8
  %0 = load i8*, i8** %intro, align 8
  %1 = load i8*, i8** %verb, align 8
  %2 = alloca i8*, align 8
  store i8* %0, i8** %2, align 8
  %3 = alloca i8*, align 8
  store i8* %1, i8** %3, align 8
  %4 = alloca i8*, align 8
  call void @_lfortran_strcat(i8** %2, i8** %3, i8** %4)
  %5 = load i8*, i8** %4, align 8
  %6 = load i8*, i8** %posit, align 8
  %7 = alloca i8*, align 8
  store i8* %5, i8** %7, align 8
  %8 = alloca i8*, align 8
  store i8* %6, i8** %8, align 8
  %9 = alloca i8*, align 8
  call void @_lfortran_strcat(i8** %7, i8** %8, i8** %9)
  %10 = load i8*, i8** %9, align 8
  %11 = load i8*, i8** %title, align 8
  %12 = alloca i8*, align 8
  store i8* %10, i8** %12, align 8
  %13 = alloca i8*, align 8
  store i8* %11, i8** %13, align 8
  %14 = alloca i8*, align 8
  call void @_lfortran_strcat(i8** %12, i8** %13, i8** %14)
  %15 = load i8*, i8** %14, align 8
  %16 = load i8*, i8** %last_name, align 8
  %17 = alloca i8*, align 8
  store i8* %15, i8** %17, align 8
  %18 = alloca i8*, align 8
  store i8* %16, i8** %18, align 8
  %19 = alloca i8*, align 8
  call void @_lfortran_strcat(i8** %17, i8** %18, i8** %19)
  %20 = load i8*, i8** %19, align 8
  store i8* %20, i8** %combined, align 8
  %21 = load i8*, i8** %combined, align 8
  call void (i8*, ...) @_lfortran_printf(i8* getelementptr inbounds ([4 x i8], [4 x i8]* @5, i32 0, i32 0), i8* %21)
  ret i32 0
}

declare void @_lfortran_strcat(i8**, i8**, i8**)

declare void @_lfortran_printf(i8*, ...)

