{
    "basename": "llvm-while_02-7138210",
    "cmd": "lfortran --show-llvm {infile} -o {outfile}",
    "infile": "tests/../integration_tests/while_02.f90",
    "infile_hash": "a905fa7d48385e1df9ac039aabeadb0362aa1b11587096303c0839b2",
    "outfile": null,
    "outfile_hash": null,
    "stdout": "llvm-while_02-7138210.stdout",
    "stdout_hash": "71021419dd2b7e4c99d556bb480120cdbebf9f64e2ad8ba92d912531",
    "stderr": null,
    "stderr_hash": null,
    "returncode": 0
}