{
    "basename": "ast-allocate1-757d4bf",
    "cmd": "lfortran --show-ast --no-color {infile} -o {outfile}",
    "infile": "tests/allocate1.f90",
    "infile_hash": "7a28f6115b781d328be0829189ace20f4f862bf745740c6c78400225",
    "outfile": null,
    "outfile_hash": null,
    "stdout": "ast-allocate1-757d4bf.stdout",
    "stdout_hash": "54e9285b4934f98d3b118d4d2b3f78e9c05944c7616dba3519082168",
    "stderr": null,
    "stderr_hash": null,
    "returncode": 0
}