{
    "basename": "llvm-string2-4efbf91",
    "cmd": "lfortran --show-llvm {infile} -o {outfile}",
    "infile": "tests/../integration_tests/string2.f90",
    "infile_hash": "e51c4f0399fd44637cd5a7c06c32e7f6525c83b16722b837bc767909",
    "outfile": null,
    "outfile_hash": null,
    "stdout": "llvm-string2-4efbf91.stdout",
    "stdout_hash": "8ff828c92003f59acf81eea12d9e15b841505f7787cb7891fc7bc90d",
    "stderr": null,
    "stderr_hash": null,
    "returncode": 0
}