{
    "basename": "llvm-callback_03-85dadd1",
    "cmd": "lfortran --show-llvm {infile} -o {outfile}",
    "infile": "tests/../integration_tests/callback_03.f90",
    "infile_hash": "ed8de8dc63a13125cc459d17776eb179835cd6860aa332449493c9e8",
    "outfile": null,
    "outfile_hash": null,
    "stdout": "llvm-callback_03-85dadd1.stdout",
    "stdout_hash": "7e659d5b77e52b27a0e7ae4c70d52a76720abd42475613024518f437",
    "stderr": null,
    "stderr_hash": null,
    "returncode": 0
}