{
    "basename": "asr-arrays_01_size-352da98",
    "cmd": "lfortran --show-asr --no-color {infile} -o {outfile}",
    "infile": "tests/../integration_tests/arrays_01_size.f90",
    "infile_hash": "f104a59140319e5b27a82ce4a6ced812029107c364455652cd7ee3dd",
    "outfile": null,
    "outfile_hash": null,
    "stdout": "asr-arrays_01_size-352da98.stdout",
    "stdout_hash": "ebf3ca5bb35495e8b066aba3729af63f8f8fea25b37c795dc1eb29c3",
    "stderr": null,
    "stderr_hash": null,
    "returncode": 0
}