{
    "basename": "asr-nested_03-57ffed2",
    "cmd": "lfortran --show-asr --no-color {infile} -o {outfile}",
    "infile": "tests/../integration_tests/nested_03.f90",
    "infile_hash": "f5d522eba458efa50018d8ebcd4df6b9098d3fd59164c530fdc522e5",
    "outfile": null,
    "outfile_hash": null,
    "stdout": "asr-nested_03-57ffed2.stdout",
    "stdout_hash": "34bb7045540960d4984ed586fed7d7f759440bf8500afcec000cfd9c",
    "stderr": null,
    "stderr_hash": null,
    "returncode": 0
}