{
    "basename": "llvm-nested_02-6fd2d46",
    "cmd": "lfortran --show-llvm {infile} -o {outfile}",
    "infile": "tests/../integration_tests/nested_02.f90",
    "infile_hash": "ca630d38e8d596a7d4b2db926185e9ec245f6831a9c826a87d669557",
    "outfile": null,
    "outfile_hash": null,
    "stdout": "llvm-nested_02-6fd2d46.stdout",
    "stdout_hash": "0de1c5f802440a3c229a086bedba2825df275a0f0367c4c60f8f9a60",
    "stderr": null,
    "stderr_hash": null,
    "returncode": 0
}