{
    "basename": "asr-subroutine3-8086030",
    "cmd": "lfortran --show-asr --no-color {infile} -o {outfile}",
    "infile": "tests/subroutine3.f90",
    "infile_hash": "174874c0a5fad40d608acbafefcc0c06c96379cc136126d3f05b63e5",
    "outfile": null,
    "outfile_hash": null,
    "stdout": "asr-subroutine3-8086030.stdout",
    "stdout_hash": "a7d4c0cf98f0da4d8cfcad8e32a86232190be3f439babc29253cdca6",
    "stderr": null,
    "stderr_hash": null,
    "returncode": 0
}