{
    "basename": "ast_f90-Subroutine_Call1-f3c8acc",
    "cmd": "lfortran --show-ast-f90 --no-color {infile}",
    "infile": "tests/Subroutine_Call1.f90",
    "infile_hash": "bf7f51f810752b3f8e9381f1e100d0c9b3495c2f87cd120a6ee74148",
    "outfile": null,
    "outfile_hash": null,
    "stdout": "ast_f90-Subroutine_Call1-f3c8acc.stdout",
    "stdout_hash": "8c16ae273f2a1a4f2bf274a2329f33cc3876667598f06dd60f6b49a8",
    "stderr": null,
    "stderr_hash": null,
    "returncode": 0
}