{
    "basename": "pass_global_stmts-expr6-a926072",
    "cmd": "lfortran --pass=global_stmts --show-asr --no-color {infile} -o {outfile}",
    "infile": "tests/expr6.f90",
    "infile_hash": "722af2f789e614d9acf6975aae8260e4949a360066d5aa53a3f05944",
    "outfile": null,
    "outfile_hash": null,
    "stdout": "pass_global_stmts-expr6-a926072.stdout",
    "stdout_hash": "3d77a60dad7f075056d0ce3c541d8668b69019d3684fd03a8513028c",
    "stderr": null,
    "stderr_hash": null,
    "returncode": 0
}