program doloop_05
implicit none
integer :: i, j
1 j = 0
2 I_LOOP: do i = 1, 10
    3 if ((i) == (2)) then
        cycle I_loop
    end if
    4 j = (j) + (i)
end do I_LOOP
6 if ((j) /= (53)) then
    error stop
end if
end program doloop_05
