{
    "basename": "ast-esub1-15eb690",
    "cmd": "lfortran --show-ast --no-color {infile} -o {outfile}",
    "infile": "tests/errors/esub1.f90",
    "infile_hash": "93b7d715c14f2da952a8945b7ea7b16817b269880b156f00497dd7b1",
    "outfile": null,
    "outfile_hash": null,
    "stdout": null,
    "stdout_hash": null,
    "stderr": "ast-esub1-15eb690.stderr",
    "stderr_hash": "acf912835fadbdfbd1ea132148e4cb999572b9bc896d05d8cc50a720",
    "returncode": 2
}