; ModuleID = 'LFortran'
source_filename = "LFortran"

define i32 @main() {
.entry:
  %i = alloca i32, align 4
  %r = alloca float, align 4
  store i32 1, i32* %i, align 4
  store float 1.000000e+00, float* %r, align 4
  %0 = load i32, i32* %i, align 4
  %1 = sitofp i32 %0 to float
  store float %1, float* %r, align 4
  ret i32 0
}

