{
	"$schema": "http://json-schema.org/draft-07/schema#", 
  "type": "object",
  "definitions": {
    "nodes" : {
      "type": "object",
      "required": [
          "guid",
          "name",
          "id",
          "type",
          "description",
          "status"
      ],              
      "properties": {
        "guid": {
          "title": "Guid", 
          "type": "string",
          "minLength": 36,
          "maxLength":36,
          "pattern": "[0-9a-fA-F]{8}\-[0-9a-fA-F]{4}\-[0-9a-fA-F]{4}\-[0-9a-fA-F]{4}\-[0-9a-fA-F]{12}"                  
        },          
        "id": {
          "title": "Id", 
          "type": "string",
          "pattern": "^.*$"
        },
        "name": {
          "title": "Name", 
          "type": "string",
          "pattern": "^.*$"          
        },				
        "description": {
          "title": "Description", 
          "type": "string",
          "pattern": "^.*$"
        },
        "type": {
          "title": "Type", 
          "type": "string",
          "pattern": "^.*$"
        },        
        "status": {
          "title": "Status", 
          "type": "string",
          "pattern": "^.*$"
        }
      },
      "additionalProperties": false  
    }
  }
}
