{
	"$schema": "http://json-schema.org/draft-07/schema#", 
	"$id": "file://models/db/schemas/contract.json", 
	"title": "Root", 
	"type": "object",
	
	"required": [
		"nodes",
		"rels"
	],
	
	"properties": {
		"nodes": {
			"$id": "#root/nodes", 
			"title": "Nodes", 
			"type": "object",
      "minProperties": 3,
      "maxProperties": 3000,  
			"additionalProperties": false,      
			"required": ["status", "status_initiative","action", "user_role", "function_role", "screen", "entity"],
      "propertyNames": {
        "pattern": "(status|status_initiative|action|user_role|function_role|screen|entity)"
      },
      "patternProperties": {
        "^.*$": {
          "type": "object",
          "patternProperties": {
            "[0-9a-fA-F]{8}\-[0-9a-fA-F]{4}\-[0-9a-fA-F]{4}\-[0-9a-fA-F]{4}\-[0-9a-fA-F]{12}": { "$ref": "nodes.json#/definitions/nodes" }
          }
        }
      }
		},

		"rels": {
			"$id": "#root/rels",  
			"title": "Rels", 
			"type": "object",
      "minProperties": 3,
      "maxProperties": 3000,    
			"additionalProperties": false,
      "required": ["status", "action", "user_role", "function_role", "status_initiative"],
      "properties": {
        "status": {
					"type": "object",
          "additionalProperties": false,
          "required": ["status", "action", "screen"],
          "properties": {
            "action": { "type": "object", "patternProperties": { "[0-9a-fA-F]{8}\-[0-9a-fA-F]{4}\-[0-9a-fA-F]{4}\-[0-9a-fA-F]{4}\-[0-9a-fA-F]{12}": { "$ref": "rels.json#/definitions/rels" }}},
            "status": { "type": "object", "patternProperties": { "[0-9a-fA-F]{8}\-[0-9a-fA-F]{4}\-[0-9a-fA-F]{4}\-[0-9a-fA-F]{4}\-[0-9a-fA-F]{12}": { "$ref": "rels.json#/definitions/rels" }}},
            "screen": { "type": "object", "patternProperties": { "[0-9a-fA-F]{8}\-[0-9a-fA-F]{4}\-[0-9a-fA-F]{4}\-[0-9a-fA-F]{4}\-[0-9a-fA-F]{12}": { "$ref": "rels.json#/definitions/rels" }}}
          }
        },
        "status_initiative": {
					"type": "object",
          "additionalProperties": false,
          "required": ["status_initiative", "action", "screen"],
          "properties": {
            "action": { "type": "object", "patternProperties": { "[0-9a-fA-F]{8}\-[0-9a-fA-F]{4}\-[0-9a-fA-F]{4}\-[0-9a-fA-F]{4}\-[0-9a-fA-F]{12}": { "$ref": "rels.json#/definitions/rels" }}},
            "status_initiative": { "type": "object", "patternProperties": { "[0-9a-fA-F]{8}\-[0-9a-fA-F]{4}\-[0-9a-fA-F]{4}\-[0-9a-fA-F]{4}\-[0-9a-fA-F]{12}": { "$ref": "rels.json#/definitions/rels" }}},
            "screen": { "type": "object", "patternProperties": { "[0-9a-fA-F]{8}\-[0-9a-fA-F]{4}\-[0-9a-fA-F]{4}\-[0-9a-fA-F]{4}\-[0-9a-fA-F]{12}": { "$ref": "rels.json#/definitions/rels" }}}
          }
        },
        "action": {
					"type": "object",
          "additionalProperties": false,
          "required": ["status", "entity", "status_initiative"],
          "properties": {
            "status": { "type": "object", "patternProperties": { "[0-9a-fA-F]{8}\-[0-9a-fA-F]{4}\-[0-9a-fA-F]{4}\-[0-9a-fA-F]{4}\-[0-9a-fA-F]{12}": { "$ref": "rels.json#/definitions/rels" }}},
            "status_initiative": { "type": "object", "patternProperties": { "[0-9a-fA-F]{8}\-[0-9a-fA-F]{4}\-[0-9a-fA-F]{4}\-[0-9a-fA-F]{4}\-[0-9a-fA-F]{12}": { "$ref": "rels.json#/definitions/rels" }}},
            "entity": { "type": "object", "patternProperties": { "[0-9a-fA-F]{8}\-[0-9a-fA-F]{4}\-[0-9a-fA-F]{4}\-[0-9a-fA-F]{4}\-[0-9a-fA-F]{12}": { "$ref": "rels.json#/definitions/rels" }}}
          }
        },
        "function_role": {
					"type": "object",
          "additionalProperties": false,
          "required": ["action"],
          "properties": {
            "action": { "type": "object", "patternProperties": { "[0-9a-fA-F]{8}\-[0-9a-fA-F]{4}\-[0-9a-fA-F]{4}\-[0-9a-fA-F]{4}\-[0-9a-fA-F]{12}": { "$ref": "rels.json#/definitions/rels" }}}
          }
        },
        "user_role": {
					"type": "object",
          "additionalProperties": false,
          "required": ["function_role"],
          "properties": {
            "function_role": { "type": "object", "patternProperties": { "[0-9a-fA-F]{8}\-[0-9a-fA-F]{4}\-[0-9a-fA-F]{4}\-[0-9a-fA-F]{4}\-[0-9a-fA-F]{12}": { "$ref": "rels.json#/definitions/rels" }}}
          }
        }
      }
		}
	},
	"additionalProperties": false
}
