[
  "advice-dog",
  "advice-god",
  "advice-peeta",
  "annoying-facebook-girl",
  "anti-joke-chicken",
  "archer",
  "art-student-owl",
  "back-in-my-day",
  "bad-advice-cat",
  "bad-luck-brian",
  "batman-slapping-robin",
  "bear-grylls",
  "buddy-the-elf",
  "business-cat",
  "butthurt-dweller",
  "chemistry-cat",
  "chill-out-lemur",
  "chubby-bubbles-girl",
  "chuck-norris",
  "close-enough",
  "conspiracy-keanu",
  "contradictory-chris",
  "courage-wolf",
  "crazy-girlfriend-praying-mantis",
  "cute-cat",
  "depression-dog",
  "disaster-girl",
  "dont-you-squidward",
  "dr-evil-laser",
  "dumb-blonde",
  "ermahgerd-berks",
  "evil-cows",
  "eye-of-sauron",
  "felix-baumgartner",
  "first-day-on-the-internet-kid",
  "first-world-problems",
  "forever-alone",
  "foul-bachelorette-frog",
  "foul-bachelor-frog",
  "futurama-fry",
  "gangnam-style",
  "george-bush",
  "good-guy-greg",
  "grumpy-cat",
  "han-solo",
  "hedonism-bot",
  "high-expectations-asian-father",
  "hipster-ariel",
  "hipster-kitty",
  "how-tough-are-you",
  "idiot-nerd-girl",
  "ill-just-wait-here",
  "insanity-wolf",
  "i-see-dead-people",
  "i-should-buy-a-boat-cat",
  "i-will-find-you-and-kill-you",
  "joe-biden",
  "joseph-ducreux",
  "kill-yourself-guy",
  "kobe",
  "lame-pun-coon",
  "malicious-advice-mallard",
  "matrix-morpheus",
  "maury-lie-detector",
  "mckayla-maroney-not-impressed",
  "musically-oblivious-8th-grader",
  "obama",
  "one-does-not-simply",
  "oprah-you-get-a",
  "ordinary-muslim-man",
  "original-stoner-dog",
  "overly-manly-man",
  "paranoid-parrot",
  "patriotic-eagle",
  "pepperidge-farm-remembers",
  "philosoraptor",
  "pickup-line-panda",
  "priority-peter",
  "professor-oak",
  "rebecca-black",
  "rich-raven",
  "sad-x-all-the-y",
  "scared-cat",
  "scene-wolf",
  "scumbag-boss",
  "scumbag-steve",
  "see-nobody-cares",
  "sheltering-suburban-mom",
  "slenderman",
  "slowpoke",
  "socially-awesome-awkward-penguin",
  "socially-awesome-penguin",
  "socially-awkward-penguin",
  "south-park-craig",
  "successful-black-man",
  "success-kid",
  "sudden-clarity-clarence",
  "super-cool-ski-instructor",
  "thats-a-paddlin",
  "that-would-be-great",
  "the-most-interesting-cat-in-the-world",
  "the-most-interesting-man-in-the-world",
  "unicorn-man",
  "unpopular-opinion-puffin",
  "vengeance-dad",
  "we-will-rebuild",
  "x-all-the-y",
  "y-u-no"
]