{
  "v": false,
  "f": 12,
  "dfa": {
    "nStates": 4,
    "alphabetSize": 2,
    "startState": 0,
    "acceptStates": [
      true,
      true,
      true,
      false
    ],
    "function": [
      [
        1,
        3
      ],
      [
        -1,
        2
      ],
      [
        2,
        2
      ],
      [
        3,
        3
      ]
    ]
  }
}