{
    "wheels": [
    {
      "title": "Marcello AIM-033",
      "price": 100,
      "url": "./img/1.png",
      "id": 1,
      "color": "rgba(100, 100, 100, 0.5)"
    },
    {
      "title": "ZF TL1481NW",
      "price": 300,
      "url": "./img/2.png",
      "id": 2,
      "color": "rgba(150, 150, 100, 0.5)"
    },
    {
      "title": "TechLine 840 BD",
      "price": 200,
      "url": "./img/3.png",
      "id": 3,
      "color": "rgba(200, 100, 200, 0.5)"
    },
    {
      "title": "Kosei RX B",
      "price": 500,
      "url": "./img/4.png",
      "id": 4,
      "color": "rgba(222, 200, 100, 0.5)"
    },
    {
      "title": "Marcello AIM-050",
      "price": 400,
      "url": "./img/5.png",
      "id": 5,
      "color": "rgba(200, 200, 100, 0.5)"
    },
    {
      "title": "WSP Italy Volkswagen W444",
      "price": 300,
      "url": "./img/6.png",
      "id": 6,
      "color": "rgba(100, 200, 200, 0.5)"
    },
    {
      "title": "Replica Kia KA131",
      "price": 500,
      "url": "./img/7.png",
      "id": 7,
      "color": "rgba(50, 150, 190, 0.5)"
    },
    {
      "title": "Replica Toyota RB17 GMF",
      "price": 300,
      "url": "./img/8.png",
      "id": 8,
      "color": "rgba(100, 200, 111, 0.5)"
    },
    {
      "title": "MKW MK-12 S R18 W8",
      "price": 600,
      "url": "./img/9.png",
      "id": 9,
      "color": "rgba(100, 40, 222, 0.5)"
    },
      {
      "title": "Rial X10 MG R18 W7.5 ",
      "price": 1000,
      "url": "./img/10.png",
      "id": 10,
      "color": "rgb(10, 10, 100, 0.5)"
    } 
]
}   