{
  "type": "web",
  "name": "gallery.ui",
  "core": true,
  "description": "...",
  "version": "0.0.5",
  "repository": "https://gitlab.com/mellisuga/modules/web/gallery.ui.git",
  "dependencies": {
    "core": {
      "web": {
        "paginator": "0.0.1"
      }
    }
  }
}
