/*! ../internals/a-callable */

/*! ../internals/a-constructor */

/*! ../internals/a-possible-prototype */

/*! ../internals/an-instance */

/*! ../internals/an-object */

/*! ../internals/array-includes */

/*! ../internals/array-slice */

/*! ../internals/check-correctness-of-iteration */

/*! ../internals/classof */

/*! ../internals/classof-raw */

/*! ../internals/copy-constructor-properties */

/*! ../internals/create-non-enumerable-property */

/*! ../internals/create-property-descriptor */

/*! ../internals/descriptors */

/*! ../internals/document-create-element */

/*! ../internals/engine-is-browser */

/*! ../internals/engine-is-ios */

/*! ../internals/engine-is-ios-pebble */

/*! ../internals/engine-is-node */

/*! ../internals/engine-is-webos-webkit */

/*! ../internals/engine-user-agent */

/*! ../internals/engine-v8-version */

/*! ../internals/enum-bug-keys */

/*! ../internals/export */

/*! ../internals/fails */

/*! ../internals/function-apply */

/*! ../internals/function-bind-context */

/*! ../internals/function-bind-native */

/*! ../internals/function-call */

/*! ../internals/function-name */

/*! ../internals/function-uncurry-this */

/*! ../internals/get-built-in */

/*! ../internals/get-iterator */

/*! ../internals/get-iterator-method */

/*! ../internals/get-method */

/*! ../internals/global */

/*! ../internals/has-own-property */

/*! ../internals/hidden-keys */

/*! ../internals/host-report-errors */

/*! ../internals/html */

/*! ../internals/ie8-dom-define */

/*! ../internals/indexed-object */

/*! ../internals/inspect-source */

/*! ../internals/internal-state */

/*! ../internals/is-array-iterator-method */

/*! ../internals/is-callable */

/*! ../internals/is-constructor */

/*! ../internals/is-forced */

/*! ../internals/is-object */

/*! ../internals/is-pure */

/*! ../internals/is-symbol */

/*! ../internals/iterate */

/*! ../internals/iterator-close */

/*! ../internals/iterators */

/*! ../internals/length-of-array-like */

/*! ../internals/microtask */

/*! ../internals/native-promise-constructor */

/*! ../internals/native-symbol */

/*! ../internals/native-weak-map */

/*! ../internals/new-promise-capability */

/*! ../internals/object-define-property */

/*! ../internals/object-get-own-property-descriptor */

/*! ../internals/object-get-own-property-names */

/*! ../internals/object-get-own-property-symbols */

/*! ../internals/object-is-prototype-of */

/*! ../internals/object-keys-internal */

/*! ../internals/object-property-is-enumerable */

/*! ../internals/object-set-prototype-of */

/*! ../internals/ordinary-to-primitive */

/*! ../internals/own-keys */

/*! ../internals/perform */

/*! ../internals/promise-resolve */

/*! ../internals/queue */

/*! ../internals/redefine */

/*! ../internals/redefine-all */

/*! ../internals/require-object-coercible */

/*! ../internals/set-global */

/*! ../internals/set-species */

/*! ../internals/set-to-string-tag */

/*! ../internals/shared */

/*! ../internals/shared-key */

/*! ../internals/shared-store */

/*! ../internals/species-constructor */

/*! ../internals/task */

/*! ../internals/to-absolute-index */

/*! ../internals/to-indexed-object */

/*! ../internals/to-integer-or-infinity */

/*! ../internals/to-length */

/*! ../internals/to-object */

/*! ../internals/to-primitive */

/*! ../internals/to-property-key */

/*! ../internals/to-string-tag-support */

/*! ../internals/try-to-string */

/*! ../internals/uid */

/*! ../internals/use-symbol-as-uid */

/*! ../internals/v8-prototype-define-bug */

/*! ../internals/validate-arguments-length */

/*! ../internals/well-known-symbol */

/*! core-js/modules/es.promise.js */

/*!***********************************************!*\
  !*** ./node_modules/core-js/internals/uid.js ***!
  \***********************************************/

/*!************************************************!*\
  !*** ./node_modules/core-js/internals/html.js ***!
  \************************************************/

/*!************************************************!*\
  !*** ./node_modules/core-js/internals/task.js ***!
  \************************************************/

/*!*************************************************!*\
  !*** ./node_modules/core-js/internals/fails.js ***!
  \*************************************************/

/*!*************************************************!*\
  !*** ./node_modules/core-js/internals/queue.js ***!
  \*************************************************/

/*!**************************************************!*\
  !*** ./node_modules/core-js/internals/export.js ***!
  \**************************************************/

/*!**************************************************!*\
  !*** ./node_modules/core-js/internals/global.js ***!
  \**************************************************/

/*!**************************************************!*\
  !*** ./node_modules/core-js/internals/shared.js ***!
  \**************************************************/

/*!***************************************************!*\
  !*** ./node_modules/core-js/internals/classof.js ***!
  \***************************************************/

/*!***************************************************!*\
  !*** ./node_modules/core-js/internals/is-pure.js ***!
  \***************************************************/

/*!***************************************************!*\
  !*** ./node_modules/core-js/internals/iterate.js ***!
  \***************************************************/

/*!***************************************************!*\
  !*** ./node_modules/core-js/internals/perform.js ***!
  \***************************************************/

/*!****************************************************!*\
  !*** ./node_modules/core-js/internals/own-keys.js ***!
  \****************************************************/

/*!****************************************************!*\
  !*** ./node_modules/core-js/internals/redefine.js ***!
  \****************************************************/

/*!****************************************************!*\
  !*** ./node_modules/core-js/modules/es.promise.js ***!
  \****************************************************/

/*!*****************************************************!*\
  !*** ./node_modules/core-js/internals/an-object.js ***!
  \*****************************************************/

/*!*****************************************************!*\
  !*** ./node_modules/core-js/internals/is-forced.js ***!
  \*****************************************************/

/*!*****************************************************!*\
  !*** ./node_modules/core-js/internals/is-object.js ***!
  \*****************************************************/

/*!*****************************************************!*\
  !*** ./node_modules/core-js/internals/is-symbol.js ***!
  \*****************************************************/

/*!*****************************************************!*\
  !*** ./node_modules/core-js/internals/iterators.js ***!
  \*****************************************************/

/*!*****************************************************!*\
  !*** ./node_modules/core-js/internals/microtask.js ***!
  \*****************************************************/

/*!*****************************************************!*\
  !*** ./node_modules/core-js/internals/to-length.js ***!
  \*****************************************************/

/*!*****************************************************!*\
  !*** ./node_modules/core-js/internals/to-object.js ***!
  \*****************************************************/

/*!******************************************************!*\
  !*** ./node_modules/core-js/internals/a-callable.js ***!
  \******************************************************/

/*!******************************************************!*\
  !*** ./node_modules/core-js/internals/get-method.js ***!
  \******************************************************/

/*!******************************************************!*\
  !*** ./node_modules/core-js/internals/set-global.js ***!
  \******************************************************/

/*!******************************************************!*\
  !*** ./node_modules/core-js/internals/shared-key.js ***!
  \******************************************************/

/*!*******************************************************!*\
  !*** ./node_modules/core-js/internals/an-instance.js ***!
  \*******************************************************/

/*!*******************************************************!*\
  !*** ./node_modules/core-js/internals/array-slice.js ***!
  \*******************************************************/

/*!*******************************************************!*\
  !*** ./node_modules/core-js/internals/classof-raw.js ***!
  \*******************************************************/

/*!*******************************************************!*\
  !*** ./node_modules/core-js/internals/descriptors.js ***!
  \*******************************************************/

/*!*******************************************************!*\
  !*** ./node_modules/core-js/internals/hidden-keys.js ***!
  \*******************************************************/

/*!*******************************************************!*\
  !*** ./node_modules/core-js/internals/is-callable.js ***!
  \*******************************************************/

/*!*******************************************************!*\
  !*** ./node_modules/core-js/internals/set-species.js ***!
  \*******************************************************/

/*!********************************************************!*\
  !*** ./node_modules/core-js/internals/get-built-in.js ***!
  \********************************************************/

/*!********************************************************!*\
  !*** ./node_modules/core-js/internals/get-iterator.js ***!
  \********************************************************/

/*!********************************************************!*\
  !*** ./node_modules/core-js/internals/redefine-all.js ***!
  \********************************************************/

/*!********************************************************!*\
  !*** ./node_modules/core-js/internals/shared-store.js ***!
  \********************************************************/

/*!********************************************************!*\
  !*** ./node_modules/core-js/internals/to-primitive.js ***!
  \********************************************************/

/*!*********************************************************!*\
  !*** ./node_modules/core-js/internals/a-constructor.js ***!
  \*********************************************************/

/*!*********************************************************!*\
  !*** ./node_modules/core-js/internals/engine-is-ios.js ***!
  \*********************************************************/

/*!*********************************************************!*\
  !*** ./node_modules/core-js/internals/enum-bug-keys.js ***!
  \*********************************************************/

/*!*********************************************************!*\
  !*** ./node_modules/core-js/internals/function-call.js ***!
  \*********************************************************/

/*!*********************************************************!*\
  !*** ./node_modules/core-js/internals/function-name.js ***!
  \*********************************************************/

/*!*********************************************************!*\
  !*** ./node_modules/core-js/internals/native-symbol.js ***!
  \*********************************************************/

/*!*********************************************************!*\
  !*** ./node_modules/core-js/internals/try-to-string.js ***!
  \*********************************************************/

/*!**********************************************************!*\
  !*** ./node_modules/core-js/internals/array-includes.js ***!
  \**********************************************************/

/*!**********************************************************!*\
  !*** ./node_modules/core-js/internals/engine-is-node.js ***!
  \**********************************************************/

/*!**********************************************************!*\
  !*** ./node_modules/core-js/internals/function-apply.js ***!
  \**********************************************************/

/*!**********************************************************!*\
  !*** ./node_modules/core-js/internals/ie8-dom-define.js ***!
  \**********************************************************/

/*!**********************************************************!*\
  !*** ./node_modules/core-js/internals/indexed-object.js ***!
  \**********************************************************/

/*!**********************************************************!*\
  !*** ./node_modules/core-js/internals/inspect-source.js ***!
  \**********************************************************/

/*!**********************************************************!*\
  !*** ./node_modules/core-js/internals/internal-state.js ***!
  \**********************************************************/

/*!**********************************************************!*\
  !*** ./node_modules/core-js/internals/is-constructor.js ***!
  \**********************************************************/

/*!**********************************************************!*\
  !*** ./node_modules/core-js/internals/iterator-close.js ***!
  \**********************************************************/

/*!***********************************************************!*\
  !*** ./node_modules/core-js/internals/native-weak-map.js ***!
  \***********************************************************/

/*!***********************************************************!*\
  !*** ./node_modules/core-js/internals/promise-resolve.js ***!
  \***********************************************************/

/*!***********************************************************!*\
  !*** ./node_modules/core-js/internals/to-property-key.js ***!
  \***********************************************************/

/*!************************************************************!*\
  !*** ./node_modules/core-js/internals/has-own-property.js ***!
  \************************************************************/

/*!*************************************************************!*\
  !*** ./node_modules/core-js/internals/engine-is-browser.js ***!
  \*************************************************************/

/*!*************************************************************!*\
  !*** ./node_modules/core-js/internals/engine-user-agent.js ***!
  \*************************************************************/

/*!*************************************************************!*\
  !*** ./node_modules/core-js/internals/engine-v8-version.js ***!
  \*************************************************************/

/*!*************************************************************!*\
  !*** ./node_modules/core-js/internals/set-to-string-tag.js ***!
  \*************************************************************/

/*!*************************************************************!*\
  !*** ./node_modules/core-js/internals/to-absolute-index.js ***!
  \*************************************************************/

/*!*************************************************************!*\
  !*** ./node_modules/core-js/internals/to-indexed-object.js ***!
  \*************************************************************/

/*!*************************************************************!*\
  !*** ./node_modules/core-js/internals/use-symbol-as-uid.js ***!
  \*************************************************************/

/*!*************************************************************!*\
  !*** ./node_modules/core-js/internals/well-known-symbol.js ***!
  \*************************************************************/

/*!**************************************************************!*\
  !*** ./node_modules/core-js/internals/host-report-errors.js ***!
  \**************************************************************/

/*!***************************************************************!*\
  !*** ./node_modules/core-js/internals/get-iterator-method.js ***!
  \***************************************************************/

/*!***************************************************************!*\
  !*** ./node_modules/core-js/internals/species-constructor.js ***!
  \***************************************************************/

/*!****************************************************************!*\
  !*** ./node_modules/core-js/internals/a-possible-prototype.js ***!
  \****************************************************************/

/*!****************************************************************!*\
  !*** ./node_modules/core-js/internals/engine-is-ios-pebble.js ***!
  \****************************************************************/

/*!****************************************************************!*\
  !*** ./node_modules/core-js/internals/function-bind-native.js ***!
  \****************************************************************/

/*!****************************************************************!*\
  !*** ./node_modules/core-js/internals/length-of-array-like.js ***!
  \****************************************************************/

/*!****************************************************************!*\
  !*** ./node_modules/core-js/internals/object-keys-internal.js ***!
  \****************************************************************/

/*!*****************************************************************!*\
  !*** ./node_modules/core-js/internals/function-bind-context.js ***!
  \*****************************************************************/

/*!*****************************************************************!*\
  !*** ./node_modules/core-js/internals/function-uncurry-this.js ***!
  \*****************************************************************/

/*!*****************************************************************!*\
  !*** ./node_modules/core-js/internals/ordinary-to-primitive.js ***!
  \*****************************************************************/

/*!*****************************************************************!*\
  !*** ./node_modules/core-js/internals/to-string-tag-support.js ***!
  \*****************************************************************/

/*!******************************************************************!*\
  !*** ./node_modules/core-js/internals/engine-is-webos-webkit.js ***!
  \******************************************************************/

/*!******************************************************************!*\
  !*** ./node_modules/core-js/internals/new-promise-capability.js ***!
  \******************************************************************/

/*!******************************************************************!*\
  !*** ./node_modules/core-js/internals/object-define-property.js ***!
  \******************************************************************/

/*!******************************************************************!*\
  !*** ./node_modules/core-js/internals/object-is-prototype-of.js ***!
  \******************************************************************/

/*!******************************************************************!*\
  !*** ./node_modules/core-js/internals/to-integer-or-infinity.js ***!
  \******************************************************************/

/*!*******************************************************************!*\
  !*** ./node_modules/core-js/internals/document-create-element.js ***!
  \*******************************************************************/

/*!*******************************************************************!*\
  !*** ./node_modules/core-js/internals/object-set-prototype-of.js ***!
  \*******************************************************************/

/*!*******************************************************************!*\
  !*** ./node_modules/core-js/internals/v8-prototype-define-bug.js ***!
  \*******************************************************************/

/*!********************************************************************!*\
  !*** ./node_modules/core-js/internals/is-array-iterator-method.js ***!
  \********************************************************************/

/*!********************************************************************!*\
  !*** ./node_modules/core-js/internals/require-object-coercible.js ***!
  \********************************************************************/

/*!*********************************************************************!*\
  !*** ./node_modules/core-js/internals/validate-arguments-length.js ***!
  \*********************************************************************/

/*!**********************************************************************!*\
  !*** ./node_modules/core-js/internals/create-property-descriptor.js ***!
  \**********************************************************************/

/*!**********************************************************************!*\
  !*** ./node_modules/core-js/internals/native-promise-constructor.js ***!
  \**********************************************************************/

/*!***********************************************************************!*\
  !*** ./node_modules/core-js/internals/copy-constructor-properties.js ***!
  \***********************************************************************/

/*!************************************************************************!*\
  !*** ../../../Packages/mellisuga_modules/waf/cms/globals/src/index.js ***!
  \************************************************************************/

/*!*************************************************************************!*\
  !*** ./node_modules/core-js/internals/object-get-own-property-names.js ***!
  \*************************************************************************/

/*!*************************************************************************!*\
  !*** ./node_modules/core-js/internals/object-property-is-enumerable.js ***!
  \*************************************************************************/

/*!**************************************************************************!*\
  !*** ./node_modules/core-js/internals/check-correctness-of-iteration.js ***!
  \**************************************************************************/

/*!**************************************************************************!*\
  !*** ./node_modules/core-js/internals/create-non-enumerable-property.js ***!
  \**************************************************************************/

/*!***************************************************************************!*\
  !*** ./node_modules/core-js/internals/object-get-own-property-symbols.js ***!
  \***************************************************************************/

/*!******************************************************************************!*\
  !*** ./node_modules/core-js/internals/object-get-own-property-descriptor.js ***!
  \******************************************************************************/
