
Fri Sep 18 2020 03:19:03
ERROR: multi core-js/stable regenerator-runtime/runtime /home/qualphey/Packages/mellisuga/core/content_manager/globals/src/index.js
Module not found: Error: Can't resolve '/home/qualphey/Packages/mellisuga/core/content_manager/globals/src/index.js' in '/home/qualphey/Development/larvita'
resolve '/home/qualphey/Packages/mellisuga/core/content_manager/globals/src/index.js' in '/home/qualphey/Development/larvita'
  using description file: /home/qualphey/Development/larvita/package.json (relative path: .)
    Field 'browser' doesn't contain a valid alias configuration
    using description file: /home/qualphey/Packages/mellisuga/package.json (relative path: ./core/content_manager/globals/src/index.js)
      no extension
        Field 'browser' doesn't contain a valid alias configuration
        /home/qualphey/Packages/mellisuga/core/content_manager/globals/src/index.js doesn't exist
      .wasm
        Field 'browser' doesn't contain a valid alias configuration
        /home/qualphey/Packages/mellisuga/core/content_manager/globals/src/index.js.wasm doesn't exist
      .mjs
        Field 'browser' doesn't contain a valid alias configuration
        /home/qualphey/Packages/mellisuga/core/content_manager/globals/src/index.js.mjs doesn't exist
      .js
        Field 'browser' doesn't contain a valid alias configuration
        /home/qualphey/Packages/mellisuga/core/content_manager/globals/src/index.js.js doesn't exist
      .json
        Field 'browser' doesn't contain a valid alias configuration
        /home/qualphey/Packages/mellisuga/core/content_manager/globals/src/index.js.json doesn't exist
      as directory
        /home/qualphey/Packages/mellisuga/core/content_manager/globals/src/index.js doesn't exist
[/home/qualphey/Packages/mellisuga/core/content_manager/globals/src/index.js]
[/home/qualphey/Packages/mellisuga/core/content_manager/globals/src/index.js.wasm]
[/home/qualphey/Packages/mellisuga/core/content_manager/globals/src/index.js.mjs]
[/home/qualphey/Packages/mellisuga/core/content_manager/globals/src/index.js.js]
[/home/qualphey/Packages/mellisuga/core/content_manager/globals/src/index.js.json]
 @ multi core-js/stable regenerator-runtime/runtime /home/qualphey/Packages/mellisuga/core/content_manager/globals/src/index.js ./main[2]

Sat Oct 10 2020 19:58:42
ERROR: /home/qualphey/Packages/mellisuga/core/content_manager/globals/src/index.js
Module not found: Error: Can't resolve 'core/logbot/index.js' in '/home/qualphey/Packages/mellisuga/core/content_manager/globals/src'
resolve 'core/logbot/index.js' in '/home/qualphey/Packages/mellisuga/core/content_manager/globals/src'
  Parsed request is a module
  using description file: /home/qualphey/Packages/mellisuga/package.json (relative path: ./core/content_manager/globals/src)
    aliased with mapping 'core': '/home/qualphey/Packages/mellisuga/core_modules/web' to '/home/qualphey/Packages/mellisuga/core_modules/web/logbot/index.js'
      using description file: /home/qualphey/Packages/mellisuga/package.json (relative path: ./core/content_manager/globals/src)
        Field 'browser' doesn't contain a valid alias configuration
        using description file: /home/qualphey/Packages/mellisuga/package.json (relative path: ./core_modules/web/logbot/index.js)
          no extension
            Field 'browser' doesn't contain a valid alias configuration
            /home/qualphey/Packages/mellisuga/core_modules/web/logbot/index.js doesn't exist
          .wasm
            Field 'browser' doesn't contain a valid alias configuration
            /home/qualphey/Packages/mellisuga/core_modules/web/logbot/index.js.wasm doesn't exist
          .mjs
            Field 'browser' doesn't contain a valid alias configuration
            /home/qualphey/Packages/mellisuga/core_modules/web/logbot/index.js.mjs doesn't exist
          .js
            Field 'browser' doesn't contain a valid alias configuration
            /home/qualphey/Packages/mellisuga/core_modules/web/logbot/index.js.js doesn't exist
          .json
            Field 'browser' doesn't contain a valid alias configuration
            /home/qualphey/Packages/mellisuga/core_modules/web/logbot/index.js.json doesn't exist
          as directory
            /home/qualphey/Packages/mellisuga/core_modules/web/logbot/index.js doesn't exist
[/home/qualphey/Packages/mellisuga/core_modules/web/logbot/index.js]
[/home/qualphey/Packages/mellisuga/core_modules/web/logbot/index.js.wasm]
[/home/qualphey/Packages/mellisuga/core_modules/web/logbot/index.js.mjs]
[/home/qualphey/Packages/mellisuga/core_modules/web/logbot/index.js.js]
[/home/qualphey/Packages/mellisuga/core_modules/web/logbot/index.js.json]
 @ /home/qualphey/Packages/mellisuga/core/content_manager/globals/src/index.js 1:0-31
 @ multi core-js/stable regenerator-runtime/runtime /home/qualphey/Packages/mellisuga/core/content_manager/globals/src/index.js

Sat Oct 10 2020 20:36:32
ERROR: /home/qualphey/Packages/mellisuga/core_modules/web/logbot.ui/index.js
Module build failed (from ./node_modules/babel-loader/lib/index.js):
SyntaxError: /home/qualphey/Packages/mellisuga/core_modules/web/logbot.ui/index.js: Unexpected token, expected "," (69:4)

  67 |     await XHR.post('/mellisuga-report-error', {
  68 |       error: omsg 
> 69 |     await XHR.post('/mellisuga-report-error', {
     |     ^
  70 |       error: message
  71 |     }, "access_token");
  72 |     oldErr.apply(console, arguments);
    at Parser._raise (/home/qualphey/Development/ypatingas_grozis/node_modules/@babel/parser/lib/index.js:742:17)
    at Parser.raiseWithData (/home/qualphey/Development/ypatingas_grozis/node_modules/@babel/parser/lib/index.js:735:17)
    at Parser.raise (/home/qualphey/Development/ypatingas_grozis/node_modules/@babel/parser/lib/index.js:729:17)
    at Parser.unexpected (/home/qualphey/Development/ypatingas_grozis/node_modules/@babel/parser/lib/index.js:8779:16)
    at Parser.expect (/home/qualphey/Development/ypatingas_grozis/node_modules/@babel/parser/lib/index.js:8765:28)
    at Parser.parseObj (/home/qualphey/Development/ypatingas_grozis/node_modules/@babel/parser/lib/index.js:10387:14)
    at Parser.parseExprAtom (/home/qualphey/Development/ypatingas_grozis/node_modules/@babel/parser/lib/index.js:10017:28)
    at Parser.parseExprSubscripts (/home/qualphey/Development/ypatingas_grozis/node_modules/@babel/parser/lib/index.js:9624:23)
    at Parser.parseMaybeUnary (/home/qualphey/Development/ypatingas_grozis/node_modules/@babel/parser/lib/index.js:9604:21)
    at Parser.parseExprOps (/home/qualphey/Development/ypatingas_grozis/node_modules/@babel/parser/lib/index.js:9474:23)
 @ /home/qualphey/Packages/mellisuga/core/content_manager/globals/src/index.js 1:0-34
 @ multi core-js/stable regenerator-runtime/runtime /home/qualphey/Packages/mellisuga/core/content_manager/globals/src/index.js
