NOTA= 4,76

==================================
1.
5.0
BUEN TRABAJO!!
==================================
2.
----------------------------------
p1
4.0
-El tiro parabolico no esta bueno cuando y0!=0

----------------------------------
p2

-4.8

- La información del sistema se debería imprimir despues de la ejecución

==================================
3.

----------------------------------
p1
5
-Muy buen trabajo!!
----------------------------------
p2
5
- Muy buen trabajo!!

==================================
4.
5
- BUEN TRABAJO!!