<?xml version="1.0" encoding="utf-8"?>
<!-- Generator: Adobe Illustrator 21.1.0, SVG Export Plug-In . SVG Version: 6.00 Build 0)  -->
<svg version="1.1" id="Calque_1" xmlns="http://www.w3.org/2000/svg" xmlns:xlink="http://www.w3.org/1999/xlink" x="0px" y="0px"
	 viewBox="0 0 250 250" style="enable-background:new 0 0 250 250;" xml:space="preserve">
<style type="text/css">
	.st0{fill:#FFFFFF;}
	.st1{fill:#A7D1E5;}
	.st2{fill:#1E639E;}
	.st3{fill:#EEC315;}
	.st4{fill:#FFFFFF;stroke:#A7D1E5;stroke-width:4.506;stroke-miterlimit:10;}
</style>
<g>
	<path class="st0" d="M216.1,125c0,50.3-40.8,91.1-91.1,91.1S33.9,175.3,33.9,125c0-50.3,40.8-91.1,91.1-91.1S216.1,74.7,216.1,125z
		"/>
	<path class="st1" d="M125,30c-52.4,0-95,42.6-95,95c0,1,0,2.1,0.1,3.1c3.6-3,7.2-5.8,11.1-8.4c2.7-43.9,39.3-78.8,83.9-78.8
		c44.6,0,81.1,34.9,83.9,78.8c3.8,2.6,7.5,5.4,11.1,8.4c0-1,0.1-2.1,0.1-3.1C220,72.6,177.4,30,125,30z"/>
	<path class="st2" d="M208.9,119.7c0.1,1.8,0.2,3.5,0.2,5.3c0,2.7-0.1,5.4-0.4,8.1c-4.1,42.6-40.1,76-83.7,76
		c-43.6,0-79.6-33.4-83.7-76c-0.3-2.7-0.4-5.4-0.4-8.1c0-1.8,0.1-3.5,0.2-5.3c-3.8,2.6-7.5,5.4-11.1,8.4c0.1,4.6,0.6,9,1.4,13.4
		C39.3,186.1,78.2,220,125,220c46.8,0,85.7-34,93.6-78.5c0.8-4.4,1.2-8.9,1.4-13.4C216.4,125.1,212.7,122.3,208.9,119.7z"/>
	<path class="st2" d="M165.4,158.4c0,2.1-1.7,3.9-3.9,3.9H80.7c-2.1,0-3.9-1.7-3.9-3.9v-52.6c0-2.1,1.7-3.9,3.9-3.9h80.8
		c2.1,0,3.9,1.7,3.9,3.9V158.4z"/>
	<path class="st3" d="M155.8,77.9c0-1.1-1.1-2-2.2-2h-49.5c-1.2,0-2.1,0.9-2.1,2v8.1c0,0,0,0,0,0c0,0,0,0,0,0v9.8h12.3V86h29.3v10.1
		h12.3v-9.9c0,0,0,0,0,0c0,0,0,0,0,0L155.8,77.9z"/>
	<path class="st4" d="M173.2,152.6c0,2.1-1.7,3.9-3.9,3.9H88.5c-2.1,0-3.9-1.7-3.9-3.9V99.9c0-2.1,1.7-3.9,3.9-3.9h80.8
		c2.1,0,3.9,1.7,3.9,3.9V152.6z"/>
	<g>
		<path class="st1" d="M143.6,95.9h12.2v60.5h-12.2V95.9z"/>
		<path class="st1" d="M101.8,95.9h12.5v60.5h-12.5V95.9z"/>
	</g>
</g>
</svg>
