<svg width="60" height="46" viewBox="0 0 60 46" fill="none" xmlns="http://www.w3.org/2000/svg">
<path d="M27.1752 44.8284C28.7373 46.3905 31.27 46.3905 32.8321 44.8284L58.2879 19.3726C59.85 17.8105 59.85 15.2778 58.2879 13.7157C56.7258 12.1536 54.1932 12.1536 52.6311 13.7157L30.0037 36.3431L7.37625 13.7157C5.81415 12.1536 3.28149 12.1536 1.71939 13.7157C0.157293 15.2778 0.157293 17.8105 1.71939 19.3726L27.1752 44.8284ZM26.0037 33.5V42H34.0037V33.5H26.0037Z" fill="black"/>
<path d="M28.2359 25.7678C29.2122 26.7441 30.7951 26.7441 31.7714 25.7678L47.6813 9.85786C48.6576 8.88155 48.6576 7.29864 47.6813 6.32233C46.705 5.34602 45.1221 5.34602 44.1458 6.32233L30.0037 20.4645L15.8615 6.32233C14.8852 5.34602 13.3023 5.34602 12.326 6.32233C11.3497 7.29864 11.3497 8.88155 12.326 9.85786L28.2359 25.7678ZM27.5037 22V24H32.5037V22H27.5037Z" fill="black"/>
<path d="M28.943 13.0607C29.5288 13.6464 30.4785 13.6464 31.0643 13.0607L40.6103 3.51472C41.1961 2.92893 41.1961 1.97919 40.6103 1.3934C40.0245 0.807611 39.0747 0.807611 38.4889 1.3934L30.0037 9.87868L21.5184 1.3934C20.9326 0.807611 19.9828 0.807611 19.3971 1.3934C18.8113 1.97919 18.8113 2.92893 19.3971 3.51472L28.943 13.0607ZM28.5037 10V12H31.5037V10H28.5037Z" fill="black"/>
</svg>
