com\kodlayanadam\logs\mdc\MdcHandler.class
com\kodlayanadam\logs\interceptor\ResponseBodyInterceptor.class
com\kodlayanadam\logs\interceptor\RequestBodyInterceptor.class
com\kodlayanadam\logs\InterceptLog.class
com\kodlayanadam\logs\CustomWebConfigurer.class
com\kodlayanadam\logs\utils\LogUtil.class
com\kodlayanadam\logs\service\LoggingServiceImpl.class
com\kodlayanadam\logs\service\LoggingService.class
