com\kodlayanadam\common\enums\CurrencyCode.class
com\kodlayanadam\common\dto\BaseDto.class
com\kodlayanadam\common\enums\ServiceEnum.class
com\kodlayanadam\common\dto\ServiceResponse.class
com\kodlayanadam\common\dto\ServiceRequest.class
com\kodlayanadam\common\enums\MetalSymbol.class
