C:\Users\matalay\Desktop\metal-project\core\exception\src\main\java\com\kodlayanadam\exception\error\ApiSubError.java
C:\Users\matalay\Desktop\metal-project\core\exception\src\main\java\com\kodlayanadam\exception\error\ApiError.java
C:\Users\matalay\Desktop\metal-project\core\exception\src\main\java\com\kodlayanadam\exception\ServiceException.java
C:\Users\matalay\Desktop\metal-project\core\exception\src\main\java\com\kodlayanadam\exception\error\ApiValidationError.java
C:\Users\matalay\Desktop\metal-project\core\exception\src\main\java\com\kodlayanadam\exception\handler\ServiceExceptionHandler.java
C:\Users\matalay\Desktop\metal-project\core\exception\src\main\java\com\kodlayanadam\exception\utils\LowerCaseClassNameResolver.java
