<?xml version="1.0" standalone="no"?>
<!DOCTYPE svg PUBLIC "-//W3C//DTD SVG 1.1//EN" "http://www.w3.org/Graphics/SVG/1.1/DTD/svg11.dtd" >
<!--
2020-9-29: Created with FontForge (http://fontforge.org)
-->
<svg xmlns="http://www.w3.org/2000/svg" xmlns:xlink="http://www.w3.org/1999/xlink" version="1.1">
<metadata>
Created by FontForge 20170731 at Tue Sep 29 04:07:58 2020
 By root

</metadata>
<defs>
<font id="Flaticon" horiz-adv-x="512" >
  <font-face 
    font-family="Flaticon"
    font-weight="400"
    font-stretch="normal"
    units-per-em="512"
    panose-1="2 0 5 3 0 0 0 0 0 0"
    ascent="448"
    descent="-64"
    bbox="-1.1432e-05 -64 512.35 448"
    underline-thickness="25.6"
    underline-position="-51.2"
    unicode-range="U+0020-F109"
  />
    <missing-glyph />
    <glyph glyph-name="space" unicode=" " horiz-adv-x="200" 
 />
    <glyph glyph-name="006-linkedin" unicode="&#xf105;" 
d="M160.008 25h-70v226h70v-226zM166.992 323.004c0 -22.6367 -18.3594 -41.0039 -40.9766 -41.0039c-22.7031 0 -41.0156 18.3672 -41.0156 41.0039c0 22.6289 18.3125 40.9961 41.0156 40.9961c22.6172 0 40.9766 -18.3672 40.9766 -40.9961zM422 149.336v-124.336h-69
v110.344c0 26.1172 -1.16406 59.7227 -37.0938 59.7227c-36.4258 0 -43.9062 -28.4688 -43.9062 -57.8555v-112.211h-68v226h68v-30.7422h0.0664062c9.33203 17.7109 32.1914 34.7422 66.2461 34.7422c70.8711 0 83.6875 -44.9961 83.6875 -105.664zM512 -4
c0 -33.0859 -26.9141 -60 -60 -60h-392c-33.0859 0 -60 26.9141 -60 60v392c0 33.0859 26.9141 60 60 60h392c33.0859 0 60 -26.9141 60 -60v-392zM452 408h-392c-11.0273 0 -20 -8.97266 -20 -20v-392c0 -11.0273 8.97266 -20 20 -20h392c11.0273 0 20 8.97266 20 20v392
c0 11.0273 -8.97266 20 -20 20zM452 408z" />
    <glyph glyph-name="001-web-programming" unicode="&#xf100;" 
d="M202.01 119.387c-1.93457 0 -3.88281 0.665039 -5.47168 2.01855l-54.6982 46.5762c-1.88672 1.6084 -2.97168 3.95703 -2.97168 6.43848c0 2.47656 1.08984 4.8252 2.97168 6.43359l54.6982 46.5762c3.55176 3.02832 8.88672 2.59863 11.915 -0.953125
c3.02344 -3.55664 2.59863 -8.8916 -0.958008 -11.915l-47.1367 -40.1416l47.1367 -40.1416c3.55664 -3.02832 3.98145 -8.36328 0.958008 -11.915c-1.6748 -1.9668 -4.05176 -2.97656 -6.44336 -2.97656zM202.01 119.387zM309.99 119.387
c-2.3916 0 -4.76855 1.00977 -6.43848 2.97656c-3.02832 3.55176 -2.59863 8.88672 0.953125 11.915l47.1367 40.1416l-47.1367 40.1416c-3.55176 3.02344 -3.98145 8.3584 -0.953125 11.915c3.02344 3.55176 8.36328 3.98145 11.9102 0.953125l54.6982 -46.5762
c1.88672 -1.6084 2.97168 -3.95703 2.97168 -6.43359c0 -2.48145 -1.08496 -4.83008 -2.97168 -6.43848l-54.6982 -46.5762c-1.58887 -1.35352 -3.53711 -2.01855 -5.47168 -2.01855zM309.99 119.387zM236.637 84.4531c-0.580078 0 -1.16504 0.0605469 -1.75488 0.183594
c-4.56543 0.961914 -7.49023 5.44824 -6.52832 10.0146l34.0898 161.854c0.961914 4.56543 5.44336 7.49023 10.0146 6.52832c4.56543 -0.962891 7.49023 -5.44336 6.52832 -10.0146l-34.0898 -161.854c-0.839844 -3.98145 -4.34961 -6.71191 -8.25977 -6.71191z
M236.637 84.4531zM455.245 -3.72656h-398.49c-31.293 0 -56.7549 25.458 -56.7549 56.7549v338.217c0 31.293 25.4619 56.7549 56.7549 56.7549h398.49c31.293 0 56.7549 -25.4619 56.7549 -56.7549v-338.217c0 -31.2969 -25.4619 -56.7549 -56.7549 -56.7549z
M56.7549 431.095c-21.9717 0 -39.8496 -17.8779 -39.8496 -39.8496v-338.217c0 -21.9717 17.8779 -39.8486 39.8496 -39.8486h398.49c21.9717 0 39.8496 17.877 39.8496 39.8486v338.217c0 21.9717 -17.8779 39.8496 -39.8496 39.8496h-398.49zM56.7549 431.095z
M503.547 312.646h-495.094c-4.66992 0 -8.45312 3.7832 -8.45312 8.45215c0 4.66504 3.7832 8.45312 8.45312 8.45312h495.094c4.66992 0 8.45312 -3.78809 8.45312 -8.45312c0 -4.66895 -3.7832 -8.45215 -8.45312 -8.45215zM503.547 312.646zM144.425 353.095
c-14.7451 0 -26.75 12.0039 -26.75 26.75c0 14.75 12.0049 26.75 26.75 26.75c14.75 0 26.75 -12 26.75 -26.75c0 -14.7461 -12 -26.75 -26.75 -26.75zM144.425 389.688c-5.4248 0 -9.84473 -4.41504 -9.84473 -9.84375c0 -5.42969 4.41992 -9.84473 9.84473 -9.84473
c5.42871 0 9.84375 4.41504 9.84375 9.84473c0 5.42871 -4.41504 9.84375 -9.84375 9.84375zM144.425 389.688zM62.2363 353.354c-14.75 0 -26.75 12 -26.75 26.75s12 26.75 26.75 26.75s26.75 -12 26.75 -26.75s-12 -26.75 -26.75 -26.75zM62.2363 389.948
c-5.4248 0 -9.84473 -4.41992 -9.84473 -9.84473c0 -5.42871 4.41992 -9.84375 9.84473 -9.84375c5.42871 0 9.84375 4.41504 9.84375 9.84375c0 5.4248 -4.41504 9.84473 -9.84375 9.84473zM62.2363 389.948zM226.613 352.84c-14.7451 0 -26.7451 12 -26.7451 26.75
c0 14.7451 12 26.7451 26.7451 26.7451c14.75 0 26.75 -12 26.75 -26.7451c0 -14.75 -12 -26.75 -26.75 -26.75zM226.613 389.434c-5.4248 0 -9.83984 -4.41504 -9.83984 -9.84375c0 -5.42969 4.41504 -9.84473 9.83984 -9.84473c5.42871 0 9.84473 4.41504 9.84473 9.84473
c0 5.42871 -4.41602 9.84375 -9.84473 9.84375zM226.613 389.434z" />
    <glyph glyph-name="010-team" unicode="&#xf109;" 
d="M512 233.29v-120.718l-148.771 -74.3789c0.0849609 -0.826172 0.125 -1.64453 0.125 -2.47559c0 -13.8027 -11.0801 -25.0166 -24.8057 -25.3389c-0.157227 -13.6006 -11.1738 -24.625 -24.7744 -24.7979c-0.173828 -13.5928 -11.1816 -24.6016 -24.7744 -24.7744
c-0.173828 -13.6982 -11.3545 -24.8066 -25.0967 -24.8066h-1.52832c-6.12891 0 -12.0322 2.23828 -16.6172 6.27441l-7.31445 6.45898c-4.25391 -2.86621 -9.31445 -4.47559 -14.4756 -4.47559c-13.8994 0 -25.1895 11.0811 -25.6816 24.8672
c-13.4717 0.475586 -24.2979 11.3027 -24.7744 24.7744c-13.4717 0.475586 -24.2979 11.3018 -24.7734 24.7744c-13.5283 0.475586 -24.3877 11.3701 -24.7949 24.9111l-24.9033 14.9473l-1.97559 -6.91895h-15.8223l-81.2422 27.0762v171.117h27.0117l41.1338 -23.9883
l22.6934 5.67383v3.96387c-15.3916 10.7412 -24.7744 28.4795 -24.7744 47.3828v16.5156c0 15.7744 6.23438 30.5039 17.5645 41.4805c11.3145 10.9834 26.21 16.7539 42.0244 16.2939c0.338867 -0.0078125 0.661133 -0.0683594 1 -0.0849609l-8.86719 21.1338
l43.6934 43.6934l25.7783 -16.7783c9.78613 5.51562 20.1533 9.81055 30.9111 12.8223l6.36719 30.085h62.9355l6.36719 -30.0762c10.7578 -3.0127 21.1172 -7.30664 30.9111 -12.8232l25.7783 16.7783l43.7295 -43.7178l-9.01953 -21.1172
c1.55176 0.0771484 3.09668 0.133789 4.66504 0.0927734c30.8955 -0.935547 56.0322 -27.7822 56.0322 -59.8623v-14.4355c0 -18.9033 -9.3916 -36.6494 -24.7822 -47.3916v-3.95508l34.79 -8.70605c3.49219 -0.875 6.73047 -2.33008 9.84277 -4.04785l27.6572 14.5518
h18.5566zM429.419 297.274c0 23.2373 -17.9512 42.6855 -40.0117 43.3467c-11.2139 0.435547 -21.9395 -3.79004 -30.0244 -11.6289c-8.09277 -7.84277 -12.5439 -18.375 -12.5439 -29.6377v-16.5156c0 -14.6572 7.91113 -28.3506 20.6533 -35.7178l4.12109 -2.38281
v-26.1533l-28.3428 -7.08105c7.34277 -7.51172 11.8262 -17.6777 11.8262 -28.7783v-22.2461l90.8145 47.7988l-41.2578 10.3066l-0.0322266 26.1328l4.12891 2.38672c12.75 7.38379 20.6689 21.0771 20.6689 35.7344v14.4355zM268.451 166.972
c4.1377 -0.157227 8.25879 -0.621094 12.2588 -1.75391l50.7695 -14.5078h5.06055l2.04102 1.07227v30.9434c0 11.3877 -7.72266 21.2744 -18.7627 24.041l-47.2939 11.8184l-0.0322266 26.1328l4.12891 2.38672c12.75 7.38379 20.6689 21.0771 20.6689 35.7344v14.4355
c0 23.2373 -17.9512 42.6855 -40.0117 43.3467c-11.1455 0.435547 -21.9395 -3.79004 -30.0244 -11.6289c-8.09277 -7.84277 -12.5439 -18.375 -12.5439 -29.6377v-16.5156c0 -14.6572 7.91113 -28.3506 20.6533 -35.7178l4.12012 -2.38281v-26.1533l-47.3018 -11.8184
c-11.04 -2.7666 -18.7627 -12.6533 -18.7627 -24.041v-2.44336l4.73438 1.04883c17.4395 3.8623 35.8789 3.04785 52.915 -2.41211zM175.271 324.403c4.06836 -8.18555 6.40723 -17.4111 6.40723 -27.1289v-14.4355c0 -18.9033 -9.3916 -36.6494 -24.7822 -47.3916v-3.95508
l33.04 -8.27051l33.0322 8.27051v3.96387c-15.3916 10.7412 -24.7744 28.4795 -24.7744 47.3828v16.5156c0 15.7744 6.23438 30.5039 17.5566 41.4883c11.3145 10.9834 26.2178 16.7578 42.0244 16.2939c30.8945 -0.935547 56.0322 -27.7822 56.0322 -59.8623v-14.4355
c0 -18.9033 -9.3916 -36.6494 -24.7822 -47.3916v-3.95508l33.04 -8.27051l33.0322 8.27051v3.96387c-15.3906 10.7412 -24.7744 28.4795 -24.7744 47.3828v16.5156c0 9.10156 2.1377 17.8311 6.06934 25.7139c-15.625 29.6416 -46.7061 48.6094 -80.3916 48.6094
c-34.0078 0 -65.2217 -19.2266 -80.7295 -49.2744zM137.29 374.347l9.2666 -22.0928c6.84668 -3.07617 13.0244 -7.47949 18.2178 -12.915c19.4072 31.2422 53.8994 50.8545 91.2256 50.8545c37.0605 0 71.4561 -19.4316 90.9111 -50.3584
c0.331055 0.338867 0.621094 0.693359 0.959961 1.02344c5.14551 4.98828 11.0566 8.84766 17.4316 11.5889l9.36621 21.9316l-26.3506 26.3594l-23.2217 -15.1133l-4.44336 2.72559c-11.1328 6.82324 -23.165 11.8184 -35.7578 14.835l-5.08105 1.21387l-5.72949 27.084
h-36.1611l-5.74609 -27.0918l-5.08105 -1.21777c-12.5928 -3.0127 -24.625 -8.00879 -35.7578 -14.8311l-4.44336 -2.72559l-23.2217 15.1123zM107.354 218.585l-18.7783 -4.69336l43.5527 -25.4082l-0.314453 -15.2617l-0.668945 -2.33887l25.7578 5.72559v6.11719
c0 11.1006 4.4834 21.2666 11.8262 28.7783l-28.334 7.08105l-0.0322266 26.1328l4.12891 2.38672c12.75 7.38379 20.6689 21.0771 20.6689 35.7344v14.4355c0 23.2373 -17.9512 42.6855 -40.0117 43.3467c-11.1895 0.435547 -21.9395 -3.79004 -30.0244 -11.6289
c-8.09277 -7.84277 -12.5439 -18.375 -12.5439 -29.6377v-16.5156c0 -14.6572 7.91113 -28.3506 20.6523 -35.7178l4.12109 -2.38281v-26.1533zM16.5166 233.29v-142.689l35.4434 -11.8184l29.9678 119.867l-59.3916 34.6406h-6.01953zM83.9189 68.1289h0.694336l31 108.513
v2.3584l-18.835 10.9834l-29.1133 -116.439zM140.387 44.3545c0 -5.10449 4.15332 -9.25781 9.25879 -9.25781c2.43555 0 4.82227 0.984375 6.54785 2.70996l14.5166 14.5156c1.72559 1.72656 2.70898 4.11328 2.70898 6.54883c0 5.10449 -4.15234 9.25781 -9.25781 9.25781
c-2.43555 0 -4.82227 -0.983398 -6.54785 -2.70996l-14.5166 -14.5156c-1.72559 -1.72559 -2.70996 -4.11328 -2.70996 -6.54883zM165.161 19.5811c0 -5.10547 4.15332 -9.25879 9.25781 -9.25879c2.43555 0 4.82324 0.984375 6.54883 2.70996l14.5156 14.5166
c1.72656 1.72559 2.70996 4.1123 2.70996 6.54785c0 5.10449 -4.15332 9.25781 -9.25781 9.25781c-2.43555 0 -4.82227 -0.983398 -6.54883 -2.70898l-14.5156 -14.5166c-1.72559 -1.72559 -2.70996 -4.1123 -2.70996 -6.54785zM189.936 -5.19336
c0 -5.10547 4.15332 -9.25781 9.25781 -9.25781c2.43555 0 4.82324 0.983398 6.54883 2.70898l14.5156 14.5166c1.72559 1.72559 2.70996 4.1123 2.70996 6.54785c0 5.10547 -4.15332 9.25879 -9.25781 9.25879c-2.43555 0 -4.82324 -0.984375 -6.54883 -2.70996
l-14.5156 -14.5166c-1.72656 -1.72559 -2.70996 -4.1123 -2.70996 -6.54785zM223.968 -39.2256c2.43555 0 4.82227 0.983398 6.54883 2.70898l14.5156 14.5166c1.72559 1.72559 2.70996 4.11328 2.70996 6.54883c0 5.10449 -4.15332 9.25781 -9.25879 9.25781
c-2.43457 0 -4.82227 -0.984375 -6.54785 -2.70996l-14.5166 -14.5156c-1.72559 -1.72656 -2.70898 -4.11328 -2.70898 -6.54883c0 -5.10449 4.15332 -9.25781 9.25781 -9.25781zM263.903 -47.4834c4.75 0 8.61328 3.8623 8.61328 8.6123
c0 2.56836 -1.13379 4.97949 -3.09766 6.61719l-7.50781 6.25c-1.26953 -2.82715 -2.9873 -5.45996 -5.20117 -7.67383l-6.20215 -6.20117l6.17773 -5.44727c1.56836 -1.3916 3.58496 -2.15723 5.68945 -2.15723h1.52832zM337.96 26.8389
c4.89844 0 8.87891 3.97949 8.87891 8.87891c0 2.51562 -1.07227 4.91895 -2.93945 6.61328l-69.7744 62.7939c-5.33496 4.79883 -13.625 5.6084 -19.8027 1.90723l-30.75 -18.4395c-4.28613 -2.58496 -9.21777 -3.94727 -14.2295 -3.94727
c-15.2539 0 -27.665 12.4111 -27.665 27.665v1.63281c0 10.54 5.85449 20.0205 15.2783 24.7422l41.2412 20.6211l-12.165 3.89062c-14.2617 4.56445 -29.6816 5.27441 -44.3066 2.00391l-55.75 -12.3945l-22.2373 -77.8311l25.3662 -15.2217
c0.730469 0.975586 1.44824 1.95996 2.31445 2.82715l14.5166 14.5156c4.79785 4.79883 11.4395 7.54883 18.2256 7.54883c13.8994 0 25.1895 -11.0811 25.6738 -24.8672c13.4717 -0.475586 24.2979 -11.3027 24.7734 -24.7744
c13.4727 -0.475586 24.2988 -11.3027 24.7744 -24.7744c9.77051 -0.34668 18.1133 -6.13281 22.1738 -14.4307l18.4316 -15.3633c2.43066 -2.02051 5.51953 -3.14551 8.68945 -3.14551c4.75 0 8.6123 3.86328 8.6123 8.61328c0 2.56836 -1.13281 4.97949 -3.09668 6.60449
l-43.4873 36.2383l10.5801 12.6934l44.8555 -37.375c1.54395 -1.29004 3.50391 -2 5.50781 -2h1.80176c4.75 0 8.61328 3.86328 8.61328 8.61328c0 2.56836 -1.13281 4.97949 -3.08887 6.61621l-43.4873 36.2344l10.5801 12.6934l44.7822 -37.3184
c1.58496 -1.33105 3.60938 -2.06445 5.68164 -2.06445h1.42773zM495.483 122.782v92.9189l-154.862 -81.5078l-12.5684 0.314453l-51.8955 14.8232c-8.49609 2.44336 -17.8545 1.56055 -25.7383 -2.3877l-46.0645 -23.0322
c-3.79785 -1.89941 -6.16113 -5.71387 -6.16113 -9.96777v-1.63281c0 -6.15332 4.99609 -11.1494 11.1494 -11.1494c2.01562 0 3.98828 0.544922 5.71387 1.58496l30.7617 18.4473c5.17773 3.10547 11.0889 4.74219 17.1094 4.74219
c8.2334 0 16.1367 -3.03223 22.25 -8.54883l69.7617 -62.7939c0.496094 -0.443359 0.967773 -0.899414 1.41895 -1.37891zM495.483 122.782z" />
    <glyph glyph-name="007-email" unicode="&#xf106;" 
d="M467 387c24.8721 0 45 -20.2803 45 -45v-300c0 -24.8721 -20.2803 -45 -45 -45h-422c-24.8721 0 -45 20.2803 -45 45v300c0 24.8037 20.2178 45 45 45h422zM460.786 357h-409.427l205.595 -203.833zM30 48.2119l144.479 144.479l-144.479 143.239v-287.719zM51.2129 27
h409.574l-143.787 143.787l-49.3926 -49.3936c-5.84082 -5.84082 -15.3037 -5.85938 -21.167 -0.0458984l-50.6572 50.2227zM482 48.2129v287.575l-143.787 -143.788z" />
    <glyph glyph-name="003-image" unicode="&#xf102;" 
d="M336 99c5.51953 0 10 -4.48047 10 -10s-4.48047 -10 -10 -10s-10 4.48047 -10 10s4.48047 10 10 10zM50 448c5.52246 0 10 -4.47656 10 -10v-40c0 -5.52344 -4.47754 -10 -10 -10h-40c-5.52246 0 -10 4.47656 -10 10v40c0 5.52344 4.47754 10 10 10h40zM40 408v20h-20
v-20h20zM50 -4c5.52246 0 10 -4.47656 10 -10v-40c0 -5.52344 -4.47754 -10 -10 -10h-40c-5.52246 0 -10 4.47656 -10 10v40c0 5.52344 4.47754 10 10 10h40zM40 -44v20h-20v-20h20zM502 448c5.52246 0 10 -4.47656 10 -10v-40c0 -5.52344 -4.47754 -10 -10 -10h-40
c-5.52246 0 -10 4.47656 -10 10v40c0 5.52344 4.47754 10 10 10h40zM492 408v20h-20v-20h20zM502 -4c5.52246 0 10 -4.47656 10 -10v-40c0 -5.52344 -4.47754 -10 -10 -10h-40c-5.52246 0 -10 4.47656 -10 10v40c0 5.52344 4.47754 10 10 10h40zM492 -44v20h-20v-20h20z
M30 365c5.52246 0 10 -4.47656 10 -10v-20c0 -5.52344 -4.47754 -10 -10 -10s-10 4.47656 -10 10v20c0 5.52344 4.47754 10 10 10zM30 302c5.52246 0 10 -4.47656 10 -10v-20c0 -5.52344 -4.47754 -10 -10 -10s-10 4.47656 -10 10v20c0 5.52344 4.47754 10 10 10zM30 242
c5.52246 0 10 -4.47656 10 -10v-20c0 -5.52344 -4.47754 -10 -10 -10s-10 4.47656 -10 10v20c0 5.52344 4.47754 10 10 10zM30 182c5.52246 0 10 -4.47656 10 -10v-20c0 -5.52344 -4.47754 -10 -10 -10s-10 4.47656 -10 10v20c0 5.52344 4.47754 10 10 10zM30 119
c5.52246 0 10 -4.47656 10 -10v-20c0 -5.52344 -4.47754 -10 -10 -10s-10 4.47656 -10 10v20c0 5.52344 4.47754 10 10 10zM30 56c5.52246 0 10 -4.47656 10 -10v-20c0 -5.52344 -4.47754 -10 -10 -10s-10 4.47656 -10 10v20c0 5.52344 4.47754 10 10 10zM482 365
c5.52246 0 10 -4.47656 10 -10v-20c0 -5.52344 -4.47754 -10 -10 -10s-10 4.47656 -10 10v20c0 5.52344 4.47754 10 10 10zM482 302c5.52246 0 10 -4.47656 10 -10v-20c0 -5.52344 -4.47754 -10 -10 -10s-10 4.47656 -10 10v20c0 5.52344 4.47754 10 10 10zM482 242
c5.52246 0 10 -4.47656 10 -10v-20c0 -5.52344 -4.47754 -10 -10 -10s-10 4.47656 -10 10v20c0 5.52344 4.47754 10 10 10zM482 182c5.52246 0 10 -4.47656 10 -10v-20c0 -5.52344 -4.47754 -10 -10 -10s-10 4.47656 -10 10v20c0 5.52344 4.47754 10 10 10zM482 119
c5.52246 0 10 -4.47656 10 -10v-20c0 -5.52344 -4.47754 -10 -10 -10s-10 4.47656 -10 10v20c0 5.52344 4.47754 10 10 10zM482 56c5.52246 0 10 -4.47656 10 -10v-20c0 -5.52344 -4.47754 -10 -10 -10s-10 4.47656 -10 10v20c0 5.52344 4.47754 10 10 10zM113 -24
c5.52246 0 10 -4.47656 10 -10s-4.47754 -10 -10 -10h-20c-5.52246 0 -10 4.47656 -10 10s4.47754 10 10 10h20zM176 -24c5.52246 0 10 -4.47656 10 -10s-4.47754 -10 -10 -10h-20c-5.52246 0 -10 4.47656 -10 10s4.47754 10 10 10h20zM236 -24
c5.52246 0 10 -4.47656 10 -10s-4.47754 -10 -10 -10h-20c-5.52246 0 -10 4.47656 -10 10s4.47754 10 10 10h20zM296 -24c5.52246 0 10 -4.47656 10 -10s-4.47754 -10 -10 -10h-20c-5.52246 0 -10 4.47656 -10 10s4.47754 10 10 10h20zM356 -24
c5.52246 0 10 -4.47656 10 -10s-4.47754 -10 -10 -10h-20c-5.52246 0 -10 4.47656 -10 10s4.47754 10 10 10h20zM419 -24c5.52246 0 10 -4.47656 10 -10s-4.47754 -10 -10 -10h-20c-5.52246 0 -10 4.47656 -10 10s4.47754 10 10 10h20zM113 428
c5.52246 0 10 -4.47656 10 -10s-4.47754 -10 -10 -10h-20c-5.52246 0 -10 4.47656 -10 10s4.47754 10 10 10h20zM176 428c5.52246 0 10 -4.47656 10 -10s-4.47754 -10 -10 -10h-20c-5.52246 0 -10 4.47656 -10 10s4.47754 10 10 10h20zM236 428
c5.52246 0 10 -4.47656 10 -10s-4.47754 -10 -10 -10h-20c-5.52246 0 -10 4.47656 -10 10s4.47754 10 10 10h20zM296 428c5.52246 0 10 -4.47656 10 -10s-4.47754 -10 -10 -10h-20c-5.52246 0 -10 4.47656 -10 10s4.47754 10 10 10h20zM356 428
c5.52246 0 10 -4.47656 10 -10s-4.47754 -10 -10 -10h-20c-5.52246 0 -10 4.47656 -10 10s4.47754 10 10 10h20zM419 428c5.52246 0 10 -4.47656 10 -10s-4.47754 -10 -10 -10h-20c-5.52246 0 -10 4.47656 -10 10s4.47754 10 10 10h20zM419 365
c5.52246 0 10 -4.47656 10 -10v-225.995v-0.00976562v-102.995c0 -5.52344 -4.47754 -10 -10 -10h-326c-5.52246 0 -10 4.47656 -10 10v329c0 5.52344 4.47754 10 10 10h326zM409 99v25.8584l-83 83l-46.3359 -46.3359l35.334 -37.3838
c3.79395 -4.01367 3.61621 -10.3428 -0.398438 -14.1367c-1.93164 -1.82617 -4.40137 -2.73242 -6.86621 -2.73242c-2.65527 0 -5.30371 1.05078 -7.27051 3.13184l-51.6289 54.623l-62.9492 62.9482l-82.8848 -80.2109v-48.7617h173c5.52246 0 10 -4.47656 10 -10
s-4.47754 -10 -10 -10h-173v-43h306v43h-33c-5.52246 0 -10 4.47656 -10 10s4.47754 10 10 10h33zM409 153.143v191.857h-306v-169.407l76.0459 73.5928c3.9209 3.7959 10.1631 3.74609 14.0254 -0.114258l72.9287 -72.9297l52.9277 52.9307
c3.90723 3.9043 10.2373 3.9043 14.1436 0zM276 302c16.542 0 30 -13.458 30 -30s-13.458 -30 -30 -30s-30 13.458 -30 30s13.458 30 30 30zM276 262c5.51367 0 10 4.48633 10 10s-4.48633 10 -10 10s-10 -4.48633 -10 -10s4.48633 -10 10 -10z" />
    <glyph glyph-name="002-microphone" unicode="&#xf101;" 
d="M245.444 202.651c5.85645 5.85547 15.3525 5.85547 21.209 0c5.85645 -5.85742 5.85645 -15.3535 0 -21.209l-39.9932 -39.9932c-5.85645 -5.85645 -15.3516 -5.85742 -21.208 0c-5.85742 5.85742 -5.85742 15.3535 0 21.209zM473.909 230.339
c-26.209 -26.9697 -66.5615 -41.7012 -107.518 -36.0068l-256.462 -241.989c-23.7939 -22.293 -60.4414 -21.7012 -83.4629 1.32324l-8.79883 8.79883c-23.0205 23.0205 -23.6191 59.665 -1.35938 83.4238l242.025 256.501
c-5.29199 38.0537 6.54004 77.8555 35.9004 107.422c50.3242 50.6865 128.428 51.1426 179.575 -0.00390625c50.8584 -50.8584 50.9492 -128.517 0.0996094 -179.469zM452.602 388.599c-35.4512 35.4502 -87.2725 38.7773 -125.804 9.85938l135.663 -135.663
c28.8975 38.5029 25.6113 90.3311 -9.85938 125.804zM89.3848 -25.8057l243.39 229.656c-28.9541 12.7334 -52.2119 36.0215 -64.9229 64.9238l-229.691 -243.43c-11.0938 -11.8408 -10.7939 -30.1611 0.71582 -41.6709l8.79883 -8.79883
c11.5107 -11.5088 29.8311 -11.8076 41.71 -0.680664zM315.447 251.445c34.208 -34.2061 87.8174 -37.4629 125.727 -9.78125l-135.508 135.508c-27.6816 -37.9092 -24.4238 -91.5195 9.78125 -125.727z" />
    <glyph glyph-name="009-mortarboard" unicode="&#xf108;" 
d="M502.024 291.367l-26.0508 -9.26074v-146.25c17.5293 -6.19824 30.125 -22.9287 30.125 -42.5527c0 -19.625 -12.5957 -36.3535 -30.125 -42.5518v-57.2852c0 -8.28418 -6.71582 -15 -15 -15c-8.2832 0 -15 6.71582 -15 15v57.2852
c-17.5283 6.19824 -30.125 22.9277 -30.125 42.5518c0 19.625 12.5967 36.3545 30.125 42.5527v135.584l-39.417 -14.0137v-97.8467c0 -16.1504 -16.8467 -29.8057 -50.0723 -40.5898c-28.9619 -9.40039 -64.6475 -14.5771 -100.483 -14.5771
s-71.5225 5.17676 -100.483 14.5771c-33.2256 10.7842 -50.0723 24.4404 -50.0723 40.5898v97.8467l-95.4697 33.9404c-5.98633 2.12793 -9.9834 7.79688 -9.97559 14.1504c0.0078125 6.35449 4.01758 12.0146 10.0098 14.127l241 85.0312
c3.22949 1.14062 6.75195 1.14062 9.98145 0l241 -85.0312c5.99121 -2.11328 10.001 -7.77246 10.0088 -14.127c0.00683594 -6.35352 -3.98926 -12.0225 -9.97559 -14.1504zM460.973 78.1797c8.34082 0 15.125 6.78516 15.125 15.125s-6.78418 15.125 -15.125 15.125
c-8.33984 0 -15.125 -6.78516 -15.125 -15.125s6.78516 -15.125 15.125 -15.125zM256 374.625l-196.069 -69.1777l196.069 -69.7041l196.069 69.7031zM376.556 161.841h-0.00195312v84.9209l-115.53 -41.0713c-1.625 -0.578125 -3.32422 -0.867188 -5.02441 -0.867188
c-1.69922 0 -3.39941 0.289062 -5.02441 0.867188l-115.53 41.0713v-84.9209c2.875 -2.89844 13.167 -9.83887 36.3955 -16.4658c24.7822 -7.06934 54.6699 -10.9619 84.1602 -10.9619s59.3789 3.89258 84.1602 10.9619c23.2285 6.62695 33.5205 13.5684 36.3955 16.4658z
" />
    <glyph glyph-name="008-instagram" unicode="&#xf107;" 
d="M511.049 297.471c1.19922 -27.3066 1.30078 -36.0068 1.30078 -105.521s-0.300781 -78.2148 -1.5 -105.521c-1.19922 -27.2051 -5.60254 -45.8096 -11.9004 -62.1143c-13.3037 -34.4053 -40.5078 -61.6094 -74.917 -74.9131
c-16.2021 -6.30176 -34.9053 -10.7012 -62.1104 -11.9004c-27.3057 -1.20312 -36.0068 -1.5 -105.521 -1.5s-78.2178 0.296875 -105.521 1.5c-27.208 1.19922 -45.8096 5.59863 -62.1133 11.9004c-17.0039 6.40039 -32.5068 16.5039 -45.3096 29.5059
c-13.0029 12.8037 -23.1025 28.2051 -29.6035 45.4072c-6.30176 16.207 -10.7051 34.9092 -11.9053 62.1143c-1.19922 27.3057 -1.5 36.0068 -1.5 105.521s0.300781 78.2139 1.60156 105.622c1.2002 27.2041 5.59961 45.8057 11.9014 62.1094
c6.40332 17.0039 16.5029 32.5068 29.5059 45.3096c12.8027 13.1045 28.2041 23.1064 45.4111 29.6074c16.2021 6.29883 34.9053 10.7012 62.1094 11.9014c27.3066 1.19922 36.0068 1.5 105.521 1.5s78.2148 -0.300781 105.622 -1.60156
c27.2051 -1.2002 45.8105 -5.59863 62.1104 -11.9014c17.0029 -6.39941 32.5059 -16.5029 45.3096 -29.5059c13.1045 -12.8027 23.1064 -28.2041 29.6074 -45.4072c6.30176 -16.2061 10.7012 -34.9092 11.9004 -62.1133zM464.942 88.4297
c1.19922 27.0049 1.5 35.0068 1.5 103.321c0 68.3135 -0.300781 76.4131 -1.5 103.418c-1.10156 24.9072 -5.30176 38.5078 -8.80273 47.5098c-4.10254 11.1035 -10.6035 21.1055 -19.1055 29.4082c-8.2002 8.50195 -18.3037 15.0029 -29.4033 19.1016
c-9.00195 3.5 -22.5049 7.7002 -47.5098 8.80176c-26.9072 1.2002 -35.0068 1.50098 -103.423 1.50098c-68.3096 0 -76.4131 -0.300781 -103.418 -1.50098c-24.9033 -1.10156 -38.5078 -5.30176 -47.5098 -8.80176c-11.1035 -4.09863 -21.1055 -10.5996 -29.4043 -19.1016
c-8.60254 -8.20508 -15.1045 -18.3047 -19.207 -29.4082c-3.5 -9.00195 -7.7002 -22.5049 -8.79785 -47.5098c-1.2041 -26.9033 -1.50098 -35.1045 -1.50098 -103.418c0 -68.3145 0.296875 -76.418 1.50098 -103.423c1.09766 -24.9033 5.29785 -38.5078 8.79785 -47.5088
c4.10254 -11.1006 10.6045 -21.1025 19.1055 -29.4043c8.20117 -8.50195 18.3047 -15.0029 29.4043 -19.1055c9.00195 -3.50098 22.5049 -7.70117 47.5098 -8.79883c26.9072 -1.20312 35.1084 -1.5 103.422 -1.5c68.3145 0 76.4141 0.296875 103.419 1.5
c24.9072 1.09766 38.5078 5.29785 47.5098 8.79883c22.3047 8.60352 40.0078 26.3057 48.6104 48.6113c3.50098 9.00098 7.70117 22.5039 8.80273 47.5088zM464.942 88.4297zM256.499 323.476c72.6162 0 131.526 -58.9102 131.526 -131.525
c0 -72.6162 -58.9102 -131.526 -131.526 -131.526c-72.6113 0 -131.525 58.9102 -131.525 131.526c0 72.6152 58.9141 131.525 131.525 131.525zM256.499 106.633c47.1113 0 85.3174 38.2061 85.3174 85.3174c0 47.1104 -38.2061 85.3174 -85.3174 85.3174
c-47.1064 0 -85.3174 -38.207 -85.3174 -85.3174c0 -47.1113 38.2109 -85.3174 85.3174 -85.3174zM256.499 106.633zM423.935 328.676c0 -16.9561 -13.749 -30.7051 -30.709 -30.7051c-16.957 0 -30.7051 13.749 -30.7051 30.7051c0 16.9609 13.748 30.7051 30.7051 30.7051
c16.96 0 30.709 -13.7441 30.709 -30.7051zM423.935 328.676z" />
    <glyph glyph-name="005-twitter" unicode="&#xf104;" 
d="M512 392.035c-0.078125 -0.113281 -36.1367 -49.5547 -48.8438 -66.5195c-6.34375 -8.47266 -9.51172 -19.5117 -8.92188 -31.0781c3.90625 -76.4023 -14.8984 -149.82 -72.207 -201.434c-68.0391 -61.2773 -169.105 -72.7422 -258.871 -58.6641
c-40.3828 6.33594 -81.2539 27.457 -92.8203 33.7812l-30.3359 16.5859l32.8438 10.7969c35.8984 11.8086 57.7383 19.1289 84.7734 30.6016c-27.0703 13.1094 -47.9297 36.6914 -57.9727 67.1719l-7.64062 23.1992l6.26172 -0.960938
c-5.94141 5.99219 -10.6289 12.0664 -14.2695 17.5977c-12.9297 19.6406 -19.7773 43.6484 -18.3203 64.2148l1.4375 20.2461l12.1172 -4.69531c-5.11328 9.65625 -8.80469 19.9688 -10.9766 30.7812c-5.29297 26.3555 -0.863281 54.3594 12.4766 78.8516l10.5547 19.3828
l14.125 -16.9648c44.6602 -53.6484 101.227 -85.4727 168.363 -94.7891c-6.17578 42.5664 12.3398 78.9844 46.8359 100.191c42.125 25.8906 101.047 24.3164 140.688 -11.3125c15.0938 3.91797 74.6328 25.8203 74.6328 25.8203l-19.0742 -54.4727
c3.64062 0.304688 2.9375 0.183594 35.1445 1.66797zM439.168 343.484c4.49609 6 8.23438 11.0039 11.3516 15.1836l-16.5156 0.0117188l12.9375 36.9453c-6.21484 -2.21484 -12.5625 -4.25 -20.2969 -6.17188c-8.61719 -2.14062 -17.8242 0.324219 -24.6328 6.58984
c-31.5234 29.0312 -77.0352 26.375 -105.707 8.75391c-13.7266 -8.4375 -44.1602 -33.3633 -30.2734 -82.4531c0.625 -2.20703 0.6875 -2.26172 3.07422 -25.4453c-10.8438 2.51562 -118.57 -4.63672 -210.32 90.5273c-8.63672 -33.1172 3.14453 -67.5664 32.543 -90.4961
l40.8008 -31.8281l-51.4961 5.09375c-10.4883 1.03906 -16.9922 2.10547 -22.5703 3.60156c2.10156 -7.69922 5.60547 -16.0508 10.9688 -24.2031c8.16797 -12.4062 23.5781 -28.582 50.6133 -35.2031l55.6367 -13.625l-55.1758 -15.3672
c-7.23047 -2.01562 -14.4922 -3.23438 -22.0234 -3.67188c14.1836 -21.8047 37.2578 -35.2344 64.9688 -37.0078l57.8516 -3.70312l-52.3984 -24.8008c-37.5352 -17.7656 -60.7773 -26.9961 -90.875 -37.3516c14.8555 -6.08984 32.8047 -12.1875 50.1719 -14.9102
c95.8984 -15.043 181.254 3.66406 234.172 51.3242c45.3008 40.7969 66.2695 100.562 62.3281 177.629c-0.945312 18.5469 4.33203 36.5117 14.8672 50.5781zM439.168 343.484z" />
    <glyph glyph-name="004-art" unicode="&#xf103;" 
d="M256 336c17.6641 0 32 -14.3359 32 -32s-14.3359 -32 -32 -32s-32 14.3359 -32 32s14.3359 32 32 32zM256 288c8.83203 0 16 7.16797 16 16s-7.16797 16 -16 16s-16 -7.16797 -16 -16s7.16797 -16 16 -16zM328 296c13.248 0 24 -10.752 24 -24s-10.752 -24 -24 -24
s-24 10.752 -24 24s10.752 24 24 24zM328 264c4.41602 0 8 3.58398 8 8s-3.58398 8 -8 8s-8 -3.58398 -8 -8s3.58398 -8 8 -8zM328 208c0 13.248 10.752 24 24 24s24 -10.752 24 -24s-10.752 -24 -24 -24s-24 10.752 -24 24zM352 216c-4.41602 0 -8 -3.58398 -8 -8
s3.58398 -8 8 -8s8 3.58398 8 8s-3.58398 8 -8 8zM456 432c13.209 -0.0390625 23.9609 -10.791 24 -24v-384c-0.0390625 -13.209 -10.791 -23.9609 -24 -24h-153.04l23.6797 -35.5996c0.761719 -1.0957 1.37988 -3.06641 1.37988 -4.40039
c0 -1.1084 -0.438477 -2.79297 -0.979492 -3.75977c-1.2168 -2.34082 -4.3457 -4.24023 -6.98438 -4.24023h-0.0556641h-160h-0.0556641c-2.63867 0 -5.76758 1.89941 -6.98438 4.24023c-0.541016 0.966797 -0.979492 2.65137 -0.979492 3.75977
c0 1.33398 0.618164 3.30469 1.37988 4.40039l23.6797 35.5996h-153.04c-13.209 0.0390625 -23.9609 10.791 -24 24v384c0.0390625 13.209 10.791 23.9609 24 24h432zM305.04 -32l-21.3604 32h-87.3594l-21.3604 -32h130.08zM464 24v24h-448v-24c0 -4.41602 3.58398 -8 8 -8
h432c4.41602 0 8 3.58398 8 8zM464 64v344c0 4.41602 -3.58398 8 -8 8h-432c-4.41602 0 -8 -3.58398 -8 -8v-344h448zM274.64 148c0.595703 -1.02734 1.07812 -2.82324 1.07812 -4.00977c0 -2.56641 -1.80859 -5.67969 -4.03809 -6.9502l-27.6797 -16
c-1.03418 -0.555664 -2.82617 -1.02148 -4 -1.04004c-0.582031 0.000976562 -1.51367 0.108398 -2.08008 0.240234c-1.75293 0.509766 -3.93945 2.19434 -4.87988 3.75977l-88 152.4c-0.579102 1.02246 -1.04883 2.80566 -1.04883 3.98047
c0 2.56152 1.7959 5.68848 4.00879 6.97949l27.6797 16c1.03125 0.588867 2.83203 1.06641 4.01855 1.06641c0.579102 0 1.50195 -0.119141 2.06152 -0.266602c1.78027 -0.475586 3.96582 -2.16016 4.87988 -3.75977zM242.96 138.96l13.8398 8l-80 138.56l-13.8398 -8z
M169.6 346c1.77637 -3.0752 3.21875 -8.45312 3.21875 -12.0049c0 -7.65625 -5.38477 -16.9727 -12.0186 -20.7949l-13.8398 -8c-3.07227 -1.7666 -8.44336 -3.20117 -11.9873 -3.20117c-7.6543 0 -16.9785 5.37695 -20.8125 12.001l-7.60059 13.1201
c-2.95996 5.15332 -5.36328 14.1602 -5.36328 20.1045c0 0.147461 0.00195312 0.387695 0.00390625 0.535156l0.639648 37.7598c0.0595703 2.49121 1.85156 5.53809 4 6.80078c1.03125 0.600586 2.83691 1.08887 4.03027 1.08887
c1.14551 0 2.88867 -0.452148 3.88965 -1.00879l33.04 -18.3203c5.33301 -2.97266 12.1426 -9.6748 15.2002 -14.96zM156.48 331.92c0.163086 0.573242 0.296875 1.52246 0.296875 2.11816c0 1.17676 -0.492188 2.95215 -1.09766 3.96191l-7.51953 13.1201
c-1.83105 3.1709 -5.91699 7.18457 -9.12012 8.95996l-21.4404 11.8398l-0.399414 -24.4004c-0.00292969 -0.12207 -0.00390625 -0.320312 -0.00390625 -0.442383c0 -3.53711 1.43457 -8.89355 3.2041 -11.957l7.59961 -13.1201
c1.29102 -2.21289 4.41797 -4.00879 6.97949 -4.00879c1.1748 0 2.95801 0.469727 3.98047 1.04883l13.8398 8c1.58984 0.914062 3.23828 3.09961 3.68066 4.87988zM210.664 352.256v0.0244141c-0.713867 -0.251953 -1.90723 -0.457031 -2.66406 -0.457031
c-4.41797 0 -8.00391 3.58594 -8.00391 8.00488c0 3.12598 2.3916 6.50781 5.33984 7.54785c13.5518 4.78223 36.2139 8.66406 50.585 8.66406c83.9043 0 152 -68.0957 152 -152c0 -37.6074 -22.7842 -88.4395 -50.8564 -113.464
c-1.25488 -1.11328 -3.63379 -2.0166 -5.31055 -2.0166c-4.41602 0 -8 3.58398 -8 8c0 0.324219 0.0390625 0.847656 0.0859375 1.16797c0.0888672 0.598633 0.160156 1.5752 0.160156 2.17969v0.0927734c0 17.6641 -14.3359 32 -32 32c-4.41602 0 -8 3.58398 -8 8
s3.58398 8 8 8c19.5957 -0.0253906 40.165 -15.25 45.9121 -33.9844c18.791 21.2871 34.041 61.6084 34.041 90.0029c0 75.0723 -60.9277 136 -136 136c-12.8672 0 -33.1562 -3.47754 -45.2891 -7.7627zM194.072 143.728h-0.0078125
c3.27344 -0.875977 5.93164 -4.33789 5.93164 -7.72754c0 -4.41406 -3.58203 -7.99805 -7.99609 -8c-0.580078 0.0078125 -1.50488 0.140625 -2.06445 0.295898c-45.8096 12.3281 -82.9883 60.8359 -82.9883 108.275c0 8.11426 1.69727 21.0615 3.78906 28.9004
c0.810547 3.3877 4.29688 6.13672 7.7793 6.13672c4.41602 0 8 -3.58398 8 -8c0 -0.642578 -0.148438 -1.66406 -0.332031 -2.28027c-1.80859 -6.74414 -3.27637 -17.8857 -3.27637 -24.8682c0 -40.667 31.8818 -82.2109 71.165 -92.7324z" />
  </font>
</defs></svg>
