{
    "trainers": [
        {
            "id": 1,
            "name": "Melfyn",
            "pokemon": []
        },
        {
            "name": "Mellfyn",
            "pokemon": [],
            "id": 2
        },
        {
            "name": "Melfyn3",
            "pokemon": [],
            "id": 3
        },
        {
            "name": "gh",
            "pokemon": [],
            "id": 4
        },
        {
            "name": "Dr jojo",
            "pokemon": [],
            "id": 5
        },
        {
            "name": "Dr jojo",
            "pokemon": [],
            "id": 6
        },
        {
            "name": "Dr melly",
            "pokemon": [],
            "id": 7
        }
    ]
}