{
  "abi": [
    {
      "anonymous": false,
      "inputs": [
        {
          "indexed": true,
          "internalType": "int256",
          "name": "current",
          "type": "int256"
        },
        {
          "indexed": true,
          "internalType": "uint256",
          "name": "roundId",
          "type": "uint256"
        },
        {
          "indexed": false,
          "internalType": "uint256",
          "name": "updatedAt",
          "type": "uint256"
        }
      ],
      "name": "AnswerUpdated",
      "type": "event"
    },
    {
      "anonymous": false,
      "inputs": [
        {
          "indexed": true,
          "internalType": "uint256",
          "name": "roundId",
          "type": "uint256"
        },
        {
          "indexed": true,
          "internalType": "address",
          "name": "startedBy",
          "type": "address"
        },
        {
          "indexed": false,
          "internalType": "uint256",
          "name": "startedAt",
          "type": "uint256"
        }
      ],
      "name": "NewRound",
      "type": "event"
    },
    {
      "inputs": [],
      "name": "decimals",
      "outputs": [
        {
          "internalType": "uint8",
          "name": "",
          "type": "uint8"
        }
      ],
      "stateMutability": "view",
      "type": "function"
    },
    {
      "inputs": [],
      "name": "description",
      "outputs": [
        {
          "internalType": "string",
          "name": "",
          "type": "string"
        }
      ],
      "stateMutability": "view",
      "type": "function"
    },
    {
      "inputs": [
        {
          "internalType": "uint256",
          "name": "roundId",
          "type": "uint256"
        }
      ],
      "name": "getAnswer",
      "outputs": [
        {
          "internalType": "int256",
          "name": "",
          "type": "int256"
        }
      ],
      "stateMutability": "view",
      "type": "function"
    },
    {
      "inputs": [
        {
          "internalType": "uint80",
          "name": "_roundId",
          "type": "uint80"
        }
      ],
      "name": "getRoundData",
      "outputs": [
        {
          "internalType": "uint80",
          "name": "roundId",
          "type": "uint80"
        },
        {
          "internalType": "int256",
          "name": "answer",
          "type": "int256"
        },
        {
          "internalType": "uint256",
          "name": "startedAt",
          "type": "uint256"
        },
        {
          "internalType": "uint256",
          "name": "updatedAt",
          "type": "uint256"
        },
        {
          "internalType": "uint80",
          "name": "answeredInRound",
          "type": "uint80"
        }
      ],
      "stateMutability": "view",
      "type": "function"
    },
    {
      "inputs": [
        {
          "internalType": "uint256",
          "name": "roundId",
          "type": "uint256"
        }
      ],
      "name": "getTimestamp",
      "outputs": [
        {
          "internalType": "uint256",
          "name": "",
          "type": "uint256"
        }
      ],
      "stateMutability": "view",
      "type": "function"
    },
    {
      "inputs": [],
      "name": "latestAnswer",
      "outputs": [
        {
          "internalType": "int256",
          "name": "",
          "type": "int256"
        }
      ],
      "stateMutability": "view",
      "type": "function"
    },
    {
      "inputs": [],
      "name": "latestRound",
      "outputs": [
        {
          "internalType": "uint256",
          "name": "",
          "type": "uint256"
        }
      ],
      "stateMutability": "view",
      "type": "function"
    },
    {
      "inputs": [],
      "name": "latestRoundData",
      "outputs": [
        {
          "internalType": "uint80",
          "name": "roundId",
          "type": "uint80"
        },
        {
          "internalType": "int256",
          "name": "answer",
          "type": "int256"
        },
        {
          "internalType": "uint256",
          "name": "startedAt",
          "type": "uint256"
        },
        {
          "internalType": "uint256",
          "name": "updatedAt",
          "type": "uint256"
        },
        {
          "internalType": "uint80",
          "name": "answeredInRound",
          "type": "uint80"
        }
      ],
      "stateMutability": "view",
      "type": "function"
    },
    {
      "inputs": [],
      "name": "latestTimestamp",
      "outputs": [
        {
          "internalType": "uint256",
          "name": "",
          "type": "uint256"
        }
      ],
      "stateMutability": "view",
      "type": "function"
    },
    {
      "inputs": [],
      "name": "version",
      "outputs": [
        {
          "internalType": "uint256",
          "name": "",
          "type": "uint256"
        }
      ],
      "stateMutability": "view",
      "type": "function"
    }
  ],
  "allSourcePaths": {
    "1": "/home/mel/.brownie/packages/smartcontractkit/chainlink-brownie-contracts@0.2.1/contracts/src/v0.6/interfaces/AggregatorInterface.sol",
    "2": "/home/mel/.brownie/packages/smartcontractkit/chainlink-brownie-contracts@0.2.1/contracts/src/v0.6/interfaces/AggregatorV2V3Interface.sol",
    "3": "/home/mel/.brownie/packages/smartcontractkit/chainlink-brownie-contracts@0.2.1/contracts/src/v0.6/interfaces/AggregatorV3Interface.sol"
  },
  "ast": {
    "absolutePath": "/home/mel/.brownie/packages/smartcontractkit/chainlink-brownie-contracts@0.2.1/contracts/src/v0.6/interfaces/AggregatorV2V3Interface.sol",
    "exportedSymbols": {
      "AggregatorV2V3Interface": [
        886
      ]
    },
    "id": 887,
    "license": "MIT",
    "nodeType": "SourceUnit",
    "nodes": [
      {
        "id": 879,
        "literals": [
          "solidity",
          "^",
          "0.6",
          ".0"
        ],
        "nodeType": "PragmaDirective",
        "src": "32:23:2"
      },
      {
        "absolutePath": "/home/mel/.brownie/packages/smartcontractkit/chainlink-brownie-contracts@0.2.1/contracts/src/v0.6/interfaces/AggregatorInterface.sol",
        "file": "./AggregatorInterface.sol",
        "id": 880,
        "nodeType": "ImportDirective",
        "scope": 887,
        "sourceUnit": 935,
        "src": "57:35:2",
        "symbolAliases": [],
        "unitAlias": ""
      },
      {
        "absolutePath": "/home/mel/.brownie/packages/smartcontractkit/chainlink-brownie-contracts@0.2.1/contracts/src/v0.6/interfaces/AggregatorV3Interface.sol",
        "file": "./AggregatorV3Interface.sol",
        "id": 881,
        "nodeType": "ImportDirective",
        "scope": 887,
        "sourceUnit": 981,
        "src": "93:37:2",
        "symbolAliases": [],
        "unitAlias": ""
      },
      {
        "abstract": false,
        "baseContracts": [
          {
            "arguments": null,
            "baseName": {
              "contractScope": null,
              "id": 882,
              "name": "AggregatorInterface",
              "nodeType": "UserDefinedTypeName",
              "referencedDeclaration": 934,
              "src": "169:19:2",
              "typeDescriptions": {
                "typeIdentifier": "t_contract$_AggregatorInterface_$934",
                "typeString": "contract AggregatorInterface"
              }
            },
            "id": 883,
            "nodeType": "InheritanceSpecifier",
            "src": "169:19:2"
          },
          {
            "arguments": null,
            "baseName": {
              "contractScope": null,
              "id": 884,
              "name": "AggregatorV3Interface",
              "nodeType": "UserDefinedTypeName",
              "referencedDeclaration": 980,
              "src": "190:21:2",
              "typeDescriptions": {
                "typeIdentifier": "t_contract$_AggregatorV3Interface_$980",
                "typeString": "contract AggregatorV3Interface"
              }
            },
            "id": 885,
            "nodeType": "InheritanceSpecifier",
            "src": "190:21:2"
          }
        ],
        "contractDependencies": [
          934,
          980
        ],
        "contractKind": "interface",
        "documentation": null,
        "fullyImplemented": false,
        "id": 886,
        "linearizedBaseContracts": [
          886,
          980,
          934
        ],
        "name": "AggregatorV2V3Interface",
        "nodeType": "ContractDefinition",
        "nodes": [],
        "scope": 887,
        "src": "132:83:2"
      }
    ],
    "src": "32:184:2"
  },
  "bytecode": "",
  "bytecodeSha1": "da39a3ee5e6b4b0d3255bfef95601890afd80709",
  "compiler": {
    "evm_version": "istanbul",
    "optimizer": {
      "enabled": true,
      "runs": 200
    },
    "version": "0.6.12+commit.27d51765"
  },
  "contractName": "AggregatorV2V3Interface",
  "coverageMap": {
    "branches": {},
    "statements": {}
  },
  "dependencies": [
    "smartcontractkit/chainlink-brownie-contracts@0.2.1/AggregatorInterface",
    "smartcontractkit/chainlink-brownie-contracts@0.2.1/AggregatorV3Interface"
  ],
  "deployedBytecode": "",
  "deployedSourceMap": "",
  "language": "Solidity",
  "natspec": {
    "kind": "dev",
    "methods": {},
    "version": 1
  },
  "offset": [
    132,
    215
  ],
  "opcodes": "",
  "pcMap": {},
  "sha1": "28145bea34cc6cdbfcebe091314fb602700f19e6",
  "source": "// SPDX-License-Identifier: MIT\npragma solidity ^0.6.0;\n\nimport \"./AggregatorInterface.sol\";\nimport \"./AggregatorV3Interface.sol\";\n\ninterface AggregatorV2V3Interface is AggregatorInterface, AggregatorV3Interface\n{\n}\n",
  "sourceMap": "",
  "sourcePath": "/home/mel/.brownie/packages/smartcontractkit/chainlink-brownie-contracts@0.2.1/contracts/src/v0.6/interfaces/AggregatorV2V3Interface.sol",
  "type": "interface"
}