{
  "abi": [],
  "allSourcePaths": {
    "4": "/home/mel/.brownie/packages/OpenZeppelin/openzeppelin-contracts@4.2.0/contracts/utils/Context.sol"
  },
  "ast": {
    "absolutePath": "/home/mel/.brownie/packages/OpenZeppelin/openzeppelin-contracts@4.2.0/contracts/utils/Context.sol",
    "exportedSymbols": {
      "Context": [
        1359
      ]
    },
    "id": 1360,
    "license": "MIT",
    "nodeType": "SourceUnit",
    "nodes": [
      {
        "id": 1340,
        "literals": [
          "solidity",
          "^",
          "0.8",
          ".0"
        ],
        "nodeType": "PragmaDirective",
        "src": "33:23:4"
      },
      {
        "abstract": true,
        "baseContracts": [],
        "canonicalName": "Context",
        "contractDependencies": [],
        "contractKind": "contract",
        "fullyImplemented": true,
        "id": 1359,
        "linearizedBaseContracts": [
          1359
        ],
        "name": "Context",
        "nameLocation": "572:7:4",
        "nodeType": "ContractDefinition",
        "nodes": [
          {
            "body": {
              "id": 1348,
              "nodeType": "Block",
              "src": "648:34:4",
              "statements": [
                {
                  "expression": {
                    "expression": {
                      "id": 1345,
                      "name": "msg",
                      "nodeType": "Identifier",
                      "overloadedDeclarations": [],
                      "referencedDeclaration": -15,
                      "src": "665:3:4",
                      "typeDescriptions": {
                        "typeIdentifier": "t_magic_message",
                        "typeString": "msg"
                      }
                    },
                    "id": 1346,
                    "isConstant": false,
                    "isLValue": false,
                    "isPure": false,
                    "lValueRequested": false,
                    "memberName": "sender",
                    "nodeType": "MemberAccess",
                    "src": "665:10:4",
                    "typeDescriptions": {
                      "typeIdentifier": "t_address",
                      "typeString": "address"
                    }
                  },
                  "functionReturnParameters": 1344,
                  "id": 1347,
                  "nodeType": "Return",
                  "src": "658:17:4"
                }
              ]
            },
            "id": 1349,
            "implemented": true,
            "kind": "function",
            "modifiers": [],
            "name": "_msgSender",
            "nameLocation": "595:10:4",
            "nodeType": "FunctionDefinition",
            "parameters": {
              "id": 1341,
              "nodeType": "ParameterList",
              "parameters": [],
              "src": "605:2:4"
            },
            "returnParameters": {
              "id": 1344,
              "nodeType": "ParameterList",
              "parameters": [
                {
                  "constant": false,
                  "id": 1343,
                  "mutability": "mutable",
                  "name": "",
                  "nameLocation": "-1:-1:-1",
                  "nodeType": "VariableDeclaration",
                  "scope": 1349,
                  "src": "639:7:4",
                  "stateVariable": false,
                  "storageLocation": "default",
                  "typeDescriptions": {
                    "typeIdentifier": "t_address",
                    "typeString": "address"
                  },
                  "typeName": {
                    "id": 1342,
                    "name": "address",
                    "nodeType": "ElementaryTypeName",
                    "src": "639:7:4",
                    "stateMutability": "nonpayable",
                    "typeDescriptions": {
                      "typeIdentifier": "t_address",
                      "typeString": "address"
                    }
                  },
                  "visibility": "internal"
                }
              ],
              "src": "638:9:4"
            },
            "scope": 1359,
            "src": "586:96:4",
            "stateMutability": "view",
            "virtual": true,
            "visibility": "internal"
          },
          {
            "body": {
              "id": 1357,
              "nodeType": "Block",
              "src": "755:32:4",
              "statements": [
                {
                  "expression": {
                    "expression": {
                      "id": 1354,
                      "name": "msg",
                      "nodeType": "Identifier",
                      "overloadedDeclarations": [],
                      "referencedDeclaration": -15,
                      "src": "772:3:4",
                      "typeDescriptions": {
                        "typeIdentifier": "t_magic_message",
                        "typeString": "msg"
                      }
                    },
                    "id": 1355,
                    "isConstant": false,
                    "isLValue": false,
                    "isPure": false,
                    "lValueRequested": false,
                    "memberName": "data",
                    "nodeType": "MemberAccess",
                    "src": "772:8:4",
                    "typeDescriptions": {
                      "typeIdentifier": "t_bytes_calldata_ptr",
                      "typeString": "bytes calldata"
                    }
                  },
                  "functionReturnParameters": 1353,
                  "id": 1356,
                  "nodeType": "Return",
                  "src": "765:15:4"
                }
              ]
            },
            "id": 1358,
            "implemented": true,
            "kind": "function",
            "modifiers": [],
            "name": "_msgData",
            "nameLocation": "697:8:4",
            "nodeType": "FunctionDefinition",
            "parameters": {
              "id": 1350,
              "nodeType": "ParameterList",
              "parameters": [],
              "src": "705:2:4"
            },
            "returnParameters": {
              "id": 1353,
              "nodeType": "ParameterList",
              "parameters": [
                {
                  "constant": false,
                  "id": 1352,
                  "mutability": "mutable",
                  "name": "",
                  "nameLocation": "-1:-1:-1",
                  "nodeType": "VariableDeclaration",
                  "scope": 1358,
                  "src": "739:14:4",
                  "stateVariable": false,
                  "storageLocation": "calldata",
                  "typeDescriptions": {
                    "typeIdentifier": "t_bytes_calldata_ptr",
                    "typeString": "bytes"
                  },
                  "typeName": {
                    "id": 1351,
                    "name": "bytes",
                    "nodeType": "ElementaryTypeName",
                    "src": "739:5:4",
                    "typeDescriptions": {
                      "typeIdentifier": "t_bytes_storage_ptr",
                      "typeString": "bytes"
                    }
                  },
                  "visibility": "internal"
                }
              ],
              "src": "738:16:4"
            },
            "scope": 1359,
            "src": "688:99:4",
            "stateMutability": "view",
            "virtual": true,
            "visibility": "internal"
          }
        ],
        "scope": 1360,
        "src": "554:235:4",
        "usedErrors": []
      }
    ],
    "src": "33:757:4"
  },
  "bytecode": "",
  "bytecodeSha1": "da39a3ee5e6b4b0d3255bfef95601890afd80709",
  "compiler": {
    "evm_version": "istanbul",
    "optimizer": {
      "enabled": true,
      "runs": 200
    },
    "version": "0.8.15+commit.e14f2714"
  },
  "contractName": "Context",
  "coverageMap": {
    "branches": {},
    "statements": {}
  },
  "dependencies": [],
  "deployedBytecode": "",
  "deployedSourceMap": "",
  "language": "Solidity",
  "natspec": {
    "kind": "dev",
    "methods": {},
    "version": 1
  },
  "offset": [
    554,
    789
  ],
  "opcodes": "",
  "pcMap": {},
  "sha1": "19106a0cfd4cc2ef4023e89765867d55a98ab91a",
  "source": "// SPDX-License-Identifier: MIT\n\npragma solidity ^0.8.0;\n\n/*\n * @dev Provides information about the current execution context, including the\n * sender of the transaction and its data. While these are generally available\n * via msg.sender and msg.data, they should not be accessed in such a direct\n * manner, since when dealing with meta-transactions the account sending and\n * paying for execution may not be the actual sender (as far as an application\n * is concerned).\n *\n * This contract is only required for intermediate, library-like contracts.\n */\nabstract contract Context {\n    function _msgSender() internal view virtual returns (address) {\n        return msg.sender;\n    }\n\n    function _msgData() internal view virtual returns (bytes calldata) {\n        return msg.data;\n    }\n}\n",
  "sourceMap": "",
  "sourcePath": "/home/mel/.brownie/packages/OpenZeppelin/openzeppelin-contracts@4.2.0/contracts/utils/Context.sol",
  "type": "contract"
}