{
    "paper_id": "e9d0bd1ed39a0fa7aa4a623b71111667a3dae461",
    "metadata": {
        "title": "SYNTHESIS AND BIOLOGICAL ACTIVITY OF SEVERAL MODIFIED 5D-ANDROSTANOLONE DERIVATIVES",
        "authors": [
            {
                "first": "N",
                "middle": [
                    "Sh"
                ],
                "last": "Nadaraia",
                "suffix": "",
                "affiliation": {
                    "laboratory": "",
                    "institution": "Tbilisi State Medical University",
                    "location": {
                        "postCode": "0159",
                        "settlement": "Tbilisi"
                    }
                },
                "email": "nnadaraia@ymail.com"
            },
            {
                "first": "N",
                "middle": [
                    "N"
                ],
                "last": "Barbakadze",
                "suffix": "",
                "affiliation": {
                    "laboratory": "",
                    "institution": "Tbilisi State Medical University",
                    "location": {
                        "postCode": "0159",
                        "settlement": "Tbilisi"
                    }
                },
                "email": ""
            },
            {
                "first": "M",
                "middle": [
                    "L"
                ],
                "last": "Kakhabrishvili",
                "suffix": "",
                "affiliation": {
                    "laboratory": "",
                    "institution": "Tbilisi State Medical University",
                    "location": {
                        "postCode": "0159",
                        "settlement": "Tbilisi"
                    }
                },
                "email": ""
            },
            {
                "first": "B",
                "middle": [],
                "last": "Sylla",
                "suffix": "",
                "affiliation": {
                    "laboratory": "Institute of the Chemistry of Plant Substances, Academy of Sciences of the Republic of Uzbekistan",
                    "institution": "Universite Quebec a Chicoutimi",
                    "location": {
                        "postCode": "G7H 2B1",
                        "settlement": "Chicoutimi, Tashkent",
                        "region": "QC, Canada"
                    }
                },
                "email": ""
            },
            {
                "first": "A",
                "middle": [],
                "last": "Pichette",
                "suffix": "",
                "affiliation": {
                    "laboratory": "Institute of the Chemistry of Plant Substances, Academy of Sciences of the Republic of Uzbekistan",
                    "institution": "Universite Quebec a Chicoutimi",
                    "location": {
                        "postCode": "G7H 2B1",
                        "settlement": "Chicoutimi, Tashkent",
                        "region": "QC, Canada"
                    }
                },
                "email": "andre_pichette@uqac.ca"
            },
            {
                "first": "U",
                "middle": [
                    "S"
                ],
                "last": "Makhmudov",
                "suffix": "",
                "affiliation": {},
                "email": ""
            },
            {
                "first": "S",
                "middle": [
                    "Yu"
                ],
                "last": "Yunusov",
                "suffix": "",
                "affiliation": {},
                "email": ""
            }
        ]
    },
    "abstract": [
        {
            "text": "Several new N-containing epiandrosterone derivatives modified by phenylacetic acid chloride were synthesized for biological activity studies. Compounds with antiviral activity were discovered among them and 3E-hydroxy-1c-aryl-3c-methyl-5D-androstano[17,16-d]pyrazolines prepared by us earlier.",
            "cite_spans": [],
            "ref_spans": [],
            "section": "Abstract"
        },
        {
            "text": "Syntheses of biologically active oximes, hydrazones, or carbazones of steroidal ketones have been the subject of much research [1] [2] [3] [4] . Several hydrazones and oximes of 5D-steroids that were previously synthesized by us also exhibited high antituberculosis, antiviral, and anti-inflammatory activity [5] [6] [7] .",
            "cite_spans": [
                {
                    "start": 131,
                    "end": 134,
                    "text": "[2]",
                    "ref_id": null
                },
                {
                    "start": 135,
                    "end": 138,
                    "text": "[3]",
                    "ref_id": null
                },
                {
                    "start": 139,
                    "end": 142,
                    "text": "[4]",
                    "ref_id": null
                },
                {
                    "start": 309,
                    "end": 312,
                    "text": "[5]",
                    "ref_id": null
                },
                {
                    "start": 313,
                    "end": 316,
                    "text": "[6]",
                    "ref_id": null
                },
                {
                    "start": 317,
                    "end": 320,
                    "text": "[7]",
                    "ref_id": null
                }
            ],
            "ref_spans": [],
            "section": "Abstract"
        },
        {
            "text": "Addition of fragments of natural compounds to organic molecules is known to produce new and previously unknown biological properties.",
            "cite_spans": [],
            "ref_spans": [],
            "section": "Abstract"
        },
        {
            "text": "Phenylacetic acid synthesized by plants can exhibit auxin-like activity according to some reports [8, 9] . Steroidal esters of phenylacetic-acid derivatives exhibited characteristic antitumor activity [10] . The drug perandren is a phenylacetate ester of testosterone that is used for osteoporosis, breast cancer, etc.",
            "cite_spans": [
                {
                    "start": 98,
                    "end": 101,
                    "text": "[8,",
                    "ref_id": null
                },
                {
                    "start": 102,
                    "end": 104,
                    "text": "9]",
                    "ref_id": null
                },
                {
                    "start": 201,
                    "end": 205,
                    "text": "[10]",
                    "ref_id": null
                }
            ],
            "ref_spans": [],
            "section": "Abstract"
        },
        {
            "text": "The structure-activity relationship was studied using esterification of epiandrosterone (1) by phenylacetic acid chloride to produce modified ketone 2. Reactions of 2 with hydroxylamine, m-nitrobenzoic or nicotinic acid hydrazides, and semi-or thiosemicarbazides synthesized derivatives 3-7. 8 1 2 3 -7 9 -11 12 3: X = NOH 4: X = NNHCO NO 2 5: X = NNHCO N 6: X = NNHCONH 2 7: X = NNHCSNH 2 3 17",
            "cite_spans": [],
            "ref_spans": [],
            "section": "Abstract"
        }
    ],
    "body_text": [
        {
            "text": "Herein, the antiviral activities of new 3-7 and steroids 9-12 that were prepared by us earlier from pregnenolone 8 [11] are reported. The structures were 3E-hydroxy-1c-p-chlorophenyl- (9) , 3E-hydroxy-1c-p-bromophenyl-(10), 3E-hydroxy-1c-p-methylphenyl-3c-methyl-5D-androstano[17,16-d]pyrazoline (11) , and 5D-preg-16-en-3E-ol-20-one p-nitrophenylhydrazone (12) .",
            "cite_spans": [
                {
                    "start": 115,
                    "end": 119,
                    "text": "[11]",
                    "ref_id": null
                },
                {
                    "start": 184,
                    "end": 187,
                    "text": "(9)",
                    "ref_id": null
                },
                {
                    "start": 296,
                    "end": 300,
                    "text": "(11)",
                    "ref_id": null
                },
                {
                    "start": 357,
                    "end": 361,
                    "text": "(12)",
                    "ref_id": "BIBREF20"
                }
            ],
            "ref_spans": [],
            "section": ""
        },
        {
            "text": "The structures of 2-7 were confirmed using IR, NMR, and mass spectra. The IR spectrum of ketone 2 showed C=O absorption bands at 1700 and 1750 cm -1 . Singlets for angular 18-and 19-CH 3 protons in the PMR spectrum (in CDCl 3 ) appeared at G 0.86 and 1.27 ppm; a multiplet for the 3D-proton, 4.72; aromatic protons, 7.28-7.33; and phenylacetoxy methylene proton, 3.60. The 13 C NMR spectrum of 2 had resonances for phenyl-ring C atoms in the range 126. The structure of 2 was also confirmed by an X-ray crystal structure analysis (XSA) ( Fig. 1 and Table 1 ). Antiviral activity of 3-7 and 9-12 was studied and showed that hydrazone 4 had high; 5, 10, and 12, moderate; and pyrazoline 9, weak antiviral activity against Polio virus (Vero 76 cell culture, strain Type 3, WM-3) ( Table 2 ). The other steroids were inactive. Hydrazones 4 and 5 were weakly active against Sars corona virus (Vero 76 cell culture, strain Urbani). The other compounds were inactive. Compounds 5, 9, and 12 were weakly active whereas the other steroids were inactive against Rift valley fevervirus (Vero 76 cell culture, strain MP-12). Only hydrazone 5 exhibited weak activity against Takaribe virus (Vero cell culture, strain TRVL-11573). All steroids 3-7 and 9-12 were inactive against Venezuelan equine encephalitis virus, Respiratory syncytial virus, Influenza A virus H 1 N 1 , and Dengue virus (Vero cell culture, MA-104, MDCK; Vero 76; strains TC-83; A-2; California 07.2009; Type 2, New Guinea C, respectively).",
            "cite_spans": [],
            "ref_spans": [
                {
                    "start": 538,
                    "end": 544,
                    "text": "Fig. 1",
                    "ref_id": "FIGREF2"
                },
                {
                    "start": 549,
                    "end": 556,
                    "text": "Table 1",
                    "ref_id": "TABREF0"
                },
                {
                    "start": 778,
                    "end": 785,
                    "text": "Table 2",
                    "ref_id": "TABREF1"
                }
            ],
            "section": ""
        },
        {
            "text": "PMR and 13 C NMR spectra were recorded from CDCl 3 and DMSO-d 6 solutions with TMS internal standard on a Bruker Avance 400 instrument (400.13 MHz for 1 H and 100.61 MHz for 13 C). IR spectra were taken from KBr pellets on a Varian 660 FTIR spectrometer. Mass spectra were obtained on an HPLC-APCIMS (positive mode)-Agilent 1100 Series with an Inertsil PREP-ODS column (6.0 u 250 mm) and elution of steroids by H 2 O-MeCN (20:80). Melting points were determined on a NAGEMA apparatus. The course of reactions and purity of synthesized compounds were monitored by TLC on Silufol UV-254 plates using C 6 H 6 -Me 2 CO (10:1, 6:1). Chromatograms were detected using phosphomolybdic acid solution (10%) in EtOH followed by heating.",
            "cite_spans": [],
            "ref_spans": [],
            "section": "EXPERIMENTAL"
        },
        {
            "text": "3E-Phenylacetoxy-5D-androstan-17-one (2). A solution of epiandrosterone 1 (0.3 g, 1 mmol) in anhydrous C 6 H 6 (20 mL) and anhydrous Py (0.3 mL) was treated with phenylacetic acid chloride (0.19 g, 1.2 mmol) , refluxed for 6 h, cooled same diffractometer. Absorption corrections for the crystals were made semi-empirically using the SADABS program [14] . Table 1 presents the main XSA and refinement parameters for the structure of 2. The structure was solved by direct methods using the SHELXS-97 program suite and refined using the SHELXL-97 program [15] . All nonhydrogen atoms were refined by full-matrix anisotropic least-squares methods (over F 2 ). Positions of H atoms were found geometrically and refined with fixed isotropic thermal factors U iso = nU eq , where n = 1.5 for methyls and 1.2 for others and U eq is the equivalent isotropic thermal factor of the corresponding C atom.",
            "cite_spans": [
                {
                    "start": 348,
                    "end": 352,
                    "text": "[14]",
                    "ref_id": "BIBREF21"
                },
                {
                    "start": 552,
                    "end": 556,
                    "text": "[15]",
                    "ref_id": null
                }
            ],
            "ref_spans": [
                {
                    "start": 189,
                    "end": 207,
                    "text": "(0.19 g, 1.2 mmol)",
                    "ref_id": "FIGREF2"
                },
                {
                    "start": 355,
                    "end": 362,
                    "text": "Table 1",
                    "ref_id": "TABREF0"
                }
            ],
            "section": "EXPERIMENTAL"
        },
        {
            "text": "Results from the XSA were deposited as a CIF-file in the Cambridge Crystallographic Data Centre (CCDC).",
            "cite_spans": [],
            "ref_spans": [],
            "section": "EXPERIMENTAL"
        }
    ],
    "bib_entries": {
        "BIBREF0": {
            "ref_id": "b0",
            "title": "The Et 2 O extracts were washed with H 2 O, Na 2 CO 3 solution, and H 2 O; dried over Na 2 SO 4 ; and evaporated to isolate 2 (0.31 g, 74%), mp 160-162qC. IR spectrum (KBr, Q, cm -1 ): 1750, 1700 (C=\u00ce), 1535 (arom. ring). 1 \u00cd NMR spectrum (CDCl 3 , G, ppm): 0.86 (3H, s, 18-CH 3 ), 1.27 (3H, s",
            "authors": [],
            "year": null,
            "venue": "5 ), 4.72 (1H, m, H-3), 7.28-7.33 (5H, m, C 6 H 5 ). 13 C NMR spectrum",
            "volume": "",
            "issn": "",
            "pages": "19--22",
            "other_ids": {}
        },
        "BIBREF1": {
            "ref_id": "b1",
            "title": "The precipitate was filtered off, rinsed with H 2 O, and dried. Crystallization from MeOH produced oxime 3 (0.45 g, 86%), mp 154-156qC. IR spectrum (KBr, Q, cm -1 ): 3260 (\u00ceH), 1735 (C=\u00ce), 1680 (C=N), 1524 (arom. ring). 1 \u00cd NMR spectrum (CDCl 3 , G, ppm): 0.83 (3H, s, 18-CH 3 ), 0.89 (3H, s, 19-CH 3",
            "authors": [],
            "year": null,
            "venue": "4.69 (1H, m, H-3), 7.26-7.34 (5H, m, C 6 H 5 ), 7.93 (1H, br.s, \u00d1=N-OH). 13 C NMR spectrum",
            "volume": "",
            "issn": "",
            "pages": "",
            "other_ids": {}
        },
        "BIBREF2": {
            "ref_id": "b2",
            "title": "1 \u00cd NMR spectrum (CDCl 3 , G, ppm, J/Hz): 0.77 (3H, s, 18-CH 3 ), 0.82 (3H, s",
            "authors": [],
            "year": null,
            "venue": "Yield 72%, mp 184-186qC. IR spectrum (KBr, Q, cm -1 ): 3450 (NH), 1729 (C=\u00ce), 1665 (NH-CO), 1640 (C=N), 1531 (arom. ring), 1500 and 1348",
            "volume": "",
            "issn": "",
            "pages": "19--22",
            "other_ids": {}
        },
        "BIBREF3": {
            "ref_id": "b3",
            "title": "\u00d1-4cc), 127.0 (C-4c), 128.5 (C-3c, 5c), 130.1 (C-5cc), 129.2 (C-2c, 6c)",
            "authors": [
                {
                    "first": "C",
                    "middle": [],
                    "last": "Nmr",
                    "suffix": ""
                }
            ],
            "year": null,
            "venue": "571.8. Steroids 5-7 were prepared analogously. 3E-Phenylacetoxy-5D-androstan-17-one Nicotinoylhydrazone (5). Yield 81%, mp 108-110qC. IR spectrum (KBr, Q, cm -1 ): 3370 (NH), 1728 (CO), 1651 (NHCO), 1610 (C=N), 1589 (arom. ring)",
            "volume": "126",
            "issn": "",
            "pages": "",
            "other_ids": {}
        },
        "BIBREF4": {
            "ref_id": "b4",
            "title": "Yield 79%, mp 250-252qC. IR spectrum (KBr, Q, cm -1 )",
            "authors": [
                {
                    "first": "",
                    "middle": [],
                    "last": "3e-Phenylacetoxy",
                    "suffix": ""
                }
            ],
            "year": null,
            "venue": "1630 (C=N), 1581 (arom. ring). 1 \u00cd NMR spectrum",
            "volume": "3479",
            "issn": "",
            "pages": "",
            "other_ids": {}
        },
        "BIBREF5": {
            "ref_id": "b5",
            "title": "LC-MS m/z 466.3 [M + H] + . C 28 H 39 N 3 O 3 . MM . 465.3. 3E-Phenylacetoxy-5D-androstan-17-one Thiosemicarbazone (7)",
            "authors": [],
            "year": null,
            "venue": "3.50 (2H, s, CH 2 C 6 H 5 ), 4.59 (1H, m, H-3), 5.81 (2H, br.s, NH 2 ), 7.17-7.30 (5H, m, C 6 H 5 )",
            "volume": "8",
            "issn": "",
            "pages": "",
            "other_ids": {}
        },
        "BIBREF6": {
            "ref_id": "b6",
            "title": "In particular, all newly tested compounds were evaluated initially a) for inhibition of virus cytopathic effects (CPE assay) and b) for uptake of neutral red dye (NR Dye Uptake Assay) that stained undamaged virus cells. The color intensity was determined spectrophotometrically. The experimental results from a) were used to calculate the 50% inhibitory (cytotoxic) concentration CC 50 ; from b), the 50% effective concentration EC 50 . Antiviral activity of each tested compounds was characterized by the selectivity index (SI 50 ), which was the ratio of CC 50 to EC 50 . As a rule",
            "authors": [],
            "year": null,
            "venue": "Antiviral activity of the synthesized compounds was studied in the framework of the international program \"AACF Antiviral Testing in Animals\" at the Division of Microbiology and Infectious Diseases",
            "volume": "",
            "issn": "",
            "pages": "",
            "other_ids": {}
        },
        "BIBREF7": {
            "ref_id": "b7",
            "title": "A single crystal of 2 for the XSA was obtained by slow evaporation of an appropriate solvent at room temperature",
            "authors": [
                {
                    "first": "",
                    "middle": [],
                    "last": "Xsa",
                    "suffix": ""
                }
            ],
            "year": null,
            "venue": "",
            "volume": "",
            "issn": "",
            "pages": "",
            "other_ids": {}
        },
        "BIBREF8": {
            "ref_id": "b8",
            "title": "Unit-cell constants of the crystal of 2 were determined and refined on a CCDXcalibur Ruby diffractometer (Oxford Diffraction) using Cu KD-radiation (300 K, graphite monochromator) [13]. A three-dimensional dataset of reflections was obtained on the REFERENCES 1",
            "authors": [],
            "year": null,
            "venue": "",
            "volume": "",
            "issn": "",
            "pages": "",
            "other_ids": {}
        },
        "BIBREF20": {
            "ref_id": "b20",
            "title": "Oxford Diffraction, CrysAlisPro, Oxford Diffraction Ltd",
            "authors": [],
            "year": 2009,
            "venue": "Assays for Antiviral Activity Against Respiratory and Biodefense Viruses. DMID, NIAID, NIH",
            "volume": "",
            "issn": "",
            "pages": "",
            "other_ids": {}
        },
        "BIBREF21": {
            "ref_id": "b21",
            "title": "Program for Empirical Absorption Correction of Area Detector Data",
            "authors": [
                {
                    "first": "G",
                    "middle": [
                        "M"
                    ],
                    "last": "Sheldrick",
                    "suffix": ""
                }
            ],
            "year": 1996,
            "venue": "",
            "volume": "",
            "issn": "",
            "pages": "",
            "other_ids": {}
        }
    },
    "ref_entries": {
        "FIGREF1": {
            "text": "9-134.3 ppm; for O-C=O and C=O, 171.1 and 221.3, respectively. IR spectra of 3-5 contained absorption bands for ester C=O at 1735, 1729, and 1728 cm -1 , respectively; NHCO groups (hydrazones 4 and 5), 1665 and 1651; C=N-and aromatic C=C stretching vibrations, 1680, 1640, and 1610 and 1524, 1531, and 1589, respectively; and NH (hydrazones 4 and 5) and OH groups (oxime 3), 3450, 3370, and 3260. The IR spectrum of 4 also had characteristic bands for Ar-NO 2 stretching vibrations at 1500 and 1348 cm -1 . PMR spectra of 3-7 showed singlets for angular 18-and 19-CH 3 groups at 0.83, 0.77, 0.85, 0.82, 0.84, and 0.89, 0.82, 0.87, 0.88, 0.90 ppm, respectively; multiplets for 3D-protons of 3E-esters, 4.69, 4.61, 4.61, 4.59; phenyl aromatic protons, in the range 7.17-7.34. Singlets for the phenylacetoxy methylene protons appeared at G 3.58-3.50 ppm; aromatic protons of steroid hydrazones 4 and 5, 7.32-8.93. The NH protons gave two singlets for the cis-conformers at 8.93 and 10.32 ppm, respectively; trans-conformer, 8.48 and 10.25. The oxime hydroxyl proton of 3 appeared as a broad singlet at 7.93 ppm. The NH protons of 6 and 7 were found at 8.54 and 9.55 ppm, respectively. The NH 2 protons of semicarbazone 6 appeared as a broad singlet at 5.81 ppm; thiosemicarbazone 7, two broad singlets at 7.03 and 7.79. The 13 C NMR spectrum of 3 contained peaks for phenyl-ring C atoms in the range 126.9-134.3 ppm; C=N and C=O, 171.1 and 171.3, respectively. The 13 C NMR spectrum of hydrazone 4 had resonances for all aromatic C atoms in the range 125.8-147.4 ppm; amide C atom, 166.7; C=N and O-C=O, 168.3 and 171.2, respectively. The 13 C NMR spectrum of 7 had resonances for phenyl-ring C atoms in the range 126.9-134.3 ppm; C=N, C=O, and C=S, 167.4, 171.2, and 178.9, respectively. The molecular ions m/z [M + H] + for steroids 2-7 agreed with the empirical formulas.",
            "latex": null,
            "type": "figure"
        },
        "FIGREF2": {
            "text": "Molecular structure of 2. The orientation of the oxy substituent was 3E-equatorial; of the C10 and C13 methyls, E-axial. This was confirmed by the Flack parameter of -0.5(4) that became 0.8(3) for the inverted calculation. The molecule of 2 had a ketone [C17=O, 1.207(3) A\u00b0 ] according to the bond length. As expected, the ring fusions were A/B-, B/C-, and C/D-trans. Rings A, B, and C had canonical chair conformations; five-membered ring D, C14-envelope.",
            "latex": null,
            "type": "figure"
        },
        "TABREF0": {
            "text": "Main Crystallographic and X-ray Structure Analysis Parameters for 2",
            "latex": null,
            "type": "table"
        },
        "TABREF1": {
            "text": "Data for in vitro Screening of Antiviral Activity of 3-7 and 9-12 ______ EC 50 is the compound concentration inhibiting virus replication by 50%; CC 50 , compound concentration reducing cell survival by 50%; SI 50 = CC 50 /EC 50 .",
            "latex": null,
            "type": "table"
        }
    },
    "back_matter": [
        {
            "text": "The work was financially supported by the Shota Rustaveli National Science Foundation of Georgia (Grant No. YS-2016-51, Potential Bioactive Steroidal Nitrogen-containing Compounds).",
            "cite_spans": [],
            "ref_spans": [],
            "section": "ACKNOWLEDGMENT"
        }
    ]
}