{
    "paper_id": "5fb6357b99dac68477cf0718f0cd40438dd8879a",
    "metadata": {
        "title": "Prevalence of rotavirus (GARV) and coronavirus (BCoV) associated with neonatal diarrhea in calves in western Algeria Asian Pacific Journal of Tropical Biomedicine journal homepage: www.apjtb.com",
        "authors": [
            {
                "first": "Selles",
                "middle": [],
                "last": "Sidi",
                "suffix": "",
                "affiliation": {},
                "email": ""
            },
            {
                "first": "Mohammed",
                "middle": [],
                "last": "Ammar",
                "suffix": "",
                "affiliation": {
                    "laboratory": "Laboratory of Research on Local Animal Products",
                    "institution": "Ibn-Khaldoun University of Tiaret",
                    "location": {
                        "postCode": "14000",
                        "settlement": "Tiaret",
                        "country": "Algeria"
                    }
                },
                "email": ""
            },
            {
                "first": "Kouidri",
                "middle": [],
                "last": "Mokhtaria",
                "suffix": "",
                "affiliation": {
                    "laboratory": "Laboratory of Research on Local Animal Products, Ibn-Khaldoun University of Tiaret",
                    "institution": "Ibn-Khaldoun University of Tiaret",
                    "location": {
                        "postCode": "14000, 14000",
                        "settlement": "Tiaret, Tiaret",
                        "country": "Algeria, Algeria"
                    }
                },
                "email": ""
            },
            {
                "first": "Belhamiti",
                "middle": [],
                "last": "Belkacem Tahar",
                "suffix": "",
                "affiliation": {
                    "laboratory": "Laboratory of Research on Local Animal Products",
                    "institution": "Ibn-Khaldoun University of Tiaret",
                    "location": {
                        "postCode": "14000",
                        "settlement": "Tiaret",
                        "country": "Algeria"
                    }
                },
                "email": ""
            },
            {
                "first": "Ait",
                "middle": [
                    "Amrane"
                ],
                "last": "Amar",
                "suffix": "",
                "affiliation": {
                    "laboratory": "Laboratory of Research on Local Animal Products",
                    "institution": "Ibn-Khaldoun University of Tiaret",
                    "location": {
                        "postCode": "14000",
                        "settlement": "Tiaret",
                        "country": "Algeria"
                    }
                },
                "email": ""
            },
            {
                "first": "Benia",
                "middle": [
                    "Ahmed"
                ],
                "last": "Redha",
                "suffix": "",
                "affiliation": {
                    "laboratory": "Laboratory of Research on Local Animal Products",
                    "institution": "Ibn-Khaldoun University of Tiaret",
                    "location": {
                        "postCode": "14000",
                        "settlement": "Tiaret",
                        "country": "Algeria"
                    }
                },
                "email": ""
            },
            {
                "first": "Bellik",
                "middle": [],
                "last": "Yuva",
                "suffix": "",
                "affiliation": {
                    "laboratory": "Laboratory of Research on Local Animal Products",
                    "institution": "Ibn-Khaldoun University of Tiaret",
                    "location": {
                        "postCode": "14000",
                        "settlement": "Tiaret",
                        "country": "Algeria"
                    }
                },
                "email": ""
            },
            {
                "first": "Hammoudi",
                "middle": [
                    "Si"
                ],
                "last": "Mohamed",
                "suffix": "",
                "affiliation": {
                    "laboratory": "Laboratory of Research on Local Animal Products",
                    "institution": "Ibn-Khaldoun University of Tiaret",
                    "location": {
                        "postCode": "14000",
                        "settlement": "Tiaret",
                        "country": "Algeria"
                    }
                },
                "email": ""
            },
            {
                "first": "Niar",
                "middle": [],
                "last": "Abdellatif",
                "suffix": "",
                "affiliation": {
                    "laboratory": "Laboratory of Research on Local Animal Products, Ibn-Khaldoun University of Tiaret",
                    "institution": "Ibn-Khaldoun University of Tiaret",
                    "location": {
                        "postCode": "14000, 14000",
                        "settlement": "Tiaret, Tiaret",
                        "country": "Algeria, Algeria"
                    }
                },
                "email": ""
            },
            {
                "first": "Boukr\u00e2a",
                "middle": [],
                "last": "Laid",
                "suffix": "",
                "affiliation": {
                    "laboratory": "Laboratory of Research on Local Animal Products",
                    "institution": "Ibn-Khaldoun University of Tiaret",
                    "location": {
                        "postCode": "14000",
                        "settlement": "Tiaret",
                        "country": "Algeria"
                    }
                },
                "email": ""
            }
        ]
    },
    "abstract": [
        {
            "text": "Objective: To study the prevalence of bovine group A rotavirus (GARV) and bovine coronavirus (BCoV) in diarrheic feces from calves and the sensitive's parameters such as age group and sex. Methods: Feces samples from 82 diarrheic dairy calves from farms around Tiaret (Western Algeria) were collected. These samples were tested by ELISA assay. Results: The results showed that the prevalence of rotavirus and coronavirus infection are 14.63% (12.2% alone and 2.43% associated with bovine coronavirus) and 20.73% (18.3% alone and 2.43% associated with GARV), respectively. Conclusions: The present study demonstrates that the both BCoV and GARV are involved in the neonatal calves' diarrhea, where the frequency of BCoV is clearly higher than that of GARV.",
            "cite_spans": [],
            "ref_spans": [],
            "section": "Abstract"
        },
        {
            "text": "Peer reviewer",
            "cite_spans": [],
            "ref_spans": [],
            "section": "Abstract"
        }
    ],
    "body_text": [
        {
            "text": "Neonatal calf diarrhea is one of the most devastating diseases of the dairy industry worldwide [1] . It is defined as pathology having a complex multifactorial etiology, influenced by infectious, nutritional and environmental factors as well as management practices. Its suggested causes include toxins, bacteria, protozoa, viruses and management/environmental factors such as overfeeding, low temperature, poor hygiene, colostrum deprivation and individual animal susceptibility. Infectious agents, either singly or in combination, may be associated with field outbreaks with considerable economic burden [2] .",
            "cite_spans": [
                {
                    "start": 95,
                    "end": 98,
                    "text": "[1]",
                    "ref_id": "BIBREF0"
                },
                {
                    "start": 606,
                    "end": 609,
                    "text": "[2]",
                    "ref_id": "BIBREF1"
                }
            ],
            "ref_spans": [],
            "section": "Introduction"
        },
        {
            "text": "The incidence risks of diarrhea in calves under 30 d old was reported by several studies and it varies between 15% and 20% [3] . According to the latter, the mortality risk is 1.5%-8%. In Algeria, the epidemiological studies conducted to date showed that the syndrome came after each period of calving and it causes major economic loss directly through the morbidity, mortality and therapy and indirectly by poor growth problems after clinical diseases [4] .",
            "cite_spans": [
                {
                    "start": 123,
                    "end": 126,
                    "text": "[3]",
                    "ref_id": "BIBREF2"
                },
                {
                    "start": 453,
                    "end": 456,
                    "text": "[4]",
                    "ref_id": "BIBREF3"
                }
            ],
            "ref_spans": [],
            "section": "Introduction"
        },
        {
            "text": "Rotavirus, bovine coronavirus (BCoV), Escherichia coli F5 (E. coli), and Cryptosporidium species are internationally recognized as the most important enteropathogens in acute diarrhea in young calves [5] . In calves, bovine group A rotavirus (GARV) and BCoV are the most commonly associated viruses with neonatal diarrhea and it is not unusual that both viruses can concomitantly infect calves [6] .",
            "cite_spans": [
                {
                    "start": 200,
                    "end": 203,
                    "text": "[5]",
                    "ref_id": "BIBREF4"
                },
                {
                    "start": 242,
                    "end": 248,
                    "text": "(GARV)",
                    "ref_id": null
                },
                {
                    "start": 394,
                    "end": 397,
                    "text": "[6]",
                    "ref_id": "BIBREF5"
                }
            ],
            "ref_spans": [],
            "section": "Introduction"
        },
        {
            "text": "Difficulties in the clinical diagnosis of infectious enteritis arise from frequent nonspecific clinical signs and lesions, the presence of asymptomatic infections, the involvement of multiple agents, and the interactions of intrinsic and extrinsic factors that predispose the host to infection [7] . However, many laboratory diagnostic tests based on the different methods such as direct electron microscopic test, ELISA, latex agglutination, polyacrylamide gel electrophoresis, reverse transcription polymerase chain reaction as well as immuno-electron microscopy. Among these methods, ELISA using monoclonal antibody as a sensitive, fast, and inexpensive method is used for the simultaneous detection of BCoV and GARV in the feces of diarrheic calves [8] .",
            "cite_spans": [
                {
                    "start": 294,
                    "end": 297,
                    "text": "[7]",
                    "ref_id": null
                },
                {
                    "start": 753,
                    "end": 756,
                    "text": "[8]",
                    "ref_id": "BIBREF8"
                }
            ],
            "ref_spans": [],
            "section": "Introduction"
        },
        {
            "text": "The high frequency and persistence of calves' neonatal diarrhea in farming has gained the interest of many researchers. Thus; the purpose of the present study is to report and estimate the prevalence of GARV and BCoV using ELISA assay in diarrheic feces from calves and the sensitive's parameters like age-group and sex in Western Algeria (Tiaret).",
            "cite_spans": [],
            "ref_spans": [],
            "section": "Introduction"
        },
        {
            "text": "Eighty two samples of diarrheic feces were collected from both sexes of Holstein calves, aged less than 30 d old, which had not received prior treatment with antibiotics during calving period. In fact, these calves were issued from cows which were not vaccinated against the causative agent of neonatal diarrhea. They showed an important dehydration and had poor appetite, liveliness and suckling reflex, and characterized by a pasty-watery faeces. The studied calves were grouped in cowsheds with a bad hygiene. The population was stratified into four age-groups: group 1: \u22647 d, group 2: \u22658 d\u226414 d, group 3: \u226515 d\u226421 d and group 4: \u2265 22 d\u226430 d. Samples were collected in sterile flasks after cleaning of the anal area with a paper towel and beats by rectal stimulation with the index finger protected by disposable sterile plastic gloves. The collected samples were stored at -20 \u00b0C until analyzing.",
            "cite_spans": [
                {
                    "start": 646,
                    "end": 653,
                    "text": "Samples",
                    "ref_id": null
                }
            ],
            "ref_spans": [],
            "section": "Feces samples"
        },
        {
            "text": "A commercial indirect antigen-capture ELISA kit (rotavirus and coronavirus, Pourquier Institute, France) employing specific monoclonal antibodies was used to detect VP7 protein of GARV and S protein of BCoV in fecal samples. This assay is realized in the Veterinary Regional Laboratory of Tlemcen (Algeria). The ELISA procedure was performed according to the manufacturer instruction (Kit reference P 00603). After adding stop solution (0.5 mol/L of H 2 SO 4 ), the optical density (OD) of each well was measured at 450 nm. Calculating the net OD of each sample and interpreting the results were performed as described by manufacturer instruction. Briefly, all samples were considered positive if the %E/P is upper or equal to 7%. %E/P = 100\u4f0a(OD of sample to test-OD of negative control sample)/(Average OD of positive control sample-OD of negative control sample)",
            "cite_spans": [],
            "ref_spans": [],
            "section": "ELISA test"
        },
        {
            "text": "The ELISA test is considered valid insofar as: 1. The positive control sample to a minimal average OD 450: 0.5 or OD 450=0.5.",
            "cite_spans": [],
            "ref_spans": [],
            "section": "ELISA test"
        },
        {
            "text": "2. OD 450 mean of the positive control sample/OD 450 of negative sample=5.",
            "cite_spans": [],
            "ref_spans": [],
            "section": "ELISA test"
        },
        {
            "text": "The contingency table was used at 5% significance to assess the differences among the proportions of fecal samples positive to GARV and BCoV variables such as age group and sex of the animals studied. The statistical analysis system program was used to perform the statistical calculations.",
            "cite_spans": [],
            "ref_spans": [],
            "section": "Statistical analysis"
        },
        {
            "text": "During this study, eighty two samples from diarrheic calves were studied. Briefly, 26 of the calves included in this study were 1-7 d old, and 13 presented BCoV alone and 2 calves (2.43%) were associated with GARV. Likewise, GARV infections were detected in 12 calves (14.63%). GARV was the only agent detected in 10 calves (12.2%), the remainder of GARV (2.43%) infections is combined with BCoV (Table 1) . Table 2 summarizes the proportions of positive samples as for the two enteropathogens during the four weeks of life. ",
            "cite_spans": [
                {
                    "start": 83,
                    "end": 85,
                    "text": "26",
                    "ref_id": "BIBREF26"
                },
                {
                    "start": 143,
                    "end": 145,
                    "text": "13",
                    "ref_id": "BIBREF13"
                }
            ],
            "ref_spans": [
                {
                    "start": 396,
                    "end": 405,
                    "text": "(Table 1)",
                    "ref_id": "TABREF1"
                },
                {
                    "start": 408,
                    "end": 415,
                    "text": "Table 2",
                    "ref_id": "TABREF2"
                }
            ],
            "section": "Detection of enteropathogens"
        },
        {
            "text": "Among the 82 collected faecal samples, 27 cases were found to have one of both viruses; 16 cases (59.26%) were male and 11 (40.74%) were female. A total of 17 cases were found to have BCoV using ELISA test; 13 were males and 4 females. On the contrary, 7 females and 5 males were affected by GARV.",
            "cite_spans": [
                {
                    "start": 39,
                    "end": 41,
                    "text": "27",
                    "ref_id": "BIBREF27"
                },
                {
                    "start": 207,
                    "end": 209,
                    "text": "13",
                    "ref_id": "BIBREF13"
                }
            ],
            "ref_spans": [],
            "section": "Sex distribution of infections"
        },
        {
            "text": "Diarrhea in the neonatal calf is a serious welfare problem and a cause of economic loss due to mortality, treatment costs and poor growth. Calf diarrhea is an example of a complex or multifactorial disease, resulting as it does from an interaction between the calf, its environment, nutrition and infectious agents [9] . Enteric infections may be caused by protozoa, bacteria and/or virus [10] .",
            "cite_spans": [
                {
                    "start": 315,
                    "end": 318,
                    "text": "[9]",
                    "ref_id": "BIBREF9"
                },
                {
                    "start": 389,
                    "end": 393,
                    "text": "[10]",
                    "ref_id": "BIBREF10"
                }
            ],
            "ref_spans": [],
            "section": "Discussion"
        },
        {
            "text": "In the present study, BCoV was the predominant enteropathogen associated with calves' diarrhea. The incidence of this agent is 20.73% (17/82) either alone or in combination with GARV. Our result is in agreement with those reported by Brand\u00e3o et al [11] , Stipp et al. [10] in Brazil, AKam et al. in Algeria [4] and Izzo et al. [12] in Australlia, in which the incidence of BCoV are 22.22%, 19%, 18.48% and 21.6% respectively, though much higher to those reported by Reynolds et al. [13] in England (14%), Snodgrass et al. [14] in Scotland (4%), Perez et al. [15] in Costa (9%), De La Fuente et al. [16] in Spain (7.34%), Rai et al. [17] in India (11.76%) and Dash et al. [18] in India (4.76%). However the result reached in our work remains lesser when comparing to that formerly cited by Abraham et al. [19] in Ethiopia (38.9%).",
            "cite_spans": [
                {
                    "start": 134,
                    "end": 141,
                    "text": "(17/82)",
                    "ref_id": null
                },
                {
                    "start": 248,
                    "end": 252,
                    "text": "[11]",
                    "ref_id": "BIBREF11"
                },
                {
                    "start": 255,
                    "end": 260,
                    "text": "Stipp",
                    "ref_id": null
                },
                {
                    "start": 268,
                    "end": 272,
                    "text": "[10]",
                    "ref_id": "BIBREF10"
                },
                {
                    "start": 307,
                    "end": 310,
                    "text": "[4]",
                    "ref_id": "BIBREF3"
                },
                {
                    "start": 327,
                    "end": 331,
                    "text": "[12]",
                    "ref_id": "BIBREF12"
                },
                {
                    "start": 482,
                    "end": 486,
                    "text": "[13]",
                    "ref_id": "BIBREF13"
                },
                {
                    "start": 522,
                    "end": 526,
                    "text": "[14]",
                    "ref_id": "BIBREF14"
                },
                {
                    "start": 558,
                    "end": 562,
                    "text": "[15]",
                    "ref_id": "BIBREF15"
                },
                {
                    "start": 598,
                    "end": 602,
                    "text": "[16]",
                    "ref_id": "BIBREF16"
                },
                {
                    "start": 632,
                    "end": 636,
                    "text": "[17]",
                    "ref_id": "BIBREF17"
                },
                {
                    "start": 671,
                    "end": 675,
                    "text": "[18]",
                    "ref_id": "BIBREF18"
                },
                {
                    "start": 804,
                    "end": 808,
                    "text": "[19]",
                    "ref_id": "BIBREF19"
                }
            ],
            "ref_spans": [],
            "section": "Discussion"
        },
        {
            "text": "On the other hand, GARV infections were detected at less prevalence rate (14.63%, i.e.12/82). This finding corroborates with the result noticed by Abraham et al. [19] (16.7%), Rai et al. [17] (15.68%), and Al-Robaiee and Al-Farwachi [20] (15.5%). Alfieri et al. [2] stated that the rate of diarrheic fecal samples infected in beef and dairy calves were 33% and 20.2%, respectively. While Zrelli et al. [21] recorded an average rate of 22.8%, Langoni et al. [22] showed an average rate of 25.1% and AKam et al. [4] cited a percentage of 21.84%. Interestingly, others reported an important rate of GARV infection such as Reynolds et al. [13] (42%), Snodgrass et al. [14] (50%), De La Fuente et al. [16] (42.7%), Izzo et al. [12] (79.9%) and Nourmohammadzadeh et al. [23] (34%). Nevertheless, Perez et al. [15] observed a prevalence of 7%. The differences in detection of enteropathogens may be attributed to the different diagnostic methods used [24] , farm management practices exercised in different regions, hygienic status [8, 24] , environmental condition, and geographical locations (climate condition).",
            "cite_spans": [
                {
                    "start": 162,
                    "end": 166,
                    "text": "[19]",
                    "ref_id": "BIBREF19"
                },
                {
                    "start": 187,
                    "end": 191,
                    "text": "[17]",
                    "ref_id": "BIBREF17"
                },
                {
                    "start": 233,
                    "end": 237,
                    "text": "[20]",
                    "ref_id": "BIBREF20"
                },
                {
                    "start": 262,
                    "end": 265,
                    "text": "[2]",
                    "ref_id": "BIBREF1"
                },
                {
                    "start": 402,
                    "end": 406,
                    "text": "[21]",
                    "ref_id": "BIBREF21"
                },
                {
                    "start": 457,
                    "end": 461,
                    "text": "[22]",
                    "ref_id": "BIBREF22"
                },
                {
                    "start": 510,
                    "end": 513,
                    "text": "[4]",
                    "ref_id": "BIBREF3"
                },
                {
                    "start": 635,
                    "end": 639,
                    "text": "[13]",
                    "ref_id": "BIBREF13"
                },
                {
                    "start": 664,
                    "end": 668,
                    "text": "[14]",
                    "ref_id": "BIBREF14"
                },
                {
                    "start": 696,
                    "end": 700,
                    "text": "[16]",
                    "ref_id": "BIBREF16"
                },
                {
                    "start": 722,
                    "end": 726,
                    "text": "[12]",
                    "ref_id": "BIBREF12"
                },
                {
                    "start": 764,
                    "end": 768,
                    "text": "[23]",
                    "ref_id": "BIBREF23"
                },
                {
                    "start": 803,
                    "end": 807,
                    "text": "[15]",
                    "ref_id": "BIBREF15"
                },
                {
                    "start": 944,
                    "end": 948,
                    "text": "[24]",
                    "ref_id": "BIBREF24"
                },
                {
                    "start": 1025,
                    "end": 1028,
                    "text": "[8,",
                    "ref_id": "BIBREF8"
                },
                {
                    "start": 1029,
                    "end": 1032,
                    "text": "24]",
                    "ref_id": "BIBREF24"
                }
            ],
            "ref_spans": [],
            "section": "Discussion"
        },
        {
            "text": "No enteropathogens were detected in the 55 (67.07%) sample calves. Negative results may occur because some cases of diarrhea might not be associated with infectious agents, and probably due to nutritional or other management factors, or because other non-investigated pathogens were involved, such as many other enteric bacterial (E. coli F5 and other enteropathogenic E. coli, and Campylobacter etc.), parasite (Cryptosporidium parvum) and virus (calicivirus, torovirus etc.).",
            "cite_spans": [],
            "ref_spans": [],
            "section": "Discussion"
        },
        {
            "text": "Regarding age-group in this study, the frequency of infection is higher in age-group 22-30 d olds (44.44%). This age bracket is considered as the most susceptible to infection by BCoV (33.33%). While the frequency of infection by rotavirus is higher in age-group 8-14 d olds (30.77%), this age bracket is reported as the most susceptible to infection by rotavirus [2, 25] . The 2-and 4-week-old calves were the most susceptible to GARV and BCoV infections, which may be due to decreasing of passive immunity and the absence of the natural resistance against infection for both enteropathogens. The presence of BCoV infection in older calves (22) (23) (24) (25) (26) (27) (28) (29) (30) d) could be explained by the method of livestock farming of calves (using the grouping of the calves instead of individual stall). The 3-weeks-old calves are characterized by absence of GARV, this may be highlighted by an increased natural resistance against infection for this enteropathogen and small number of sample cooperated with 1 and 4 age-group, in spite of the absence of significant difference among the various age-groups.",
            "cite_spans": [
                {
                    "start": 364,
                    "end": 367,
                    "text": "[2,",
                    "ref_id": "BIBREF1"
                },
                {
                    "start": 368,
                    "end": 371,
                    "text": "25]",
                    "ref_id": "BIBREF25"
                },
                {
                    "start": 641,
                    "end": 645,
                    "text": "(22)",
                    "ref_id": "BIBREF22"
                },
                {
                    "start": 646,
                    "end": 650,
                    "text": "(23)",
                    "ref_id": "BIBREF23"
                },
                {
                    "start": 651,
                    "end": 655,
                    "text": "(24)",
                    "ref_id": "BIBREF24"
                },
                {
                    "start": 656,
                    "end": 660,
                    "text": "(25)",
                    "ref_id": "BIBREF25"
                },
                {
                    "start": 661,
                    "end": 665,
                    "text": "(26)",
                    "ref_id": "BIBREF26"
                },
                {
                    "start": 666,
                    "end": 670,
                    "text": "(27)",
                    "ref_id": "BIBREF27"
                },
                {
                    "start": 671,
                    "end": 675,
                    "text": "(28)",
                    "ref_id": null
                },
                {
                    "start": 676,
                    "end": 680,
                    "text": "(29)",
                    "ref_id": null
                },
                {
                    "start": 681,
                    "end": 685,
                    "text": "(30)",
                    "ref_id": null
                }
            ],
            "ref_spans": [],
            "section": "Discussion"
        },
        {
            "text": "The frequency of infection of the male (59.26%) is superior to the female (40.74%) for both enteropathogens. We can assume that the size of the male at birth induces dystocia, and consequently decrease colostrum absorption. The similar result is gathered by Clement et al [26] , who noticed that the sensibility of males for diarrhea was double compared to females. Whereas, in our study the percentage of the females affected by rotavirus is superior to males. The comparable result is recorded by Hosso and Pandey [27] , who revealed that among 23 calves positive for rotavirus, nine were males and 14 females.",
            "cite_spans": [
                {
                    "start": 272,
                    "end": 276,
                    "text": "[26]",
                    "ref_id": "BIBREF26"
                },
                {
                    "start": 516,
                    "end": 520,
                    "text": "[27]",
                    "ref_id": "BIBREF27"
                }
            ],
            "ref_spans": [],
            "section": "Discussion"
        },
        {
            "text": "The result of this study showed that both BCoV as well as GARV were involved in the neonatal calves diarrhea, though, the frequency of BCoV is higher in comparison with GARV. However, further investigations dealing with fecal samples analysis to identify the presence of other enteropathogens such as E. coli and Cryptosporidium are needed. Furthermore, the multifactorial etiology (bacterial, viral and protozoa agents) influenced by nutritional and environmental factors, as well as difficulties in the clinical diagnosis of neonatal diarrhea and failure of the treatment in young calves affected by diarrhea require to adopt the prophylactic measures such as hygiene, management and vaccination of dam cows by an immunization through the injection of either modified-live or inactivated vaccines. This will result in enhancement of antibody titres in the colostrum and milk of vaccinated cows for prevention of neonatal diarrhea caused by coronavirus and rotavirus.",
            "cite_spans": [],
            "ref_spans": [],
            "section": "Discussion"
        },
        {
            "text": "We declare that we have no conflict of interest. Sari Nassim and the entire staff of the Veterinary Regional Laboratory of Tlemcen (Algeria) for their collaboration during this study. My thanks also go to Mr Taibi Khaled and for the statistical analyses.",
            "cite_spans": [],
            "ref_spans": [],
            "section": "Conflict of interest statement"
        },
        {
            "text": "Background Diarrhea is one of the main causes of calf mortality, morbidity and economic losses worldwide in the cattle industry and it is a complex multifactorial disease involving animal, environmental, nutritional and infectious agents.",
            "cite_spans": [],
            "ref_spans": [],
            "section": "Comments"
        },
        {
            "text": "The object of the work is to evaluate the impact of these viral infectious agents in breeding farms in Western Algeria according to the clinical state and age distribution in younger dairy calves.",
            "cite_spans": [],
            "ref_spans": [],
            "section": "Research frontiers"
        },
        {
            "text": "Several techniques have been developed by detecting the viral particle (cell culture, electron microscopy, immune electron microscopy), viral protein (ELISA, latex agglutination, direct immunofluorescence), and viral genome (SS-PAGE, RT-PCR).",
            "cite_spans": [],
            "ref_spans": [],
            "section": "Related reports"
        },
        {
            "text": "In the scientific literature only few published information on the epidemiology of rota-coronavirus virus infection in neonatal calves in Algeria were available. In this paper the authors conducted a study to throw light on the prevalence of rotavirus and coronavirus associated with neonatal diarrhea in calves in Western Algeria by using an ELISA assay.",
            "cite_spans": [],
            "ref_spans": [],
            "section": "Innovations and breakthroughs"
        },
        {
            "text": "This report could provide useful information for epidemiological study of these viral infections in Western Algeria.",
            "cite_spans": [],
            "ref_spans": [],
            "section": "Applications"
        },
        {
            "text": "The frequency of rota-coronavirus virus infection is quite variable among different geographical regions, the production type (dairy or beef herds), and the diagnostic techniques used. In this case report, authors make an attempt to deals with the prevalence of GARV and BCoV associated with neonatal diarrhea in calves in Western Algeria.",
            "cite_spans": [],
            "ref_spans": [],
            "section": "Peer review"
        }
    ],
    "bib_entries": {
        "BIBREF0": {
            "ref_id": "b0",
            "title": "Comparison of electrocardiographic parameters and serum electrolytes and microelements between single infection of rotavirus and coronavirus and concurrent infection of Cryptosporidium parvum with rotavirus and coronavirus in diarrheic dairy calves",
            "authors": [
                {
                    "first": "J",
                    "middle": [],
                    "last": "Tajik",
                    "suffix": ""
                },
                {
                    "first": "S",
                    "middle": [],
                    "last": "Nazifi",
                    "suffix": ""
                },
                {
                    "first": "S",
                    "middle": [
                        "M"
                    ],
                    "last": "Naghib",
                    "suffix": ""
                },
                {
                    "first": "A",
                    "middle": [
                        "R"
                    ],
                    "last": "Ghasrodasht",
                    "suffix": ""
                }
            ],
            "year": 2012,
            "venue": "Comp Clin Pathol",
            "volume": "21",
            "issn": "",
            "pages": "241--244",
            "other_ids": {}
        },
        "BIBREF1": {
            "ref_id": "b1",
            "title": "Frequency of group A rotavirus in diarrhoeic calves in Brazilian cattle herds",
            "authors": [
                {
                    "first": "A",
                    "middle": [
                        "A"
                    ],
                    "last": "Alfieri",
                    "suffix": ""
                },
                {
                    "first": "M",
                    "middle": [
                        "E"
                    ],
                    "last": "Parazzi",
                    "suffix": ""
                },
                {
                    "first": "E",
                    "middle": [],
                    "last": "Takiuchi",
                    "suffix": ""
                },
                {
                    "first": "K",
                    "middle": [
                        "C"
                    ],
                    "last": "Medici",
                    "suffix": ""
                },
                {
                    "first": "A",
                    "middle": [
                        "F"
                    ],
                    "last": "Alfieri",
                    "suffix": ""
                }
            ],
            "year": 1998,
            "venue": "Trop Anim Health Prod",
            "volume": "38",
            "issn": "",
            "pages": "521--526",
            "other_ids": {}
        },
        "BIBREF2": {
            "ref_id": "b2",
            "title": "Factors associated with time to neonatal diarrhoea in French beef calves",
            "authors": [
                {
                    "first": "T",
                    "middle": [],
                    "last": "Lorino",
                    "suffix": ""
                },
                {
                    "first": "J",
                    "middle": [
                        "J"
                    ],
                    "last": "Daudin",
                    "suffix": ""
                },
                {
                    "first": "S",
                    "middle": [],
                    "last": "Robin",
                    "suffix": ""
                },
                {
                    "first": "M",
                    "middle": [],
                    "last": "Sanaa",
                    "suffix": ""
                }
            ],
            "year": 2005,
            "venue": "Prev Vet Med",
            "volume": "68",
            "issn": "",
            "pages": "91--102",
            "other_ids": {}
        },
        "BIBREF3": {
            "ref_id": "b3",
            "title": "The frequency of the shedding of Cryptosporidium parvum, F5 Escherichia coli, rotavirus, coronavirus and Salmonella spp. in young dairy calves in Mitidja area (Algeria)",
            "authors": [
                {
                    "first": "A",
                    "middle": [],
                    "last": "Akam",
                    "suffix": ""
                },
                {
                    "first": "D",
                    "middle": [],
                    "last": "Khelef",
                    "suffix": ""
                },
                {
                    "first": "R",
                    "middle": [],
                    "last": "Kaidi",
                    "suffix": ""
                },
                {
                    "first": "K",
                    "middle": [
                        "H"
                    ],
                    "last": "Rahal",
                    "suffix": ""
                },
                {
                    "first": "H",
                    "middle": [],
                    "last": "Tali-Maamar",
                    "suffix": ""
                },
                {
                    "first": "B",
                    "middle": [],
                    "last": "Yabrir",
                    "suffix": ""
                }
            ],
            "year": 2011,
            "venue": "Bull Univ Agric Sci Vet Med Cluj Napoca",
            "volume": "68",
            "issn": "",
            "pages": "16--25",
            "other_ids": {}
        },
        "BIBREF4": {
            "ref_id": "b4",
            "title": "Enteropathogens and risk factors for diarrhea in Norwegian dairy calves",
            "authors": [
                {
                    "first": "S",
                    "middle": [
                        "M"
                    ],
                    "last": "Gulliksen",
                    "suffix": ""
                },
                {
                    "first": "E",
                    "middle": [],
                    "last": "Jor",
                    "suffix": ""
                },
                {
                    "first": "K",
                    "middle": [
                        "I"
                    ],
                    "last": "Lie",
                    "suffix": ""
                },
                {
                    "first": "I",
                    "middle": [
                        "S"
                    ],
                    "last": "Hamnes",
                    "suffix": ""
                },
                {
                    "first": "T",
                    "middle": [],
                    "last": "Loken",
                    "suffix": ""
                },
                {
                    "first": "J",
                    "middle": [],
                    "last": "Akerstedt",
                    "suffix": ""
                }
            ],
            "year": 2009,
            "venue": "J Dairy Sci",
            "volume": "92",
            "issn": "",
            "pages": "5057--5066",
            "other_ids": {}
        },
        "BIBREF5": {
            "ref_id": "b5",
            "title": "Bovine coronavirus detection in a collection of diarrheic stool samples positive for group a bovine rotavirus",
            "authors": [
                {
                    "first": "A",
                    "middle": [
                        "F"
                    ],
                    "last": "Barry",
                    "suffix": ""
                },
                {
                    "first": "A",
                    "middle": [
                        "F"
                    ],
                    "last": "Alfieri",
                    "suffix": ""
                },
                {
                    "first": "D",
                    "middle": [
                        "T"
                    ],
                    "last": "Stipp",
                    "suffix": ""
                },
                {
                    "first": "A",
                    "middle": [
                        "A"
                    ],
                    "last": "Alfieri",
                    "suffix": ""
                }
            ],
            "year": 2009,
            "venue": "Braz Arch Biol Technol",
            "volume": "52",
            "issn": "",
            "pages": "45--49",
            "other_ids": {}
        },
        "BIBREF7": {
            "ref_id": "b7",
            "title": "Detection of bovine coronavirus and type A rotavirus in neonatal calf diarrhea and winter dysentery of cattle in Quebec: evaluation of three diagnostic methods",
            "authors": [
                {
                    "first": "S",
                    "middle": [],
                    "last": "Dulude",
                    "suffix": ""
                }
            ],
            "year": 1994,
            "venue": "Can Vet J",
            "volume": "35",
            "issn": "",
            "pages": "163--169",
            "other_ids": {}
        },
        "BIBREF8": {
            "ref_id": "b8",
            "title": "Evaluation of relationship between Rotavirus and Coronavirus infections with calf diarrhea by capture ELISA",
            "authors": [
                {
                    "first": "A",
                    "middle": [],
                    "last": "Mayameei",
                    "suffix": ""
                },
                {
                    "first": "G",
                    "middle": [],
                    "last": "Mohammadi",
                    "suffix": ""
                },
                {
                    "first": "S",
                    "middle": [],
                    "last": "Yavari",
                    "suffix": ""
                },
                {
                    "first": "E",
                    "middle": [],
                    "last": "Afshari",
                    "suffix": ""
                },
                {
                    "first": "A",
                    "middle": [],
                    "last": "Omidi",
                    "suffix": ""
                }
            ],
            "year": 2010,
            "venue": "Comp Clin Pathol",
            "volume": "19",
            "issn": "",
            "pages": "553--557",
            "other_ids": {}
        },
        "BIBREF9": {
            "ref_id": "b9",
            "title": "Bovin medicine diseases and husbandry of cattle",
            "authors": [
                {
                    "first": "P",
                    "middle": [
                        "R"
                    ],
                    "last": "Scott",
                    "suffix": ""
                },
                {
                    "first": "G",
                    "middle": [
                        "A"
                    ],
                    "last": "Hall",
                    "suffix": ""
                },
                {
                    "first": "P",
                    "middle": [
                        "W"
                    ],
                    "last": "Jones",
                    "suffix": ""
                },
                {
                    "first": "J",
                    "middle": [
                        "H"
                    ],
                    "last": "Morgan",
                    "suffix": ""
                }
            ],
            "year": 2004,
            "venue": "",
            "volume": "",
            "issn": "",
            "pages": "185--214",
            "other_ids": {}
        },
        "BIBREF10": {
            "ref_id": "b10",
            "title": "Frequency of BCoV detection by a semi-nested PCR assays in faeces of calves from Brazilian cattle herds",
            "authors": [
                {
                    "first": "D",
                    "middle": [
                        "T"
                    ],
                    "last": "Stipp",
                    "suffix": ""
                },
                {
                    "first": "A",
                    "middle": [
                        "F"
                    ],
                    "last": "Barry",
                    "suffix": ""
                },
                {
                    "first": "A",
                    "middle": [
                        "F"
                    ],
                    "last": "Alfieri",
                    "suffix": ""
                },
                {
                    "first": "E",
                    "middle": [],
                    "last": "Takiuchi",
                    "suffix": ""
                },
                {
                    "first": "A",
                    "middle": [
                        "M"
                    ],
                    "last": "Amude",
                    "suffix": ""
                },
                {
                    "first": "A",
                    "middle": [
                        "A"
                    ],
                    "last": "Alfieri",
                    "suffix": ""
                }
            ],
            "year": 2009,
            "venue": "Trop Anim Health Prod",
            "volume": "41",
            "issn": "",
            "pages": "1563--1567",
            "other_ids": {}
        },
        "BIBREF11": {
            "ref_id": "b11",
            "title": "Mixed infections by bovine coronavirus, rotavirus and Cryptosporidium parvum in an outbreak of neonatal diarrhea in beef cattle",
            "authors": [
                {
                    "first": "P",
                    "middle": [
                        "E"
                    ],
                    "last": "Brand\u00e3o",
                    "suffix": ""
                },
                {
                    "first": "L",
                    "middle": [
                        "Y"
                    ],
                    "last": "Villareal",
                    "suffix": ""
                },
                {
                    "first": "De",
                    "middle": [],
                    "last": "Souza",
                    "suffix": ""
                },
                {
                    "first": "S",
                    "middle": [
                        "L"
                    ],
                    "last": "Richtzenhain",
                    "suffix": ""
                },
                {
                    "first": "L",
                    "middle": [
                        "J"
                    ],
                    "last": "Jerez",
                    "suffix": ""
                },
                {
                    "first": "J",
                    "middle": [
                        "A"
                    ],
                    "last": "",
                    "suffix": ""
                }
            ],
            "year": 2007,
            "venue": "Arq Inst Biol (Sao Paulo)",
            "volume": "74",
            "issn": "",
            "pages": "33--34",
            "other_ids": {}
        },
        "BIBREF12": {
            "ref_id": "b12",
            "title": "Prevalence of major enteric pathogens in Australian dairy calves with diarrhoea",
            "authors": [
                {
                    "first": "M",
                    "middle": [
                        "M"
                    ],
                    "last": "Izzo",
                    "suffix": ""
                },
                {
                    "first": "P",
                    "middle": [
                        "D"
                    ],
                    "last": "Kirkland",
                    "suffix": ""
                },
                {
                    "first": "V",
                    "middle": [
                        "L"
                    ],
                    "last": "Mohler",
                    "suffix": ""
                },
                {
                    "first": "N",
                    "middle": [
                        "R"
                    ],
                    "last": "Perkins",
                    "suffix": ""
                },
                {
                    "first": "A",
                    "middle": [
                        "A"
                    ],
                    "last": "Gunn",
                    "suffix": ""
                },
                {
                    "first": "J",
                    "middle": [
                        "K"
                    ],
                    "last": "House",
                    "suffix": ""
                }
            ],
            "year": 2011,
            "venue": "Aust Vet J",
            "volume": "89",
            "issn": "",
            "pages": "167--173",
            "other_ids": {}
        },
        "BIBREF13": {
            "ref_id": "b13",
            "title": "Microbiology of calf diarrhoea in southern Britain",
            "authors": [
                {
                    "first": "D",
                    "middle": [
                        "J"
                    ],
                    "last": "Reynolds",
                    "suffix": ""
                },
                {
                    "first": "J",
                    "middle": [
                        "H"
                    ],
                    "last": "Morgan",
                    "suffix": ""
                },
                {
                    "first": "N",
                    "middle": [],
                    "last": "Chanter",
                    "suffix": ""
                },
                {
                    "first": "P",
                    "middle": [
                        "W"
                    ],
                    "last": "Jones",
                    "suffix": ""
                },
                {
                    "first": "J",
                    "middle": [
                        "C"
                    ],
                    "last": "Bridger",
                    "suffix": ""
                },
                {
                    "first": "T",
                    "middle": [
                        "G"
                    ],
                    "last": "Debney",
                    "suffix": ""
                }
            ],
            "year": 1986,
            "venue": "Vet Rec",
            "volume": "119",
            "issn": "",
            "pages": "34--39",
            "other_ids": {}
        },
        "BIBREF14": {
            "ref_id": "b14",
            "title": "Aetiology of diarrhea in young calves",
            "authors": [
                {
                    "first": "D",
                    "middle": [
                        "R"
                    ],
                    "last": "Snodgrass",
                    "suffix": ""
                },
                {
                    "first": "H",
                    "middle": [
                        "R"
                    ],
                    "last": "Terzolo",
                    "suffix": ""
                },
                {
                    "first": "D",
                    "middle": [],
                    "last": "Sherwood",
                    "suffix": ""
                },
                {
                    "first": "I",
                    "middle": [],
                    "last": "Campbell",
                    "suffix": ""
                },
                {
                    "first": "J",
                    "middle": [
                        "D"
                    ],
                    "last": "Menzies",
                    "suffix": ""
                },
                {
                    "first": "B",
                    "middle": [
                        "A"
                    ],
                    "last": "Synge",
                    "suffix": ""
                }
            ],
            "year": 1986,
            "venue": "Vet Rec",
            "volume": "119",
            "issn": "",
            "pages": "31--34",
            "other_ids": {}
        },
        "BIBREF15": {
            "ref_id": "b15",
            "title": "Infectious agents associated with diarrhoea of calves in the canton of Tilaran, Costa Rica",
            "authors": [
                {
                    "first": "E",
                    "middle": [],
                    "last": "Perez",
                    "suffix": ""
                },
                {
                    "first": "A",
                    "middle": [],
                    "last": "Kummeling",
                    "suffix": ""
                },
                {
                    "first": "M",
                    "middle": [
                        "M"
                    ],
                    "last": "Janssen",
                    "suffix": ""
                },
                {
                    "first": "C",
                    "middle": [],
                    "last": "Jimenez",
                    "suffix": ""
                },
                {
                    "first": "R",
                    "middle": [],
                    "last": "Alvarado",
                    "suffix": ""
                },
                {
                    "first": "M",
                    "middle": [],
                    "last": "Caballero",
                    "suffix": ""
                }
            ],
            "year": 1998,
            "venue": "Prev Vet Med",
            "volume": "33",
            "issn": "",
            "pages": "195--205",
            "other_ids": {}
        },
        "BIBREF16": {
            "ref_id": "b16",
            "title": "Proportionnal morbidity rates of enteropathogens among diarrheic dairy calves in central Spain",
            "authors": [
                {
                    "first": "R",
                    "middle": [],
                    "last": "De La Fuente",
                    "suffix": ""
                },
                {
                    "first": "A",
                    "middle": [],
                    "last": "Garcia",
                    "suffix": ""
                },
                {
                    "first": "J",
                    "middle": [
                        "A"
                    ],
                    "last": "Ruiz-Santa-Quiteria",
                    "suffix": ""
                },
                {
                    "first": "M",
                    "middle": [],
                    "last": "Luzon",
                    "suffix": ""
                },
                {
                    "first": "D",
                    "middle": [],
                    "last": "Cid",
                    "suffix": ""
                },
                {
                    "first": "S",
                    "middle": [],
                    "last": "Garcia",
                    "suffix": ""
                }
            ],
            "year": 1998,
            "venue": "Prev Vet Med",
            "volume": "36",
            "issn": "",
            "pages": "145--152",
            "other_ids": {}
        },
        "BIBREF17": {
            "ref_id": "b17",
            "title": "Prevalence of rota and coronavirus infections in calves of Barabanki and Raebareli districts of Uttar Pradesh",
            "authors": [
                {
                    "first": "R",
                    "middle": [
                        "B"
                    ],
                    "last": "Rai",
                    "suffix": ""
                },
                {
                    "first": "A",
                    "middle": [],
                    "last": "Hansha",
                    "suffix": ""
                },
                {
                    "first": "S",
                    "middle": [],
                    "last": "Rai",
                    "suffix": ""
                },
                {
                    "first": "B",
                    "middle": [],
                    "last": "Singh",
                    "suffix": ""
                },
                {
                    "first": "H",
                    "middle": [],
                    "last": "Kumar",
                    "suffix": ""
                },
                {
                    "first": "A",
                    "middle": [
                        "K"
                    ],
                    "last": "Singh",
                    "suffix": ""
                }
            ],
            "year": 2011,
            "venue": "Indian J Vet Pathol",
            "volume": "35",
            "issn": "",
            "pages": "73--74",
            "other_ids": {}
        },
        "BIBREF18": {
            "ref_id": "b18",
            "title": "Detection of corona virus antigen by ELISA from diarrhoeic cow calves in Mathura",
            "authors": [
                {
                    "first": "S",
                    "middle": [
                        "K"
                    ],
                    "last": "Dash",
                    "suffix": ""
                },
                {
                    "first": "K",
                    "middle": [],
                    "last": "Kumar",
                    "suffix": ""
                },
                {
                    "first": "A",
                    "middle": [],
                    "last": "Goel",
                    "suffix": ""
                },
                {
                    "first": "A",
                    "middle": [
                        "K"
                    ],
                    "last": "Bhatia",
                    "suffix": ""
                }
            ],
            "year": 2012,
            "venue": "India. Vet World",
            "volume": "5",
            "issn": "",
            "pages": "166--168",
            "other_ids": {}
        },
        "BIBREF19": {
            "ref_id": "b19",
            "title": "Agents associated with neonatal diarrhoea in Ethiopian dairy calves",
            "authors": [
                {
                    "first": "G",
                    "middle": [],
                    "last": "Abraham",
                    "suffix": ""
                },
                {
                    "first": "P",
                    "middle": [
                        "L"
                    ],
                    "last": "Roeder",
                    "suffix": ""
                },
                {
                    "first": "R",
                    "middle": [],
                    "last": "Zewdu",
                    "suffix": ""
                }
            ],
            "year": 1992,
            "venue": "Trop Anim Health Prod",
            "volume": "24",
            "issn": "",
            "pages": "74--80",
            "other_ids": {}
        },
        "BIBREF20": {
            "ref_id": "b20",
            "title": "Prevalence of rotaviral infection in diarrheic neonatal calves in Mosul city",
            "authors": [
                {
                    "first": "I",
                    "middle": [
                        "A"
                    ],
                    "last": "Al-Robaiee",
                    "suffix": ""
                },
                {
                    "first": "Al-Farwachi",
                    "middle": [],
                    "last": "",
                    "suffix": ""
                },
                {
                    "first": "M",
                    "middle": [
                        "I"
                    ],
                    "last": "",
                    "suffix": ""
                }
            ],
            "year": 2013,
            "venue": "Iraq. Vet World",
            "volume": "6",
            "issn": "",
            "pages": "538--540",
            "other_ids": {}
        },
        "BIBREF21": {
            "ref_id": "b21",
            "title": "Infectious agents associated with neonatal calf diarrhea in Tunisia",
            "authors": [
                {
                    "first": "M",
                    "middle": [],
                    "last": "Zrelli",
                    "suffix": ""
                },
                {
                    "first": "L",
                    "middle": [],
                    "last": "Messadi",
                    "suffix": ""
                },
                {
                    "first": "Ben",
                    "middle": [],
                    "last": "Miled",
                    "suffix": ""
                },
                {
                    "first": "L",
                    "middle": [],
                    "last": "Jemli",
                    "suffix": ""
                },
                {
                    "first": "M",
                    "middle": [
                        "H"
                    ],
                    "last": "Haddad",
                    "suffix": ""
                },
                {
                    "first": "N",
                    "middle": [],
                    "last": "",
                    "suffix": ""
                }
            ],
            "year": 1990,
            "venue": "Rev Med Vet",
            "volume": "141",
            "issn": "",
            "pages": "861--872",
            "other_ids": {}
        },
        "BIBREF22": {
            "ref_id": "b22",
            "title": "Contribution to the study of diarrhea etiology in neonate dairy calves in S\u00e2o Paulo state, Brazil",
            "authors": [
                {
                    "first": "H",
                    "middle": [],
                    "last": "Langoni",
                    "suffix": ""
                },
                {
                    "first": "A",
                    "middle": [
                        "C"
                    ],
                    "last": "Linhares",
                    "suffix": ""
                },
                {
                    "first": "De",
                    "middle": [],
                    "last": "Avila",
                    "suffix": ""
                },
                {
                    "first": "F",
                    "middle": [
                        "A"
                    ],
                    "last": "",
                    "suffix": ""
                },
                {
                    "first": "Da",
                    "middle": [],
                    "last": "Silva",
                    "suffix": ""
                },
                {
                    "first": "A",
                    "middle": [
                        "V"
                    ],
                    "last": "Elias",
                    "suffix": ""
                },
                {
                    "first": "A",
                    "middle": [
                        "O"
                    ],
                    "last": "",
                    "suffix": ""
                }
            ],
            "year": 2004,
            "venue": "Braz J Vet Res Anim Sci",
            "volume": "",
            "issn": "",
            "pages": "",
            "other_ids": {
                "DOI": [
                    "10.1590/S1413-95962004000500004"
                ]
            }
        },
        "BIBREF23": {
            "ref_id": "b23",
            "title": "The prevalence of rotavirus in neonatal calf diarrhoea, using electron microscopic examination",
            "authors": [
                {
                    "first": "F",
                    "middle": [],
                    "last": "Nourmohammadzadeh",
                    "suffix": ""
                },
                {
                    "first": "Y",
                    "middle": [],
                    "last": "Davoudi",
                    "suffix": ""
                },
                {
                    "first": "G",
                    "middle": [],
                    "last": "Abdollahpour",
                    "suffix": ""
                },
                {
                    "first": "A",
                    "middle": [],
                    "last": "Nouri",
                    "suffix": ""
                }
            ],
            "year": 2012,
            "venue": "Comp Clin Pathol",
            "volume": "21",
            "issn": "",
            "pages": "1231--1234",
            "other_ids": {}
        },
        "BIBREF24": {
            "ref_id": "b24",
            "title": "The studies on the aetiology of diarrhoea in neonatal calves and determination of virulence gene markers of Escherichia coli strains by multiplex PCR",
            "authors": [
                {
                    "first": "M",
                    "middle": [],
                    "last": "Ok",
                    "suffix": ""
                },
                {
                    "first": "L",
                    "middle": [],
                    "last": "Gu",
                    "suffix": ""
                },
                {
                    "first": "K",
                    "middle": [],
                    "last": "Turgut",
                    "suffix": ""
                },
                {
                    "first": "U",
                    "middle": [],
                    "last": "Ok",
                    "suffix": ""
                },
                {
                    "first": "I",
                    "middle": [],
                    "last": "Sen",
                    "suffix": ""
                },
                {
                    "first": "I",
                    "middle": [
                        "K"
                    ],
                    "last": "G\u00fcnd\u00fcz",
                    "suffix": ""
                }
            ],
            "year": 2009,
            "venue": "Zoonoses Public Health",
            "volume": "56",
            "issn": "",
            "pages": "94--101",
            "other_ids": {}
        },
        "BIBREF25": {
            "ref_id": "b25",
            "title": "Epidemiology of neonatal diarrhea caused by Escherichia coli and rotavirus in calves and lamb in Morocco",
            "authors": [
                {
                    "first": "M M",
                    "middle": [],
                    "last": "F Assi-Fehri",
                    "suffix": ""
                },
                {
                    "first": "D W",
                    "middle": [],
                    "last": "",
                    "suffix": ""
                },
                {
                    "first": "A",
                    "middle": [],
                    "last": "",
                    "suffix": ""
                },
                {
                    "first": "B",
                    "middle": [],
                    "last": "",
                    "suffix": ""
                },
                {
                    "first": "J",
                    "middle": [],
                    "last": "",
                    "suffix": ""
                }
            ],
            "year": 1988,
            "venue": "Vet Rech Ann",
            "volume": "19",
            "issn": "",
            "pages": "59--64",
            "other_ids": {}
        },
        "BIBREF26": {
            "ref_id": "b26",
            "title": "Use of epidemiologic principles to identificy risk factors associated with the development of diarrhea in calves in five beef herd",
            "authors": [
                {
                    "first": "J",
                    "middle": [
                        "C"
                    ],
                    "last": "Clement",
                    "suffix": ""
                },
                {
                    "first": "M",
                    "middle": [
                        "E"
                    ],
                    "last": "King",
                    "suffix": ""
                },
                {
                    "first": "M",
                    "middle": [
                        "D"
                    ],
                    "last": "Salman",
                    "suffix": ""
                },
                {
                    "first": "T",
                    "middle": [
                        "E"
                    ],
                    "last": "Wittum",
                    "suffix": ""
                },
                {
                    "first": "H",
                    "middle": [
                        "H"
                    ],
                    "last": "Casper",
                    "suffix": ""
                },
                {
                    "first": "K",
                    "middle": [
                        "G"
                    ],
                    "last": "Odde",
                    "suffix": ""
                }
            ],
            "year": 1995,
            "venue": "J Am Vet Med Assoc",
            "volume": "207",
            "issn": "",
            "pages": "1334--1338",
            "other_ids": {}
        },
        "BIBREF27": {
            "ref_id": "b27",
            "title": "Possible sex differences in the susceptibility of calves to rotavirus infection",
            "authors": [
                {
                    "first": "S",
                    "middle": [
                        "A"
                    ],
                    "last": "Hasso",
                    "suffix": ""
                },
                {
                    "first": "R",
                    "middle": [],
                    "last": "Pandey",
                    "suffix": ""
                }
            ],
            "year": 1986,
            "venue": "Can J Vet Res",
            "volume": "50",
            "issn": "",
            "pages": "287--288",
            "other_ids": {}
        }
    },
    "ref_entries": {
        "TABREF0": {
            "text": ", 16 and 27 calves were 8-14, 15-21 and 22-30 d old, respectively. BCoV was the dominant enteropathogen detected being present in 17 of 82 samples (20.73%). As mentioned in the Table 1, among the 17 positive samples, 15 calves (18.3%)",
            "latex": null,
            "type": "table"
        },
        "TABREF1": {
            "text": "Detection of BCoV and GARV in the studied diarrheic calves",
            "latex": null,
            "type": "table"
        },
        "TABREF2": {
            "text": "Prevalence of BCoV and GARV at different age group.All the four investigated age-groups were positive to the enteropathogens. Nevertheless, the 22-30 d old calves showed higher frequency (44.44%) to enteropathogen infection compared to the other three age-groups. In fact this group is highly sensitive to the coronavirus infection (33.33%) while the fewer occurrences were recorded in the age-group 15-21 d old. In the case of GARV infection, the age-group 8-14 d old presented the highest frequency (30.77%).",
            "latex": null,
            "type": "table"
        }
    },
    "back_matter": [
        {
            "text": "The authors would like to acknowledge the Laboratory of Research on Local Animal Products, Ibn-Khaldoun University of Tiaret, Algeria for the financial support. This work was supported in part by a grant from CNEPRU (I02320100012). The authors are also grateful to Dr Chaaban",
            "cite_spans": [],
            "ref_spans": [],
            "section": "Acknowledgements"
        }
    ]
}