{
    "paper_id": "PMC7088910",
    "metadata": {
        "title": "Sequence analysis of the leader RNA of two porcine coronaviruses: Transmissible gastroenteritis virus and porcine respiratory coronavirus",
        "authors": [
            {
                "first": "Kevin",
                "middle": [
                    "W."
                ],
                "last": "Page",
                "suffix": "",
                "email": null,
                "affiliation": {}
            },
            {
                "first": "Paul",
                "middle": [],
                "last": "Britton",
                "suffix": "",
                "email": null,
                "affiliation": {}
            },
            {
                "first": "Michael",
                "middle": [
                    "E.",
                    "G."
                ],
                "last": "Boursnell",
                "suffix": "",
                "email": null,
                "affiliation": {}
            }
        ]
    },
    "body_text": [],
    "ref_entries": {},
    "back_matter": [],
    "bib_entries": {
        "BIBREF0": {
            "title": "",
            "authors": [
                {
                    "first": "L.P.",
                    "middle": [],
                    "last": "Doyle",
                    "suffix": ""
                },
                {
                    "first": "L.M.",
                    "middle": [],
                    "last": "Hutchings",
                    "suffix": ""
                }
            ],
            "year": 1946,
            "venue": "J Am Vet Med Assoc",
            "volume": "108",
            "issn": "",
            "pages": "257-259",
            "other_ids": {
                "DOI": []
            }
        },
        "BIBREF1": {
            "title": "",
            "authors": [
                {
                    "first": "R.S.",
                    "middle": [],
                    "last": "Baric",
                    "suffix": ""
                },
                {
                    "first": "S.A.",
                    "middle": [],
                    "last": "Stohlman",
                    "suffix": ""
                },
                {
                    "first": "M.M.C.",
                    "middle": [],
                    "last": "Lai",
                    "suffix": ""
                }
            ],
            "year": 1983,
            "venue": "J Virol",
            "volume": "48",
            "issn": "",
            "pages": "633-640",
            "other_ids": {
                "DOI": []
            }
        },
        "BIBREF2": {
            "title": "",
            "authors": [
                {
                    "first": "S.",
                    "middle": [],
                    "last": "Makino",
                    "suffix": ""
                },
                {
                    "first": "S.A.",
                    "middle": [],
                    "last": "Stohlman",
                    "suffix": ""
                },
                {
                    "first": "M.M.C.",
                    "middle": [],
                    "last": "Lai",
                    "suffix": ""
                }
            ],
            "year": 1986,
            "venue": "Proc Natl Acad Sci USA",
            "volume": "83",
            "issn": "",
            "pages": "4202-4208",
            "other_ids": {
                "DOI": []
            }
        },
        "BIBREF3": {
            "title": "",
            "authors": [
                {
                    "first": "C.J.",
                    "middle": [],
                    "last": "Budzilowicz",
                    "suffix": ""
                },
                {
                    "first": "S.P.",
                    "middle": [],
                    "last": "Wilczynski",
                    "suffix": ""
                },
                {
                    "first": "S.R.",
                    "middle": [],
                    "last": "Weiss",
                    "suffix": ""
                }
            ],
            "year": 1985,
            "venue": "J Virol",
            "volume": "53",
            "issn": "",
            "pages": "834-840",
            "other_ids": {
                "DOI": []
            }
        },
        "BIBREF4": {
            "title": "",
            "authors": [
                {
                    "first": "C.-K.",
                    "middle": [],
                    "last": "Shieh",
                    "suffix": ""
                },
                {
                    "first": "L.H.",
                    "middle": [],
                    "last": "Soe",
                    "suffix": ""
                },
                {
                    "first": "S.",
                    "middle": [],
                    "last": "Makino",
                    "suffix": ""
                },
                {
                    "first": "M.-F.",
                    "middle": [],
                    "last": "Chang",
                    "suffix": ""
                },
                {
                    "first": "S.A.",
                    "middle": [],
                    "last": "Stohlman",
                    "suffix": ""
                },
                {
                    "first": "M.M.C.",
                    "middle": [],
                    "last": "Lai",
                    "suffix": ""
                }
            ],
            "year": 1987,
            "venue": "Virology",
            "volume": "156",
            "issn": "",
            "pages": "321-330",
            "other_ids": {
                "DOI": []
            }
        },
        "BIBREF5": {
            "title": "",
            "authors": [
                {
                    "first": "S.",
                    "middle": [],
                    "last": "Makino",
                    "suffix": ""
                },
                {
                    "first": "L.H.",
                    "middle": [],
                    "last": "Soe",
                    "suffix": ""
                },
                {
                    "first": "C.-K.",
                    "middle": [],
                    "last": "Shieh",
                    "suffix": ""
                },
                {
                    "first": "M.M.C.",
                    "middle": [],
                    "last": "Lai",
                    "suffix": ""
                }
            ],
            "year": 1988,
            "venue": "J Virol",
            "volume": "62",
            "issn": "",
            "pages": "3870-3873",
            "other_ids": {
                "DOI": []
            }
        },
        "BIBREF6": {
            "title": "",
            "authors": [
                {
                    "first": "P.",
                    "middle": [],
                    "last": "Britton",
                    "suffix": ""
                },
                {
                    "first": "R.S.",
                    "middle": [],
                    "last": "Carmenes",
                    "suffix": ""
                },
                {
                    "first": "K.W.",
                    "middle": [],
                    "last": "Page",
                    "suffix": ""
                },
                {
                    "first": "D.J.",
                    "middle": [],
                    "last": "Garwes",
                    "suffix": ""
                },
                {
                    "first": "F.",
                    "middle": [],
                    "last": "Parra",
                    "suffix": ""
                }
            ],
            "year": 1988,
            "venue": "Mol Microbiol",
            "volume": "2",
            "issn": "",
            "pages": "89-99",
            "other_ids": {
                "DOI": []
            }
        },
        "BIBREF7": {
            "title": "",
            "authors": [
                {
                    "first": "P.",
                    "middle": [],
                    "last": "Britton",
                    "suffix": ""
                },
                {
                    "first": "R.S.",
                    "middle": [],
                    "last": "Carmenes",
                    "suffix": ""
                },
                {
                    "first": "K.W.",
                    "middle": [],
                    "last": "Page",
                    "suffix": ""
                },
                {
                    "first": "D.J.",
                    "middle": [],
                    "last": "Garwes",
                    "suffix": ""
                }
            ],
            "year": 1988,
            "venue": "Mol Microbiol",
            "volume": "2",
            "issn": "",
            "pages": "497-505",
            "other_ids": {
                "DOI": []
            }
        },
        "BIBREF8": {
            "title": "",
            "authors": [
                {
                    "first": "P.",
                    "middle": [],
                    "last": "Britton",
                    "suffix": ""
                },
                {
                    "first": "C.",
                    "middle": [],
                    "last": "Lopez Otin",
                    "suffix": ""
                },
                {
                    "first": "J.M.",
                    "middle": [],
                    "last": "Martin Alonso",
                    "suffix": ""
                },
                {
                    "first": "F.",
                    "middle": [],
                    "last": "Parra",
                    "suffix": ""
                }
            ],
            "year": 1989,
            "venue": "Arch Virol",
            "volume": "105",
            "issn": "",
            "pages": "165-178",
            "other_ids": {
                "DOI": []
            }
        },
        "BIBREF9": {
            "title": "",
            "authors": [
                {
                    "first": "P.A.",
                    "middle": [],
                    "last": "Kapke",
                    "suffix": ""
                },
                {
                    "first": "D.A.",
                    "middle": [],
                    "last": "Brian",
                    "suffix": ""
                }
            ],
            "year": 1986,
            "venue": "Virology",
            "volume": "151",
            "issn": "",
            "pages": "41-49",
            "other_ids": {
                "DOI": []
            }
        },
        "BIBREF10": {
            "title": "",
            "authors": [
                {
                    "first": "D.",
                    "middle": [],
                    "last": "Rasschaert",
                    "suffix": ""
                },
                {
                    "first": "B.",
                    "middle": [],
                    "last": "Delmas",
                    "suffix": ""
                },
                {
                    "first": "B.",
                    "middle": [],
                    "last": "Charley",
                    "suffix": ""
                },
                {
                    "first": "J.",
                    "middle": [],
                    "last": "Grossclaude",
                    "suffix": ""
                },
                {
                    "first": "J.",
                    "middle": [],
                    "last": "Gelfi",
                    "suffix": ""
                },
                {
                    "first": "H.",
                    "middle": [],
                    "last": "Laude",
                    "suffix": ""
                }
            ],
            "year": 1987,
            "venue": "Coronaviruses. Adv Exp Med Biol, Vol. 218",
            "volume": "",
            "issn": "",
            "pages": "109-116",
            "other_ids": {
                "DOI": []
            }
        },
        "BIBREF11": {
            "title": "",
            "authors": [
                {
                    "first": "M.B.",
                    "middle": [],
                    "last": "Pensaert",
                    "suffix": ""
                },
                {
                    "first": "P.E.",
                    "middle": [],
                    "last": "Callebaut",
                    "suffix": ""
                },
                {
                    "first": "",
                    "middle": [],
                    "last": "Vergote",
                    "suffix": ""
                }
            ],
            "year": 1986,
            "venue": "J., Vet Q",
            "volume": "8",
            "issn": "",
            "pages": "257-260",
            "other_ids": {
                "DOI": []
            }
        },
        "BIBREF12": {
            "title": "",
            "authors": [
                {
                    "first": "D.",
                    "middle": [],
                    "last": "Rasschaert",
                    "suffix": ""
                },
                {
                    "first": "J.",
                    "middle": [],
                    "last": "Gelfi",
                    "suffix": ""
                },
                {
                    "first": "H.",
                    "middle": [],
                    "last": "Laude",
                    "suffix": ""
                }
            ],
            "year": 1987,
            "venue": "Biochimie",
            "volume": "69",
            "issn": "",
            "pages": "591-600",
            "other_ids": {
                "DOI": []
            }
        },
        "BIBREF13": {
            "title": "",
            "authors": [
                {
                    "first": "P.",
                    "middle": [],
                    "last": "Britton",
                    "suffix": ""
                },
                {
                    "first": "D.J.",
                    "middle": [],
                    "last": "Garwes",
                    "suffix": ""
                },
                {
                    "first": "K.",
                    "middle": [],
                    "last": "Page",
                    "suffix": ""
                },
                {
                    "first": "J.",
                    "middle": [],
                    "last": "Walmsley",
                    "suffix": ""
                }
            ],
            "year": 1987,
            "venue": "Coronaviruses. Adv Exp Med Biol., Vol. 218",
            "volume": "",
            "issn": "",
            "pages": "55-64",
            "other_ids": {
                "DOI": []
            }
        },
        "BIBREF14": {
            "title": "",
            "authors": [
                {
                    "first": "T.",
                    "middle": [],
                    "last": "Maniatis",
                    "suffix": ""
                },
                {
                    "first": "E.F.",
                    "middle": [],
                    "last": "Fritsch",
                    "suffix": ""
                },
                {
                    "first": "J.",
                    "middle": [],
                    "last": "Sambrook",
                    "suffix": ""
                }
            ],
            "year": 1982,
            "venue": "Molecular Cloning: A Laboratory Manual",
            "volume": "",
            "issn": "",
            "pages": null,
            "other_ids": {
                "DOI": []
            }
        },
        "BIBREF15": {
            "title": "",
            "authors": [
                {
                    "first": "M.D.",
                    "middle": [],
                    "last": "Biggin",
                    "suffix": ""
                },
                {
                    "first": "T.J.",
                    "middle": [],
                    "last": "Gibson",
                    "suffix": ""
                },
                {
                    "first": "G.F.",
                    "middle": [],
                    "last": "Hong",
                    "suffix": ""
                }
            ],
            "year": 1983,
            "venue": "Proc Natl Acad Sci USA",
            "volume": "80",
            "issn": "",
            "pages": "3963-3965",
            "other_ids": {
                "DOI": []
            }
        },
        "BIBREF16": {
            "title": "",
            "authors": [
                {
                    "first": "A.M.",
                    "middle": [],
                    "last": "Maxam",
                    "suffix": ""
                },
                {
                    "first": "W.",
                    "middle": [],
                    "last": "Gilbert",
                    "suffix": ""
                }
            ],
            "year": 1980,
            "venue": "Methods Enzymol",
            "volume": "65",
            "issn": "",
            "pages": "499-560",
            "other_ids": {
                "DOI": []
            }
        },
        "BIBREF17": {
            "title": "",
            "authors": [
                {
                    "first": "M.E.G.",
                    "middle": [],
                    "last": "Boursnell",
                    "suffix": ""
                },
                {
                    "first": "T.D.K.",
                    "middle": [],
                    "last": "Brown",
                    "suffix": ""
                },
                {
                    "first": "I.J.",
                    "middle": [],
                    "last": "Foulds",
                    "suffix": ""
                },
                {
                    "first": "P.F.",
                    "middle": [],
                    "last": "Green",
                    "suffix": ""
                },
                {
                    "first": "F.M.",
                    "middle": [],
                    "last": "Tomely",
                    "suffix": ""
                },
                {
                    "first": "M.M.",
                    "middle": [],
                    "last": "Binns",
                    "suffix": ""
                }
            ],
            "year": 1987,
            "venue": "J Gen Virol",
            "volume": "68",
            "issn": "",
            "pages": "57-77",
            "other_ids": {
                "DOI": []
            }
        },
        "BIBREF18": {
            "title": "",
            "authors": [
                {
                    "first": "M.I.",
                    "middle": [],
                    "last": "Kanehisa",
                    "suffix": ""
                }
            ],
            "year": 1982,
            "venue": "Nucleic Acids Res",
            "volume": "10",
            "issn": "",
            "pages": "183-196",
            "other_ids": {
                "DOI": []
            }
        },
        "BIBREF19": {
            "title": "",
            "authors": [
                {
                    "first": "M.",
                    "middle": [],
                    "last": "Zuker",
                    "suffix": ""
                },
                {
                    "first": "P.",
                    "middle": [],
                    "last": "Stiegler",
                    "suffix": ""
                }
            ],
            "year": 1981,
            "venue": "Nucleic Acids Res",
            "volume": "9",
            "issn": "",
            "pages": "133-148",
            "other_ids": {
                "DOI": []
            }
        },
        "BIBREF20": {
            "title": "",
            "authors": [
                {
                    "first": "J.",
                    "middle": [],
                    "last": "Devereux",
                    "suffix": ""
                },
                {
                    "first": "P.",
                    "middle": [],
                    "last": "Haeberli",
                    "suffix": ""
                },
                {
                    "first": "O.",
                    "middle": [],
                    "last": "Smithies",
                    "suffix": ""
                }
            ],
            "year": 1984,
            "venue": "Nucleic Acids Res",
            "volume": "12",
            "issn": "",
            "pages": "387-395",
            "other_ids": {
                "DOI": []
            }
        },
        "BIBREF21": {
            "title": "",
            "authors": [
                {
                    "first": "D.J.",
                    "middle": [],
                    "last": "Garwes",
                    "suffix": ""
                },
                {
                    "first": "F.",
                    "middle": [],
                    "last": "Stewart",
                    "suffix": ""
                },
                {
                    "first": "S.F.",
                    "middle": [],
                    "last": "Cartwright",
                    "suffix": ""
                },
                {
                    "first": "I.",
                    "middle": [],
                    "last": "Brown",
                    "suffix": ""
                }
            ],
            "year": 1988,
            "venue": "Vet Rec",
            "volume": "122",
            "issn": "",
            "pages": "86-87",
            "other_ids": {
                "DOI": []
            }
        },
        "BIBREF22": {
            "title": "",
            "authors": [
                {
                    "first": "I.",
                    "middle": [],
                    "last": "Brown",
                    "suffix": ""
                },
                {
                    "first": "S.",
                    "middle": [],
                    "last": "Cartwright",
                    "suffix": ""
                }
            ],
            "year": 1986,
            "venue": "Vet Rec",
            "volume": "119",
            "issn": "",
            "pages": "282-283",
            "other_ids": {
                "DOI": []
            }
        },
        "BIBREF23": {
            "title": "",
            "authors": [
                {
                    "first": "P.",
                    "middle": [],
                    "last": "Callebaut",
                    "suffix": ""
                },
                {
                    "first": "I.",
                    "middle": [],
                    "last": "Correa",
                    "suffix": ""
                },
                {
                    "first": "M.",
                    "middle": [],
                    "last": "Pensaert",
                    "suffix": ""
                },
                {
                    "first": "G.",
                    "middle": [],
                    "last": "Jimenez",
                    "suffix": ""
                },
                {
                    "first": "L.",
                    "middle": [],
                    "last": "Enjuanes",
                    "suffix": ""
                }
            ],
            "year": 1988,
            "venue": "J Gen Virol",
            "volume": "69",
            "issn": "",
            "pages": "1725-1730",
            "other_ids": {
                "DOI": []
            }
        },
        "BIBREF24": {
            "title": "",
            "authors": [
                {
                    "first": "S.S.",
                    "middle": [],
                    "last": "Schreiber",
                    "suffix": ""
                },
                {
                    "first": "T.",
                    "middle": [],
                    "last": "Kamahora",
                    "suffix": ""
                },
                {
                    "first": "M.M.C.",
                    "middle": [],
                    "last": "Lai",
                    "suffix": ""
                }
            ],
            "year": 1989,
            "venue": "Virology",
            "volume": "169",
            "issn": "",
            "pages": "142-151",
            "other_ids": {
                "DOI": []
            }
        },
        "BIBREF25": {
            "title": "",
            "authors": [
                {
                    "first": "S.S.",
                    "middle": [],
                    "last": "Stohlman",
                    "suffix": ""
                },
                {
                    "first": "R.S.",
                    "middle": [],
                    "last": "Baric",
                    "suffix": ""
                },
                {
                    "first": "G.N.",
                    "middle": [],
                    "last": "Nelson",
                    "suffix": ""
                },
                {
                    "first": "L.H.",
                    "middle": [],
                    "last": "Soe",
                    "suffix": ""
                },
                {
                    "first": "L.M.",
                    "middle": [],
                    "last": "Welter",
                    "suffix": ""
                },
                {
                    "first": "R.J.",
                    "middle": [],
                    "last": "Deans",
                    "suffix": ""
                }
            ],
            "year": 1988,
            "venue": "J. Virol",
            "volume": "62",
            "issn": "",
            "pages": "4288-4295",
            "other_ids": {
                "DOI": []
            }
        },
        "BIBREF26": {
            "title": "",
            "authors": [
                {
                    "first": "R.S.",
                    "middle": [],
                    "last": "Baric",
                    "suffix": ""
                },
                {
                    "first": "G.W.",
                    "middle": [],
                    "last": "Nelson",
                    "suffix": ""
                },
                {
                    "first": "J.O.",
                    "middle": [],
                    "last": "Fleming",
                    "suffix": ""
                },
                {
                    "first": "R.J.",
                    "middle": [],
                    "last": "Deans",
                    "suffix": ""
                },
                {
                    "first": "J.G.",
                    "middle": [],
                    "last": "Keck",
                    "suffix": ""
                },
                {
                    "first": "N.",
                    "middle": [],
                    "last": "Casteel",
                    "suffix": ""
                },
                {
                    "first": "S.",
                    "middle": [],
                    "last": "Stohlman",
                    "suffix": ""
                }
            ],
            "year": 1988,
            "venue": "J Virol",
            "volume": "62",
            "issn": "",
            "pages": "4280-4287",
            "other_ids": {
                "DOI": []
            }
        },
        "BIBREF27": {
            "title": "",
            "authors": [],
            "year": null,
            "venue": "",
            "volume": "",
            "issn": "",
            "pages": null,
            "other_ids": {
                "DOI": []
            }
        },
        "BIBREF28": {
            "title": "",
            "authors": [
                {
                    "first": "T.",
                    "middle": [],
                    "last": "Kamahora",
                    "suffix": ""
                },
                {
                    "first": "L.H.",
                    "middle": [],
                    "last": "Soe",
                    "suffix": ""
                },
                {
                    "first": "M.M.C.",
                    "middle": [],
                    "last": "Lai",
                    "suffix": ""
                }
            ],
            "year": 1989,
            "venue": "Virus Res",
            "volume": "12",
            "issn": "",
            "pages": "1-9",
            "other_ids": {
                "DOI": []
            }
        },
        "BIBREF29": {
            "title": "",
            "authors": [
                {
                    "first": "M.B.",
                    "middle": [],
                    "last": "Pensaert",
                    "suffix": ""
                }
            ],
            "year": 1989,
            "venue": "Virus Infections of Vertebrates, Vol. 2",
            "volume": "",
            "issn": "",
            "pages": "154-165",
            "other_ids": {
                "DOI": []
            }
        },
        "BIBREF30": {
            "title": "",
            "authors": [
                {
                    "first": "M.M.C.",
                    "middle": [],
                    "last": "Lai",
                    "suffix": ""
                },
                {
                    "first": "C.D.",
                    "middle": [],
                    "last": "Patton",
                    "suffix": ""
                },
                {
                    "first": "S.A.",
                    "middle": [],
                    "last": "Stohlman",
                    "suffix": ""
                }
            ],
            "year": 1982,
            "venue": "J Virol",
            "volume": "41",
            "issn": "",
            "pages": "557-565",
            "other_ids": {
                "DOI": []
            }
        },
        "BIBREF31": {
            "title": "",
            "authors": [
                {
                    "first": "M.M.C.",
                    "middle": [],
                    "last": "Lai",
                    "suffix": ""
                },
                {
                    "first": "C.D.",
                    "middle": [],
                    "last": "Patton",
                    "suffix": ""
                },
                {
                    "first": "R.S.",
                    "middle": [],
                    "last": "Baric",
                    "suffix": ""
                },
                {
                    "first": "S.A.",
                    "middle": [],
                    "last": "Stohlman",
                    "suffix": ""
                }
            ],
            "year": 1983,
            "venue": "J Virol",
            "volume": "46",
            "issn": "",
            "pages": "1027-1033",
            "other_ids": {
                "DOI": []
            }
        },
        "BIBREF32": {
            "title": "",
            "authors": [
                {
                    "first": "M.M.C.",
                    "middle": [],
                    "last": "Lai",
                    "suffix": ""
                },
                {
                    "first": "R.S.",
                    "middle": [],
                    "last": "Baric",
                    "suffix": ""
                },
                {
                    "first": "P.R.",
                    "middle": [],
                    "last": "Brayton",
                    "suffix": ""
                },
                {
                    "first": "S.A.",
                    "middle": [],
                    "last": "Stohlman",
                    "suffix": ""
                }
            ],
            "year": 1984,
            "venue": "Proc Natl Acad Sci USA",
            "volume": "81",
            "issn": "",
            "pages": "3626-3630",
            "other_ids": {
                "DOI": []
            }
        },
        "BIBREF33": {
            "title": "",
            "authors": [
                {
                    "first": "W.J.M.",
                    "middle": [],
                    "last": "Spaan",
                    "suffix": ""
                },
                {
                    "first": "H.",
                    "middle": [],
                    "last": "Delius",
                    "suffix": ""
                },
                {
                    "first": "M.",
                    "middle": [],
                    "last": "Skinner",
                    "suffix": ""
                },
                {
                    "first": "J.",
                    "middle": [],
                    "last": "Armstrong",
                    "suffix": ""
                },
                {
                    "first": "P.",
                    "middle": [],
                    "last": "Rottier",
                    "suffix": ""
                },
                {
                    "first": "S.",
                    "middle": [],
                    "last": "Smeekens",
                    "suffix": ""
                },
                {
                    "first": "B.A.M.",
                    "middle": [],
                    "last": "van der Zeijst",
                    "suffix": ""
                },
                {
                    "first": "S.G.",
                    "middle": [],
                    "last": "Siddell",
                    "suffix": ""
                }
            ],
            "year": 1983,
            "venue": "EMBO J",
            "volume": "2",
            "issn": "",
            "pages": "1839-1844",
            "other_ids": {
                "DOI": []
            }
        },
        "BIBREF34": {
            "title": "",
            "authors": [
                {
                    "first": "T.D.K.",
                    "middle": [],
                    "last": "Brown",
                    "suffix": ""
                },
                {
                    "first": "M.E.G.",
                    "middle": [],
                    "last": "Boursnell",
                    "suffix": ""
                },
                {
                    "first": "M.M.",
                    "middle": [],
                    "last": "Binns",
                    "suffix": ""
                }
            ],
            "year": 1984,
            "venue": "J Gen Virol",
            "volume": "65",
            "issn": "",
            "pages": "1437-1442",
            "other_ids": {
                "DOI": []
            }
        }
    }
}