{
    "paper_id": "0581de6374d58ca6d8d900063b9bbebf66ea54fd",
    "metadata": {
        "title": "Clinical Infectious Diseases Human Metapneumovirus Infections Following Hematopoietic Cell Transplantation: Factors Associated With Disease Progression",
        "authors": [
            {
                "first": "Sachiko",
                "middle": [],
                "last": "Seo",
                "suffix": "",
                "affiliation": {
                    "laboratory": "",
                    "institution": "Fred Hutchinson Cancer Research Center",
                    "location": {
                        "settlement": "Seattle, Washington"
                    }
                },
                "email": ""
            },
            {
                "first": "Ted",
                "middle": [
                    "A"
                ],
                "last": "Gooley",
                "suffix": "",
                "affiliation": {
                    "laboratory": "",
                    "institution": "Fred Hutchinson Cancer Research Center",
                    "location": {}
                },
                "email": ""
            },
            {
                "first": "Jane",
                "middle": [
                    "M"
                ],
                "last": "Kuypers",
                "suffix": "",
                "affiliation": {
                    "laboratory": "",
                    "institution": "Fred Hutchinson Cancer Research Center",
                    "location": {
                        "settlement": "Seattle, Washington"
                    }
                },
                "email": ""
            },
            {
                "first": "Zachary",
                "middle": [],
                "last": "Stednick",
                "suffix": "",
                "affiliation": {
                    "laboratory": "",
                    "institution": "Fred Hutchinson Cancer Research Center",
                    "location": {
                        "settlement": "Seattle, Washington"
                    }
                },
                "email": ""
            },
            {
                "first": "Keith",
                "middle": [
                    "R"
                ],
                "last": "Jerome",
                "suffix": "",
                "affiliation": {
                    "laboratory": "",
                    "institution": "Fred Hutchinson Cancer Research Center",
                    "location": {
                        "settlement": "Seattle, Washington"
                    }
                },
                "email": ""
            },
            {
                "first": "Janet",
                "middle": [
                    "A"
                ],
                "last": "Englund",
                "suffix": "",
                "affiliation": {
                    "laboratory": "",
                    "institution": "University of Washington",
                    "location": {}
                },
                "email": ""
            },
            {
                "first": "Michael",
                "middle": [],
                "last": "Boeckh",
                "suffix": "",
                "affiliation": {
                    "laboratory": "",
                    "institution": "Fred Hutchinson Cancer Research Center",
                    "location": {
                        "settlement": "Seattle, Washington"
                    }
                },
                "email": ""
            }
        ]
    },
    "abstract": [
        {
            "text": "Background. Human metapneumovirus (HMPV) is a newly identified pulmonary pathogen that can cause fatal lower respiratory tract disease (LRD) in hematopoietic cell transplantation (HCT) recipients. Little is known about progression rates from upper respiratory tract infection (URI) to LRD and risk factors associated with progression.",
            "cite_spans": [],
            "ref_spans": [],
            "section": "Abstract"
        },
        {
            "text": "Methods. A total of 118 HCT recipients receiving transplantation between 2004 and 2014 who had HMPV detected in nasopharyngeal, bronchoalveolar lavage, or lung biopsy samples by real-time reverse transcription polymerase chain reaction were retrospectively analyzed.",
            "cite_spans": [],
            "ref_spans": [],
            "section": "Abstract"
        },
        {
            "text": "Results. More than 90% of the cases were identified between December and May. Among the 118 HCT patients, 88 and 30 had URI alone and LRD, respectively. Among 30 patients with LRD, 17 patients progressed from URI to LRD after a median of 7 days (range, 2-63 days). The probability of progression to LRD within 40 days after URI was 16%. In Cox regression analysis, steroid use \u22651 mg/kg prior to URI diagnosis (hazard ratio [HR], 5.10; P = .004), low lymphocyte count (HR, 3.43; P = .011), and early onset of HMPV infection after HCT (before day 30 after HCT; HR, 3.54; P = .013) were associated with higher progression to LRD. The median viral load in nasal wash samples was 1.1 \u00d7 10 6 copies/mL (range, 3.3 \u00d7 10 2 -1.7 \u00d7 10 9 ) with no correlation between the viral load and progression.",
            "cite_spans": [],
            "ref_spans": [],
            "section": "Abstract"
        },
        {
            "text": "Conclusions. Progression from URI to LRD occurred in up to 60% of HCT recipients with risk factors such as systemic corticosteroid use or low lymphocyte counts. Further studies are needed to define the role of viral load in the pathogenesis of progressive disease.",
            "cite_spans": [],
            "ref_spans": [],
            "section": "Abstract"
        }
    ],
    "body_text": [
        {
            "text": "Human metapneumovirus (HMPV) is a newly recognized respiratory pathogen first identified in 2001 [1] and is structurally similar to respiratory syncytial virus (RSV) [2] . Serological epidemiology shows a 90% exposure by adulthood [3] . HMPV infection occurs in approximately 5% of hematopoietic cell transplantation (HCT) recipients [4, 5] , and can cause severe or sometimes fatal lower respiratory tract disease (LRD) [6] [7] [8] [9] . The mortality rate after HMPV LRD in patients with hematological malignancy or HCT recipients ranges from 10% to 40% [9] [10] [11] [12] . To date, most studies in HCT recipients are very small and have focused on the LRD characteristics and outcome [7, 8, 10, 12] . Minimal data exist on the timing of, proportion of, and risk factors for progression from upper respiratory tract infection (URI) to LRD. These data are critical for the design of clinical trials that aim to prevent progression from URI to LRD. The purpose of this study was to examine the seasonality of HMPV infections in HCT recipients and to identify patient, transplantation, and viral risk factors for progression to LRD.",
            "cite_spans": [
                {
                    "start": 97,
                    "end": 100,
                    "text": "[1]",
                    "ref_id": "BIBREF0"
                },
                {
                    "start": 166,
                    "end": 169,
                    "text": "[2]",
                    "ref_id": "BIBREF1"
                },
                {
                    "start": 231,
                    "end": 234,
                    "text": "[3]",
                    "ref_id": "BIBREF2"
                },
                {
                    "start": 334,
                    "end": 337,
                    "text": "[4,",
                    "ref_id": "BIBREF3"
                },
                {
                    "start": 338,
                    "end": 340,
                    "text": "5]",
                    "ref_id": "BIBREF4"
                },
                {
                    "start": 421,
                    "end": 424,
                    "text": "[6]",
                    "ref_id": "BIBREF5"
                },
                {
                    "start": 425,
                    "end": 428,
                    "text": "[7]",
                    "ref_id": "BIBREF6"
                },
                {
                    "start": 429,
                    "end": 432,
                    "text": "[8]",
                    "ref_id": "BIBREF7"
                },
                {
                    "start": 433,
                    "end": 436,
                    "text": "[9]",
                    "ref_id": "BIBREF8"
                },
                {
                    "start": 556,
                    "end": 559,
                    "text": "[9]",
                    "ref_id": "BIBREF8"
                },
                {
                    "start": 560,
                    "end": 564,
                    "text": "[10]",
                    "ref_id": "BIBREF9"
                },
                {
                    "start": 565,
                    "end": 569,
                    "text": "[11]",
                    "ref_id": "BIBREF10"
                },
                {
                    "start": 570,
                    "end": 574,
                    "text": "[12]",
                    "ref_id": "BIBREF11"
                },
                {
                    "start": 688,
                    "end": 691,
                    "text": "[7,",
                    "ref_id": "BIBREF6"
                },
                {
                    "start": 692,
                    "end": 694,
                    "text": "8,",
                    "ref_id": "BIBREF7"
                },
                {
                    "start": 695,
                    "end": 698,
                    "text": "10,",
                    "ref_id": "BIBREF9"
                },
                {
                    "start": 699,
                    "end": 702,
                    "text": "12]",
                    "ref_id": "BIBREF11"
                }
            ],
            "ref_spans": [],
            "section": ""
        },
        {
            "text": "This retrospective cohort study includes patients who underwent transplantation between March 2004 and April 2014 at the Fred Hutchinson Cancer Research Center (FHCRC) and had documented HMPV infection during pretransplant conditioning or after transplantation. Only an individual's first episode of HMPV infection was analyzed. Patients' demographic data and transplantation information were retrieved from the FHCRC database, and other data related to the clinical course of HMPV infections were collected by medical record reviews. The data about HMPV infection in the community were based on the University of Washington Molecular Virology Laboratory data, which include data from Seattle Children's Hospital and from samples that were sent to the laboratory from regional providers (http://depts.washington.edu/rspvirus/respiratory.htm).",
            "cite_spans": [],
            "ref_spans": [],
            "section": "Study Design"
        },
        {
            "text": "The study was approved by the FHCRC Institutional Review Board.",
            "cite_spans": [],
            "ref_spans": [],
            "section": "Study Design"
        },
        {
            "text": "Nasopharyngeal samples were collected when HCT recipients had URI symptoms. We also collected a bronchoalveolar lavage (BAL) sample when patients had lower respiratory tract symptoms and a radiographic abnormality. Follow-up nasopharyngeal samples were obtained in a subset of patients. We initially applied direct fluorescent antibody testing and individual reverse transcription polymerase chain reaction (RT-PCR) assay to detect HMPV and started multiplex PCR testing in 2008 [13, 14] . Samples were considered positive if the PCR amplification plot crossed the threshold at <40 cycles. Viral load was determined by quantitative RT-PCR using nasopharyngeal samples at diagnosis of URI [15] .",
            "cite_spans": [
                {
                    "start": 479,
                    "end": 483,
                    "text": "[13,",
                    "ref_id": "BIBREF12"
                },
                {
                    "start": 484,
                    "end": 487,
                    "text": "14]",
                    "ref_id": "BIBREF13"
                },
                {
                    "start": 688,
                    "end": 692,
                    "text": "[15]",
                    "ref_id": "BIBREF14"
                }
            ],
            "ref_spans": [],
            "section": "Laboratory Testing"
        },
        {
            "text": "URI was defined as HMPV detection in a nasopharyngeal sample with URI symptoms, such as rhinorrhea, stuffy nose, or sore throat. LRD was defined as detection of HMPV in a BAL or lung biopsy sample with new pulmonary infiltrates detected on radiographic studies; in analogy to a previous article on parainfluenza virus LRD, this manifestation was termed \"proven LRD\" [16] . \"Possible LRD\" was defined as viral detection in a nasopharyngeal sample and new pulmonary infiltrates without bronchoscopic examination, and these cases were included as URI in this study. Patients diagnosed with LRD \u22652 days after URI diagnosis were considered to have progression to LRD. Duration of viral shedding was defined as days between the first and the last date of HMPV detection.",
            "cite_spans": [
                {
                    "start": 366,
                    "end": 370,
                    "text": "[16]",
                    "ref_id": "BIBREF15"
                }
            ],
            "ref_spans": [],
            "section": "Definitions"
        },
        {
            "text": "A copathogen was defined as a significant pathogen when detected in a concurrent respiratory sample or in a blood sample obtained within 2 days of diagnosis of HMPV infection. Coagulase-negative staphylococcal bacteremia and cytomegalovirus viremia or antigenemia were not considered significant copathogens. Peak steroid dose before diagnosis was recorded from the period within 2 weeks [16] .",
            "cite_spans": [
                {
                    "start": 388,
                    "end": 392,
                    "text": "[16]",
                    "ref_id": "BIBREF15"
                }
            ],
            "ref_spans": [],
            "section": "Definitions"
        },
        {
            "text": "Patients' demographic characteristics were compared among disease categories using \u03c7 2 or Fisher exact test for categorical variables and Wilcoxon rank-sum test for continuous variables (as appropriate). The probability of progression to LRD among patients who presented with URI was estimated by cumulative incidence curves, treating death as a competing risk. Cox proportional hazards models were used to evaluate unadjusted and adjusted hazard ratios for progression to LRD. Logistic regression models were used to evaluate cross-sectional association between each risk factor and occurrence of LRD among all patients (including patients who presented with LRD). Risk factors for duration of shedding were assessed using linear regression on the ranks of days of shedding by day 100. Twosided P values <.05 were considered statistically significant.",
            "cite_spans": [],
            "ref_spans": [],
            "section": "Statistical Analysis"
        },
        {
            "text": "All statistical analyses were performed using SAS version 9.3 for Windows (SAS Institute, Cary, North Carolina).",
            "cite_spans": [],
            "ref_spans": [],
            "section": "Statistical Analysis"
        },
        {
            "text": "HMPV was detected in 118 HCT recipients; 88 (75%) and 30 (25%) had URI alone and LRD, respectively. Characteristics of each HMPV infection group are shown in Table 1 . The median time to HMPV detection after HCT was 278.5 days (range, \u22125 to 2773 days), and the median viral load in nasal wash samples was 1.1 \u00d7 10 6 copies/mL (range, 3.3 \u00d7 10 2 -1.7 \u00d7 10 9 copies/ mL). The median day of engraftment was 16 days (range, 0-39 days), and only 1 patient who did not have engraftment prior to death had LRD, which was documented 63 days after HCT.",
            "cite_spans": [],
            "ref_spans": [
                {
                    "start": 158,
                    "end": 165,
                    "text": "Table 1",
                    "ref_id": "TABREF0"
                }
            ],
            "section": "Patient Characteristics and Seasonality"
        },
        {
            "text": "Earlier transplantation year, HMPV infection sooner after HCT, copathogens, and low monocyte counts were observed more frequently in LRD cases than URI-only cases. There were 21 \"possible LRD\" cases, of which 8 (38%) and 13 (62%) received their transplantation before and after 2009, respectively. Other respiratory viral copathogens such as rhinovirus (n = 13 [11%]), coronaviruses (n = 11 [9%]), or parainfluenza virus (n = 5 [4%]) were occasionally detected in the nasopharyngeal or BAL samples. Nonviral copathogens in BAL included Pseudomonas aeruginosa (n = 1 [1%]) and Aspergillus fumigatus (n = 2 [2%]). Four patients had bacteremia due to Stenotrophomonas maltophilia, Acinetobacter baumannii, Enterococcus faecium, or Streptococcus pneumoniae at diagnosis.",
            "cite_spans": [],
            "ref_spans": [],
            "section": "Patient Characteristics and Seasonality"
        },
        {
            "text": "The number of HMPV infections by month between July 2008 and June 2014 is shown in Figure 1A . Most of the infections (93%) were identified between December and May of each calendar year. The incidence of HMPV infections in HCT recipients was similar to that in the community based on University of Washington reference laboratory data ( Figure 1B ). The numbers of HMPV cases by year are shown in Figure 1C and 1D. When HMPV infections were frequently detected, LRD occurred more frequently ( Figure 1A and 1C).",
            "cite_spans": [],
            "ref_spans": [
                {
                    "start": 83,
                    "end": 92,
                    "text": "Figure 1A",
                    "ref_id": "FIGREF0"
                },
                {
                    "start": 338,
                    "end": 347,
                    "text": "Figure 1B",
                    "ref_id": "FIGREF0"
                },
                {
                    "start": 398,
                    "end": 407,
                    "text": "Figure 1C",
                    "ref_id": "FIGREF0"
                },
                {
                    "start": 494,
                    "end": 503,
                    "text": "Figure 1A",
                    "ref_id": "FIGREF0"
                }
            ],
            "section": "Patient Characteristics and Seasonality"
        },
        {
            "text": "Among 30 patients with HMPV LRD, 17 (57%) had detected HMPV URI before diagnosis of LRD and progressed to LRD in a median of 7 days (range, 2-63 days) after URI. In total, among 105 patients with URI, the probability of progression to LRD within 40 days was 16% ( Figure 2 ). Approximately 75% (14/17) of the patients with URI who progressed to LRD did so within 2 weeks after URI.",
            "cite_spans": [],
            "ref_spans": [
                {
                    "start": 264,
                    "end": 272,
                    "text": "Figure 2",
                    "ref_id": "FIGREF1"
                }
            ],
            "section": "Progression From URI to LRD"
        },
        {
            "text": "In the univariate Cox model, the factors shown in Table 1 were used to identify risk factors for progression to LRD among patients who presented with URI. Early HMPV infection after HCT, low lymphocyte count, and steroid use of \u22651 mg/kg before diagnosis were significantly associated with disease progression (Table 2) , of which steroid dose remained significant in one bivariate model ( Table 3 ). Probabilities of progression to LRD by these factors are shown in Figure 3 . Approximately 60% of HCT recipients with low lymphocyte count or steroid use of \u22651 mg/kg before virologic diagnosis subsequently progressed to LRD. In univariate logistic regression models among all patients, factors associated with the development of LRD were early onset of HMPV infection after HCT (odds ratio [OR], 3.70; 95% confidence interval [CI], 1.33-11.1; P = .010), low lymphocyte count (OR, 2.78; 95% CI, 1.05-7.37; P = .040), earlier transplantation year (OR, 1.22; 95% CI, 1.02-1.46; P = .028), presence of copathogens (OR, 2.63; 95% CI, 1.11-6.23; P = .029), and low monocyte count (OR, 3.00; 95% CI, 1.23-7.30; P = .016); use of steroids (\u22651 mg/kg) approached statistical significance (OR, 4.53; 95% CI, .95-21.62; P = .06). In a multivariable logistic model that included transplantation year, low lymphocyte count, and high steroid use before diagnosis, earlier transplantation year (adjusted OR [aOR], 1.33; 95% CI, 1.09-1.63; P = .005) and low lymphocyte count (aOR, 3.38; 95% CI, 1.07-10.67; P = .038) remained statistically significant. When early onset after transplantation was included in the model, lymphocytopenia was no longer significant, whereas early onset remained significant (aOR, 3.30; 95% CI, 1.01-10.83; P = .048).",
            "cite_spans": [],
            "ref_spans": [
                {
                    "start": 50,
                    "end": 57,
                    "text": "Table 1",
                    "ref_id": "TABREF0"
                },
                {
                    "start": 309,
                    "end": 318,
                    "text": "(Table 2)",
                    "ref_id": "TABREF2"
                },
                {
                    "start": 389,
                    "end": 396,
                    "text": "Table 3",
                    "ref_id": "TABREF3"
                },
                {
                    "start": 466,
                    "end": 474,
                    "text": "Figure 3",
                    "ref_id": "FIGREF2"
                }
            ],
            "section": "Risk Factors for Progression to LRD"
        },
        {
            "text": "Thirty-nine patients had continuous HMPV detection for up to 182 days. Only 2 patients who died before day 100 had prolonged shedding: 1 patient who died at day 20 had 20 days of shedding, and another who died at day 31 had 17 days of shedding. In a bivariate analysis of risk factors for duration of shedding that included the same 3 variables as in Table 3 , steroid use of \u22651 mg/kg was associated with longer shedding (P = .030).",
            "cite_spans": [],
            "ref_spans": [
                {
                    "start": 351,
                    "end": 358,
                    "text": "Table 3",
                    "ref_id": "TABREF3"
                }
            ],
            "section": "Viral Shedding and Viral Load in Nasopharyngeal Samples"
        },
        {
            "text": "Among 101 patients with detected viruses in nasal wash samples, we compared disease status by viral load. There was no evidence of a correlation between disease status and viral load in the nasal wash samples at presentation (data not shown).",
            "cite_spans": [],
            "ref_spans": [],
            "section": "Viral Shedding and Viral Load in Nasopharyngeal Samples"
        },
        {
            "text": "This study demonstrated that low lymphocyte count and steroid use of \u22651 mg/kg at the time of URI diagnosis are associated with an increased risk of progression to LRD with progression rates approaching 60% in patients in the highest-risk categories. The viral load in nasopharyngeal samples at the time that HMPV URI was diagnosed did not appear to predict the risk of progression to LRD.",
            "cite_spans": [],
            "ref_spans": [],
            "section": "DISCUSSION"
        },
        {
            "text": "HMPV is a relatively newly discovered respiratory pathogen and the effect of HMPV infections on HCT recipients is poorly understood. Numerous studies of respiratory disease due to RSV, a genetically similar respiratory virus, in transplantation recipients have been reported with progression rates to LRD and mortality after LRD ranging from 20% to 50% and 15% to 50%, respectively [17] [18] [19] [20] [21] . Due to the high incidence of RSV-related LRD and subsequent high mortality from RSV infection, RSV infections after HCT are considered a very important complication. Mortality following HMPV is comparably as high as that seen with RSV, at rates of approximately 40% [10] . HMPV is difficult to diagnose with culture methods, but several multiplex PCR platforms are now available that permit rapid, sensitive, and specific detection of HMPV.",
            "cite_spans": [
                {
                    "start": 382,
                    "end": 386,
                    "text": "[17]",
                    "ref_id": "BIBREF16"
                },
                {
                    "start": 387,
                    "end": 391,
                    "text": "[18]",
                    "ref_id": "BIBREF17"
                },
                {
                    "start": 392,
                    "end": 396,
                    "text": "[19]",
                    "ref_id": "BIBREF18"
                },
                {
                    "start": 397,
                    "end": 401,
                    "text": "[20]",
                    "ref_id": "BIBREF19"
                },
                {
                    "start": 402,
                    "end": 406,
                    "text": "[21]",
                    "ref_id": "BIBREF20"
                },
                {
                    "start": 675,
                    "end": 679,
                    "text": "[10]",
                    "ref_id": "BIBREF9"
                }
            ],
            "ref_spans": [],
            "section": "DISCUSSION"
        },
        {
            "text": "The progression rate to LRD may be affected by the underlying conditions of the HCT recipient. We identified steroid use of \u22651 mg/kg before diagnosis, low lymphocyte count, and onset of HMPV infection during the first month after HCT as important risk factors for progression. As shown in Figure 3 , 60% of the patients with steroid use of \u22651 mg/kg or with low lymphocyte count had progression. These 2 characteristics are generally associated with high mortality after LRD by respiratory virus [10, 16, 20] . The logistic regression model provided additional insights. Lymphopenia was important but lost significance when the timing after transplantation was included. This suggests that other host defense mechanisms in the early time period after transplantation, such as monocytes, are also important. With only 30 events of LRD, we were unable to fit a model including all factors that are potentially important. Disease progression following infection with RSV, a virus that is genetically similar to HMPV, has been related to patient characteristics including neutropenia, lymphocytopenia, unrelated donor status, conditioning including total body irradiation, fungal coinfections, and smoking history [17] . In our study, however, none of these factors except lymphocytopenia was associated with progression. Although we did not collect data on smoking history, we evaluated pulmonary function prior to HMPV infection, and no association between pulmonary dysfunction and progression of HMPV infections was detected.",
            "cite_spans": [
                {
                    "start": 495,
                    "end": 499,
                    "text": "[10,",
                    "ref_id": "BIBREF9"
                },
                {
                    "start": 500,
                    "end": 503,
                    "text": "16,",
                    "ref_id": "BIBREF15"
                },
                {
                    "start": 504,
                    "end": 507,
                    "text": "20]",
                    "ref_id": "BIBREF19"
                },
                {
                    "start": 1209,
                    "end": 1213,
                    "text": "[17]",
                    "ref_id": "BIBREF16"
                }
            ],
            "ref_spans": [
                {
                    "start": 289,
                    "end": 297,
                    "text": "Figure 3",
                    "ref_id": "FIGREF2"
                }
            ],
            "section": "DISCUSSION"
        },
        {
            "text": "To improve patient outcome of HMPV infection, strategies need to be developed to prevent progression to LRD. Our study identified high-risk clinical situations during which early intervention strategies could be studied. To date, there is no proven effective treatment for HMPV infection [22, 23] . Several small reports support the use of ribavirin with or without intravenous immunoglobulin (IVIG) for HMPV infection [24] [25] [26] [27] . A larger study, however, showed no protective effect of ribavirin for HMPV LRD [10] . All studies were nonrandomized. In our study, a maintenance dose of IVIG was not associated with a lower progression rate (data not shown). We were unable to analyze the effect of ribavirin or high-dose IVIG because the number of patients who received it before progression was low. Based on our finding, reduction of steroid doses if patients receive high-dose steroid may be a possible strategy. However, whether such an approach would be effective cannot be determined from this study.",
            "cite_spans": [
                {
                    "start": 288,
                    "end": 292,
                    "text": "[22,",
                    "ref_id": "BIBREF21"
                },
                {
                    "start": 293,
                    "end": 296,
                    "text": "23]",
                    "ref_id": "BIBREF22"
                },
                {
                    "start": 419,
                    "end": 423,
                    "text": "[24]",
                    "ref_id": "BIBREF23"
                },
                {
                    "start": 424,
                    "end": 428,
                    "text": "[25]",
                    "ref_id": "BIBREF24"
                },
                {
                    "start": 429,
                    "end": 433,
                    "text": "[26]",
                    "ref_id": "BIBREF25"
                },
                {
                    "start": 434,
                    "end": 438,
                    "text": "[27]",
                    "ref_id": "BIBREF26"
                },
                {
                    "start": 520,
                    "end": 524,
                    "text": "[10]",
                    "ref_id": "BIBREF9"
                }
            ],
            "ref_spans": [],
            "section": "DISCUSSION"
        },
        {
            "text": "Other important findings in this study are that steroid use of \u22651 mg/kg before diagnosis was associated with longer viral shedding and that viral load in a nasopharyngeal sample was not correlated with progression to LRD. As for the effect of viral load, we may have failed to show the relationship due to issues related to host immune function, which we did not quantify in this study. We generally perform nasopharyngeal testing when patients have URI symptoms. Although URI symptoms are based on host immune response, the level of the immune response in HCT recipients may not be correlated to viral load. Another possible reason is that progression to pneumonia may not be related to viral load in the upper respiratory tract. Previous studies of parainfluenza virus or pathogens detected in patients with idiopathic pneumonia syndrome after HCT failed to show an association of viral load in a BAL sample with the level of lung injury or outcome, which is consistent with the finding in the current study [16, 28] . Although we did not demonstrate a correlation between viral load and progression to LRD, it is possible that larger studies with standardized BAL viral load measurements that control for dilution may improve our understanding of the role of viral load in disease progression.",
            "cite_spans": [
                {
                    "start": 1010,
                    "end": 1014,
                    "text": "[16,",
                    "ref_id": "BIBREF15"
                },
                {
                    "start": 1015,
                    "end": 1018,
                    "text": "28]",
                    "ref_id": "BIBREF27"
                }
            ],
            "ref_spans": [],
            "section": "DISCUSSION"
        },
        {
            "text": "This study has several limitations. Although this cohort represents the largest number of HCT recipients infected with HMPV who received a quantitative virological workup of both the upper and lower respiratory tract samples, the sample size was too small to definitively assess all the patient characteristics we studied and the role of individual copathogens. We also did not have enough events for multivariable analyses. Nevertheless, we were able to perform several different bivariate Cox models. Another limitation is the long observation period, during which various transplantation procedures have changed. Low lymphocyte count or steroid dose before diagnosis are important factors for progression to LRD. Reduced intensity conditioning regimens that are related to mild lymphocytopenia are frequently used. Our center has recently adopted lower dose of steroids for the initial treatment of acute graft-vs-host disease [29] , which may have affected the incidence of LRD in recent years. Although we included possible factors affecting the progression rate in the analyses, we may have missed some important factors that changed during the study period. The main methods to detect HMPV also changed because of the long observation period. However, there was no apparent bias in the way samples were collected for testing. We performed bronchoscopy when patients had lower respiratory tract symptoms and radiographic abnormalities. Nevertheless, the final decision was left to the attending physician. Therefore, an aggressive workup was declined in some \"possible LRD\" cases, especially in cases late after HCT, which may have resulted in underreporting of progression to LRD in some cases. The virological analyses were also limited because of inconsistent surveillance of viral shedding and incomplete ascertainment of viral load by dilution factor of the nasal wash samples, although a previous study suggested that the dilution effect is rather limited [13] .",
            "cite_spans": [
                {
                    "start": 930,
                    "end": 934,
                    "text": "[29]",
                    "ref_id": "BIBREF28"
                },
                {
                    "start": 1968,
                    "end": 1972,
                    "text": "[13]",
                    "ref_id": "BIBREF12"
                }
            ],
            "ref_spans": [],
            "section": "DISCUSSION"
        },
        {
            "text": "In conclusion, our findings show that HMPV infections in HCT recipients occurred primarily in the winter and spring. The progression rate from URI to LRD approached 60% in patients who acquired HMPV infection and had low lymphocyte count or use of \u22651 mg/kg of steroids prior to URI. These data provide the necessary foundation to design clinical trials to study the efficacy of new antiviral compounds, which are urgently needed. Further studies are needed to define the role of viral load in the pathogenesis of progressive disease. A, Cumulative incidence of progression to LRD by days between hematopoietic cell transplantation (HCT) and diagnosis of URI (global P = .01, log-rank test). B, Cumulative incidence of progression to LRD by lymphocyte count (global P = .0007). C, Cumulative incidence of progression to LRD by steroid dose before diagnosis of URI (global P = .006).",
            "cite_spans": [],
            "ref_spans": [],
            "section": "DISCUSSION"
        }
    ],
    "bib_entries": {
        "BIBREF0": {
            "ref_id": "b0",
            "title": "A newly discovered human pneumovirus isolated from young children with respiratory tract disease",
            "authors": [
                {
                    "first": "B",
                    "middle": [
                        "G"
                    ],
                    "last": "Van Den Hoogen",
                    "suffix": ""
                },
                {
                    "first": "J",
                    "middle": [
                        "C"
                    ],
                    "last": "De Jong",
                    "suffix": ""
                },
                {
                    "first": "J",
                    "middle": [],
                    "last": "Groen",
                    "suffix": ""
                }
            ],
            "year": 2001,
            "venue": "Nat Med",
            "volume": "7",
            "issn": "",
            "pages": "719--743",
            "other_ids": {}
        },
        "BIBREF1": {
            "ref_id": "b1",
            "title": "Human metapneumovirus: lessons learned over the first decade",
            "authors": [
                {
                    "first": "V",
                    "middle": [],
                    "last": "Schildgen",
                    "suffix": ""
                },
                {
                    "first": "B",
                    "middle": [],
                    "last": "Van Den Hoogen",
                    "suffix": ""
                },
                {
                    "first": "R",
                    "middle": [],
                    "last": "Fouchier",
                    "suffix": ""
                }
            ],
            "year": 2011,
            "venue": "Clin Microbiol Rev",
            "volume": "24",
            "issn": "",
            "pages": "734--54",
            "other_ids": {}
        },
        "BIBREF2": {
            "ref_id": "b2",
            "title": "Early reinfection with human metapneumovirus in an infant",
            "authors": [
                {
                    "first": "T",
                    "middle": [],
                    "last": "Ebihara",
                    "suffix": ""
                },
                {
                    "first": "R",
                    "middle": [],
                    "last": "Endo",
                    "suffix": ""
                },
                {
                    "first": "N",
                    "middle": [],
                    "last": "Ishiguro",
                    "suffix": ""
                },
                {
                    "first": "T",
                    "middle": [],
                    "last": "Nakayama",
                    "suffix": ""
                },
                {
                    "first": "H",
                    "middle": [],
                    "last": "Sawada",
                    "suffix": ""
                },
                {
                    "first": "H",
                    "middle": [],
                    "last": "Kikuta",
                    "suffix": ""
                }
            ],
            "year": 2004,
            "venue": "J Clin Microbiol",
            "volume": "42",
            "issn": "",
            "pages": "5944--5950",
            "other_ids": {}
        },
        "BIBREF3": {
            "ref_id": "b3",
            "title": "Human rhinovirus and coronavirus detection among allogeneic hematopoietic stem cell transplantation recipients",
            "authors": [
                {
                    "first": "F",
                    "middle": [],
                    "last": "Milano",
                    "suffix": ""
                },
                {
                    "first": "A",
                    "middle": [
                        "P"
                    ],
                    "last": "Campbell",
                    "suffix": ""
                },
                {
                    "first": "K",
                    "middle": [
                        "A"
                    ],
                    "last": "Guthrie",
                    "suffix": ""
                }
            ],
            "year": 2010,
            "venue": "Blood",
            "volume": "115",
            "issn": "",
            "pages": "2088--94",
            "other_ids": {}
        },
        "BIBREF4": {
            "ref_id": "b4",
            "title": "Frequency of human metapneumovirus infection in hematopoietic SCT recipients during 3 consecutive years",
            "authors": [
                {
                    "first": "R",
                    "middle": [],
                    "last": "Oliveira",
                    "suffix": ""
                },
                {
                    "first": "A",
                    "middle": [],
                    "last": "Machado",
                    "suffix": ""
                },
                {
                    "first": "A",
                    "middle": [],
                    "last": "Tateno",
                    "suffix": ""
                },
                {
                    "first": "L",
                    "middle": [
                        "V"
                    ],
                    "last": "Boas",
                    "suffix": ""
                },
                {
                    "first": "C",
                    "middle": [],
                    "last": "Pannuti",
                    "suffix": ""
                },
                {
                    "first": "C",
                    "middle": [],
                    "last": "Machado",
                    "suffix": ""
                }
            ],
            "year": 2008,
            "venue": "Bone Marrow Transplant",
            "volume": "42",
            "issn": "",
            "pages": "265--274",
            "other_ids": {}
        },
        "BIBREF5": {
            "ref_id": "b5",
            "title": "Brief communication: fatal human metapneumovirus infection in stem-cell transplant recipients",
            "authors": [
                {
                    "first": "J",
                    "middle": [
                        "A"
                    ],
                    "last": "Englund",
                    "suffix": ""
                },
                {
                    "first": "M",
                    "middle": [],
                    "last": "Boeckh",
                    "suffix": ""
                },
                {
                    "first": "J",
                    "middle": [],
                    "last": "Kuypers",
                    "suffix": ""
                }
            ],
            "year": 2006,
            "venue": "Ann Intern Med",
            "volume": "144",
            "issn": "",
            "pages": "344--353",
            "other_ids": {}
        },
        "BIBREF6": {
            "ref_id": "b6",
            "title": "Human metapneumovirus in a haematopoietic stem cell transplant recipient with fatal lower respiratory tract disease",
            "authors": [
                {
                    "first": "P",
                    "middle": [
                        "A"
                    ],
                    "last": "Cane",
                    "suffix": ""
                },
                {
                    "first": "B",
                    "middle": [
                        "G"
                    ],
                    "last": "Van Den Hoogen",
                    "suffix": ""
                },
                {
                    "first": "S",
                    "middle": [],
                    "last": "Chakrabarti",
                    "suffix": ""
                },
                {
                    "first": "C",
                    "middle": [
                        "D"
                    ],
                    "last": "Fegan",
                    "suffix": ""
                },
                {
                    "first": "A",
                    "middle": [
                        "D"
                    ],
                    "last": "Osterhaus",
                    "suffix": ""
                }
            ],
            "year": 2003,
            "venue": "Bone Marrow Transplant",
            "volume": "31",
            "issn": "",
            "pages": "309--319",
            "other_ids": {}
        },
        "BIBREF7": {
            "ref_id": "b7",
            "title": "Fatal human metapneumovirus infection following allogeneic hematopoietic stem cell transplantation",
            "authors": [
                {
                    "first": "C",
                    "middle": [],
                    "last": "Dokos",
                    "suffix": ""
                },
                {
                    "first": "K",
                    "middle": [],
                    "last": "Masjosthusmann",
                    "suffix": ""
                },
                {
                    "first": "G",
                    "middle": [],
                    "last": "Rellensmann",
                    "suffix": ""
                }
            ],
            "year": 2013,
            "venue": "Transpl Infect Dis",
            "volume": "15",
            "issn": "",
            "pages": "97--101",
            "other_ids": {}
        },
        "BIBREF8": {
            "ref_id": "b8",
            "title": "Serious outbreak of human metapneumovirus in patients with hematologic malignancies",
            "authors": [
                {
                    "first": "A",
                    "middle": [],
                    "last": "Hoellein",
                    "suffix": ""
                },
                {
                    "first": "J",
                    "middle": [],
                    "last": "Hecker",
                    "suffix": ""
                },
                {
                    "first": "D",
                    "middle": [],
                    "last": "Hoffmann",
                    "suffix": ""
                }
            ],
            "year": 2016,
            "venue": "Leuk Lymphoma",
            "volume": "57",
            "issn": "",
            "pages": "623--630",
            "other_ids": {}
        },
        "BIBREF9": {
            "ref_id": "b9",
            "title": "Mortality rates of human metapneumovirus and respiratory syncytial virus lower respiratory tract infections in hematopoietic cell transplantation recipients",
            "authors": [
                {
                    "first": "C",
                    "middle": [],
                    "last": "Renaud",
                    "suffix": ""
                },
                {
                    "first": "H",
                    "middle": [],
                    "last": "Xie",
                    "suffix": ""
                },
                {
                    "first": "S",
                    "middle": [],
                    "last": "Seo",
                    "suffix": ""
                }
            ],
            "year": 2013,
            "venue": "Biol Blood Marrow Transplant",
            "volume": "19",
            "issn": "",
            "pages": "1220--1226",
            "other_ids": {}
        },
        "BIBREF10": {
            "ref_id": "b10",
            "title": "A prospective study comparing human metapneumovirus with other respiratory viruses in adults with hematologic malignancies and respiratory tract infections",
            "authors": [
                {
                    "first": "J",
                    "middle": [
                        "V"
                    ],
                    "last": "Williams",
                    "suffix": ""
                },
                {
                    "first": "R",
                    "middle": [],
                    "last": "Martino",
                    "suffix": ""
                },
                {
                    "first": "N",
                    "middle": [],
                    "last": "Rabella",
                    "suffix": ""
                }
            ],
            "year": 2005,
            "venue": "J Infect Dis",
            "volume": "192",
            "issn": "",
            "pages": "1061--1066",
            "other_ids": {}
        },
        "BIBREF11": {
            "ref_id": "b11",
            "title": "Human metapneumovirus infection after allogeneic hematopoietic stem cell transplantation",
            "authors": [
                {
                    "first": "A",
                    "middle": [],
                    "last": "Egli",
                    "suffix": ""
                },
                {
                    "first": "C",
                    "middle": [],
                    "last": "Bucher",
                    "suffix": ""
                },
                {
                    "first": "A",
                    "middle": [],
                    "last": "Dumoulin",
                    "suffix": ""
                }
            ],
            "year": 2012,
            "venue": "Infection",
            "volume": "40",
            "issn": "",
            "pages": "677--84",
            "other_ids": {}
        },
        "BIBREF12": {
            "ref_id": "b12",
            "title": "Respiratory virus infection among hematopoietic cell transplant recipients: evidence for asymptomatic parainfluenza virus infection",
            "authors": [
                {
                    "first": "A",
                    "middle": [
                        "J"
                    ],
                    "last": "Peck",
                    "suffix": ""
                },
                {
                    "first": "J",
                    "middle": [
                        "A"
                    ],
                    "last": "Englund",
                    "suffix": ""
                },
                {
                    "first": "J",
                    "middle": [],
                    "last": "Kuypers",
                    "suffix": ""
                }
            ],
            "year": 2007,
            "venue": "Blood",
            "volume": "110",
            "issn": "",
            "pages": "1681--1689",
            "other_ids": {}
        },
        "BIBREF13": {
            "ref_id": "b13",
            "title": "Detection and quantification of human metapneumovirus in pediatric specimens by real-time RT-PCR",
            "authors": [
                {
                    "first": "J",
                    "middle": [],
                    "last": "Kuypers",
                    "suffix": ""
                },
                {
                    "first": "N",
                    "middle": [],
                    "last": "Wright",
                    "suffix": ""
                },
                {
                    "first": "L",
                    "middle": [],
                    "last": "Corey",
                    "suffix": ""
                },
                {
                    "first": "R",
                    "middle": [],
                    "last": "Morrow",
                    "suffix": ""
                }
            ],
            "year": 2005,
            "venue": "J Clin Virol",
            "volume": "33",
            "issn": "",
            "pages": "299--305",
            "other_ids": {}
        },
        "BIBREF14": {
            "ref_id": "b14",
            "title": "Comparison of conventional and molecular detection of respiratory viruses in hematopoietic cell transplant recipients",
            "authors": [
                {
                    "first": "J",
                    "middle": [],
                    "last": "Kuypers",
                    "suffix": ""
                },
                {
                    "first": "A",
                    "middle": [
                        "P"
                    ],
                    "last": "Campbell",
                    "suffix": ""
                },
                {
                    "first": "A",
                    "middle": [],
                    "last": "Cent",
                    "suffix": ""
                },
                {
                    "first": "L",
                    "middle": [],
                    "last": "Corey",
                    "suffix": ""
                },
                {
                    "first": "M",
                    "middle": [],
                    "last": "Boeckh",
                    "suffix": ""
                }
            ],
            "year": 2009,
            "venue": "Transpl Infect Dis",
            "volume": "11",
            "issn": "",
            "pages": "298--303",
            "other_ids": {}
        },
        "BIBREF15": {
            "ref_id": "b15",
            "title": "Parainfluenza virus lower respiratory tract disease after hematopoietic cell transplant: viral detection in the lung predicts outcome",
            "authors": [
                {
                    "first": "S",
                    "middle": [],
                    "last": "Seo",
                    "suffix": ""
                },
                {
                    "first": "H",
                    "middle": [],
                    "last": "Xie",
                    "suffix": ""
                },
                {
                    "first": "A",
                    "middle": [
                        "P"
                    ],
                    "last": "Campbell",
                    "suffix": ""
                }
            ],
            "year": 2014,
            "venue": "Clin Infect Dis",
            "volume": "58",
            "issn": "",
            "pages": "1357--68",
            "other_ids": {}
        },
        "BIBREF16": {
            "ref_id": "b16",
            "title": "Respiratory syncytial virus in hematopoietic cell transplant recipients: factors determining progression to lower respiratory tract disease",
            "authors": [
                {
                    "first": "Y",
                    "middle": [
                        "J"
                    ],
                    "last": "Kim",
                    "suffix": ""
                },
                {
                    "first": "K",
                    "middle": [
                        "A"
                    ],
                    "last": "Guthrie",
                    "suffix": ""
                },
                {
                    "first": "A",
                    "middle": [],
                    "last": "Waghmare",
                    "suffix": ""
                }
            ],
            "year": 2014,
            "venue": "J Infect Dis",
            "volume": "209",
            "issn": "",
            "pages": "1195--204",
            "other_ids": {}
        },
        "BIBREF17": {
            "ref_id": "b17",
            "title": "Impact of aerosolized ribavirin on mortality in 280 allogeneic haematopoietic stem cell transplant recipients with respiratory syncytial virus infections",
            "authors": [
                {
                    "first": "D",
                    "middle": [
                        "P"
                    ],
                    "last": "Shah",
                    "suffix": ""
                },
                {
                    "first": "S",
                    "middle": [
                        "S"
                    ],
                    "last": "Ghantoji",
                    "suffix": ""
                },
                {
                    "first": "J",
                    "middle": [
                        "N"
                    ],
                    "last": "Shah",
                    "suffix": ""
                }
            ],
            "year": 2013,
            "venue": "J Antimicrob Chemother",
            "volume": "68",
            "issn": "",
            "pages": "1872--80",
            "other_ids": {}
        },
        "BIBREF18": {
            "ref_id": "b18",
            "title": "Outcome of respiratory syncytial virus lower respiratory tract disease in hematopoietic cell transplant recipients receiving aerosolized ribavirin: significance of stem cell source and oxygen requirement",
            "authors": [
                {
                    "first": "S",
                    "middle": [],
                    "last": "Seo",
                    "suffix": ""
                },
                {
                    "first": "A",
                    "middle": [
                        "P"
                    ],
                    "last": "Campbell",
                    "suffix": ""
                },
                {
                    "first": "H",
                    "middle": [],
                    "last": "Xie",
                    "suffix": ""
                }
            ],
            "year": 2013,
            "venue": "Biol Blood Marrow Transplant",
            "volume": "19",
            "issn": "",
            "pages": "589--96",
            "other_ids": {}
        },
        "BIBREF19": {
            "ref_id": "b19",
            "title": "Respiratory syncytial virus lower respiratory disease in hematopoietic cell transplant recipients: viral RNA detection in blood, antiviral treatment, and clinical outcomes",
            "authors": [
                {
                    "first": "A",
                    "middle": [],
                    "last": "Waghmare",
                    "suffix": ""
                },
                {
                    "first": "A",
                    "middle": [
                        "P"
                    ],
                    "last": "Campbell",
                    "suffix": ""
                },
                {
                    "first": "H",
                    "middle": [],
                    "last": "Xie",
                    "suffix": ""
                }
            ],
            "year": 2013,
            "venue": "Clin Infect Dis",
            "volume": "57",
            "issn": "",
            "pages": "1731--1772",
            "other_ids": {}
        },
        "BIBREF20": {
            "ref_id": "b20",
            "title": "Changing epidemiology of respiratory viral infections in hematopoietic cell transplant recipients and solid organ transplant recipients",
            "authors": [
                {
                    "first": "C",
                    "middle": [],
                    "last": "Renaud",
                    "suffix": ""
                },
                {
                    "first": "A",
                    "middle": [
                        "P"
                    ],
                    "last": "Campbell",
                    "suffix": ""
                }
            ],
            "year": 2011,
            "venue": "Curr Opin Infect Dis",
            "volume": "24",
            "issn": "",
            "pages": "333--376",
            "other_ids": {}
        },
        "BIBREF21": {
            "ref_id": "b21",
            "title": "Paediatric human metapneumovirus infection: epidemiology, prevention and therapy",
            "authors": [
                {
                    "first": "N",
                    "middle": [],
                    "last": "Principi",
                    "suffix": ""
                },
                {
                    "first": "S",
                    "middle": [],
                    "last": "Esposito",
                    "suffix": ""
                }
            ],
            "year": 2014,
            "venue": "J Clin Virol",
            "volume": "59",
            "issn": "",
            "pages": "141--148",
            "other_ids": {}
        },
        "BIBREF22": {
            "ref_id": "b22",
            "title": "New approaches for immunization and therapy against human metapneumovirus",
            "authors": [
                {
                    "first": "S",
                    "middle": [
                        "C"
                    ],
                    "last": "Wen",
                    "suffix": ""
                },
                {
                    "first": "J",
                    "middle": [
                        "V"
                    ],
                    "last": "Williams",
                    "suffix": ""
                }
            ],
            "year": 2015,
            "venue": "Clin Vaccine Immunol",
            "volume": "22",
            "issn": "",
            "pages": "858--66",
            "other_ids": {}
        },
        "BIBREF23": {
            "ref_id": "b23",
            "title": "Successful treatment of human metapneumovirus pneumonia using combination therapy with intravenous ribavirin and immune globulin",
            "authors": [
                {
                    "first": "D",
                    "middle": [],
                    "last": "Bonney",
                    "suffix": ""
                },
                {
                    "first": "H",
                    "middle": [],
                    "last": "Razali",
                    "suffix": ""
                },
                {
                    "first": "A",
                    "middle": [],
                    "last": "Turner",
                    "suffix": ""
                },
                {
                    "first": "A",
                    "middle": [],
                    "last": "Will",
                    "suffix": ""
                }
            ],
            "year": 2009,
            "venue": "Br J Haematol",
            "volume": "145",
            "issn": "",
            "pages": "667--676",
            "other_ids": {}
        },
        "BIBREF24": {
            "ref_id": "b24",
            "title": "Human metapneumovirus infection in a hematopoietic transplant recipient",
            "authors": [
                {
                    "first": "R",
                    "middle": [
                        "T"
                    ],
                    "last": "Kamble",
                    "suffix": ""
                },
                {
                    "first": "C",
                    "middle": [],
                    "last": "Bollard",
                    "suffix": ""
                },
                {
                    "first": "G",
                    "middle": [],
                    "last": "Demmler",
                    "suffix": ""
                },
                {
                    "first": "P",
                    "middle": [
                        "R"
                    ],
                    "last": "Lasala",
                    "suffix": ""
                },
                {
                    "first": "G",
                    "middle": [],
                    "last": "Carrum",
                    "suffix": ""
                }
            ],
            "year": 2007,
            "venue": "Bone Marrow Transplant",
            "volume": "40",
            "issn": "",
            "pages": "699--700",
            "other_ids": {}
        },
        "BIBREF25": {
            "ref_id": "b25",
            "title": "Successful outcome of human metapneumovirus (hMPV) pneumonia in a lung transplant recipient treated with intravenous ribavirin",
            "authors": [
                {
                    "first": "K",
                    "middle": [],
                    "last": "Raza",
                    "suffix": ""
                },
                {
                    "first": "S",
                    "middle": [
                        "B"
                    ],
                    "last": "Ismailjee",
                    "suffix": ""
                },
                {
                    "first": "M",
                    "middle": [],
                    "last": "Crespo",
                    "suffix": ""
                }
            ],
            "year": 2007,
            "venue": "J Heart Lung Transplant",
            "volume": "26",
            "issn": "",
            "pages": "862--866",
            "other_ids": {}
        },
        "BIBREF26": {
            "ref_id": "b26",
            "title": "Immune modulatory activity of ribavirin for serious human metapneumovirus disease: early i.v. therapy may improve outcomes in immunosuppressed SCT recipients",
            "authors": [
                {
                    "first": "A",
                    "middle": [],
                    "last": "Safdar",
                    "suffix": ""
                }
            ],
            "year": 2008,
            "venue": "Bone Marrow Transplant",
            "volume": "41",
            "issn": "",
            "pages": "707--715",
            "other_ids": {}
        },
        "BIBREF27": {
            "ref_id": "b27",
            "title": "Idiopathic pneumonia syndrome after hematopoietic cell transplantation: evidence of occult infectious etiologies",
            "authors": [
                {
                    "first": "S",
                    "middle": [],
                    "last": "Seo",
                    "suffix": ""
                },
                {
                    "first": "C",
                    "middle": [],
                    "last": "Renaud",
                    "suffix": ""
                },
                {
                    "first": "J",
                    "middle": [
                        "M"
                    ],
                    "last": "Kuypers",
                    "suffix": ""
                }
            ],
            "year": 2015,
            "venue": "Blood",
            "volume": "125",
            "issn": "",
            "pages": "3789--97",
            "other_ids": {}
        },
        "BIBREF28": {
            "ref_id": "b28",
            "title": "Effectiveness and safety of lower dose prednisone for initial treatment of acute graft-versus-host disease: a randomized controlled trial",
            "authors": [
                {
                    "first": "M",
                    "middle": [],
                    "last": "Mielcarek",
                    "suffix": ""
                },
                {
                    "first": "T",
                    "middle": [],
                    "last": "Furlong",
                    "suffix": ""
                },
                {
                    "first": "B",
                    "middle": [
                        "E"
                    ],
                    "last": "Storer",
                    "suffix": ""
                }
            ],
            "year": 2015,
            "venue": "Haematologica",
            "volume": "100",
            "issn": "",
            "pages": "842--850",
            "other_ids": {}
        }
    },
    "ref_entries": {
        "FIGREF0": {
            "text": "Monthly distribution of human metapneumovirus (HMPV) infection. A, Number of cases with HMPV infection by month, July 2008-June 2014, at our transplantation center. B, Number of cases with HMPV infection by month, July 2008-June 2014, diagnosed by the University of Washington (UW) reference laboratory, which tests samples from both Seattle and regional hospitals and healthcare providers. C, Number of cases with HMPV infection by year, January 2009-June 2014, at our center. *Number of cases in 2014 was obtained between January and June. D, Number of cases with HMPV infection by year, January 2009-June 2014, diagnosed by the UW reference laboratory. *Number of cases in 2014 was obtained between January and June. Abbreviations: HCT, hematopoietic cell transplantation; LRD, lower respiratory tract disease; URI, upper respiratory tract infection.",
            "latex": null,
            "type": "figure"
        },
        "FIGREF1": {
            "text": "Probability of progression to lower respiratory tract disease (LRD) after human metapneumovirus (HMPV) upper respiratory tract infection (URI) diagnosis.",
            "latex": null,
            "type": "figure"
        },
        "FIGREF2": {
            "text": "Incidence of progression to lower respiratory tract disease (LRD) after diagnosis of human metapneumovirus (HMPV) upper respiratory tract infection (URI).",
            "latex": null,
            "type": "figure"
        },
        "TABREF0": {
            "text": "Characteristics of All Patients With Human Metapneumovirus Infection (N = 118)",
            "latex": null,
            "type": "table"
        },
        "TABREF1": {
            "text": "",
            "latex": null,
            "type": "table"
        },
        "TABREF2": {
            "text": "Risk Factors for Progression From Upper Respiratory Tract Infection to Lower Respiratory Tract Disease (n = 105) All variables in Table 1 were used for the univariable analysis. Only variables with P < .1 are shown in this table. Transplantation year and viral load were shown regardless of P values. Abbreviations: CI, confidence interval; HCT, hematopoietic cell transplantation; HR, hazard ratio. a This variable was analyzed as continuous.",
            "latex": null,
            "type": "table"
        },
        "TABREF3": {
            "text": "Bivariate Analysis of Risk Factors for Progression From Upper Respiratory Tract Infection to Lower Respiratory Tract Disease (n = 105) Abbreviations: CI, confidence interval; HCT, hematopoietic cell transplantation; HR, hazard ratio.",
            "latex": null,
            "type": "table"
        }
    },
    "back_matter": [
        {
            "text": "Acknowledgments. We thank Terry Stevens-Ayers for laboratory assistance, Angela P. Campbell for collection of laboratory data, and Brad Edmison and Lisa Chung for assistance with creating figures.Financial support. This work was supported by the National Institutes of Health (grant number K24HL093294). S. S. is a recipient of the Joel Meyers Endowment Scholarship.Potential conflicts of interest. M. B. has served as a consultant to Humabs Biomed and has received research funding from Ansun Biopharma. All other authors report no potential conflicts. All authors have submitted the ICMJE Form for Disclosure of Potential Conflicts of Interest. Conflicts that the editors consider relevant to the content of the manuscript have been disclosed.",
            "cite_spans": [],
            "ref_spans": [],
            "section": "acknowledgement"
        }
    ]
}