{
    "paper_id": "PMC7087014",
    "metadata": {
        "title": "Investigation into the causes of canine infectious respiratory disease: antibody responses to canine respiratory coronavirus and canine herpesvirus in two kennelled dog populations",
        "authors": [
            {
                "first": "K.",
                "middle": [],
                "last": "Erles",
                "suffix": "",
                "email": null,
                "affiliation": {}
            },
            {
                "first": "J.",
                "middle": [],
                "last": "Brownlie",
                "suffix": "",
                "email": null,
                "affiliation": {}
            }
        ]
    },
    "body_text": [],
    "ref_entries": {},
    "back_matter": [],
    "bib_entries": {}
}