{
    "paper_id": "d3340772bfc66b9b344bf6ada7abba6939512833",
    "metadata": {
        "title": "Description of a Hospital Outbreak of Middle East Respiratory Syndrome in a Large Tertiary Care Hospital in Saudi Arabia",
        "authors": [
            {
                "first": "Hanan",
                "middle": [
                    "H"
                ],
                "last": "Balkhy",
                "suffix": "",
                "affiliation": {},
                "email": ""
            },
            {
                "first": ";",
                "middle": [],
                "last": "",
                "suffix": "",
                "affiliation": {},
                "email": ""
            },
            {
                "first": "Thamer",
                "middle": [
                    "H"
                ],
                "last": "Alenazi",
                "suffix": "",
                "affiliation": {},
                "email": ""
            },
            {
                "first": "Majid",
                "middle": [
                    "M"
                ],
                "last": "Alshamrani",
                "suffix": "",
                "affiliation": {},
                "email": ""
            },
            {
                "first": "Henry",
                "middle": [],
                "last": "Baffoe-Bonnie",
                "suffix": "",
                "affiliation": {},
                "email": ""
            },
            {
                "first": "Yaseen",
                "middle": [],
                "last": "Arabi",
                "suffix": "",
                "affiliation": {},
                "email": ""
            },
            {
                "first": "Raed",
                "middle": [],
                "last": "Hijazi",
                "suffix": "",
                "affiliation": {},
                "email": ""
            },
            {
                "first": "Hail",
                "middle": [
                    "M"
                ],
                "last": "Al-Abdely",
                "suffix": "",
                "affiliation": {},
                "email": ""
            },
            {
                "first": "Aiman",
                "middle": [],
                "last": "El-Saed",
                "suffix": "",
                "affiliation": {},
                "email": ""
            },
            {
                "first": "Sameera",
                "middle": [],
                "last": "Al Johani",
                "suffix": "",
                "affiliation": {},
                "email": ""
            },
            {
                "first": "Abdullah",
                "middle": [
                    "M"
                ],
                "last": "Assiri",
                "suffix": "",
                "affiliation": {},
                "email": ""
            },
            {
                "first": "Abdulaziz",
                "middle": [],
                "last": "Bin Saeed",
                "suffix": "",
                "affiliation": {},
                "email": ""
            }
        ]
    },
    "abstract": [
        {
            "text": "9 Abdulaziz bin Saeed, MD, PhD 7,10 background. Since the first isolation of Middle East respiratory syndrome coronavirus (MERS-CoV) in Saudi Arabia in 2012, sporadic cases, clusters, and sometimes large outbreaks have been reported. objective. To describe the recent (2015) MERS-CoV outbreak at a large tertiary care hospital in Riyadh, Saudi Arabia.",
            "cite_spans": [],
            "ref_spans": [],
            "section": "Abstract"
        },
        {
            "text": "methods. We conducted an epidemiologic outbreak investigation, including case finding and contact tracing and screening. MERS-CoV cases were categorized as suspected, probable, and confirmed. A confirmed case was defined as positive reverse transcription polymerase chain reaction test for MERS-CoV.",
            "cite_spans": [],
            "ref_spans": [],
            "section": "Abstract"
        },
        {
            "text": "results. Of the 130 suspected cases, 81 (62%) were confirmed and 49 (38%) were probable. These included 87 patients (67%) and 43 healthcare workers (33%). Older age (mean [SD], 64.4 [18.3] vs 40.1 [11.3] years, P < .001), symptoms (97% vs 58%, P < .001), and comorbidity (99% vs 42%, P < .001) were more common in patients than healthcare workers. Almost all patients (97%) were hospitalized whereas most healthcare workers (72%) were home isolated. Among 96 hospitalized cases, 63 (66%) required intensive care unit management and 60 (63%) required mechanical ventilation. Among all 130 cases, 51 (39%) died; all were patients (51 [59%]) with no deaths among healthcare workers. More than half (54%) of infections were believed to be caught at the emergency department. Strict infection control measures, including isolation and closure of the emergency department, were implemented to interrupt the chain of transmission and end the outbreak.",
            "cite_spans": [],
            "ref_spans": [],
            "section": "Abstract"
        },
        {
            "text": "conclusion. MERS-CoV remains a major healthcare threat. Early recognition of cases and rapid implementation of infection control measures are necessary.",
            "cite_spans": [],
            "ref_spans": [],
            "section": "Abstract"
        }
    ],
    "body_text": [
        {
            "text": "Since the first diagnosis of Middle East respiratory syndrome (MERS), caused by the MERS coronavirus (MERS-CoV), in 2012 in Saudi Arabia, 1 1,283 laboratory-confirmed cases of MERS-CoV have been reported in Saudi Arabia as of December 31, 2015, including at least 551 related deaths with approximate case fatality of 43%. 2 This represented approximately 80% of the total number of globally reported cases of MERS-CoV. 3 According to the Saudi Ministry of Health, 45% of the reported cases were classified as healthcare-acquired infections among either patients or healthcare workers (HCWs). 2 Although sporadic cases have been reported in Saudi hospitals during the past 3 years, MERS-CoV infections in healthcare settings are frequently seen as small clusters or sometimes large outbreaks. 4 For example, small clusters including a total of 23 cases have been detected in 3 healthcare facilities in the Eastern region between April and May 2013. 5 Additionally, a large hospital outbreak with 255 cases has been reported from multiple hospitals in Jeddah in the first half of 2014 with the peak between March and April 2014. 6 The recent Korean outbreak that involved 186 MERS-CoV cases, including 36 deaths, has further raised the global concern of the possibility of large hospital outbreaks even with only one or a few community cases. 7, 8 In June 2013, the first case of MERS-CoV infection was confirmed at our hospital, King Abdulaziz Medical City, Riyadh (KAMC-R). Since then, a total of 32 patients and 14 HCWs have had confirmed MERS-CoV infections through early March 2015. 9 The cases were distributed as sporadic cases and small clusters. In late June 2015 (3.5 months from the last recognized MERS-CoV case in our hospital), the emergency department (ED) evaluated the first case of the current outbreak, which was ongoing through early September 2015.",
            "cite_spans": [
                {
                    "start": 138,
                    "end": 139,
                    "text": "1",
                    "ref_id": "BIBREF1"
                },
                {
                    "start": 322,
                    "end": 323,
                    "text": "2",
                    "ref_id": "BIBREF2"
                },
                {
                    "start": 419,
                    "end": 420,
                    "text": "3",
                    "ref_id": "BIBREF3"
                },
                {
                    "start": 592,
                    "end": 593,
                    "text": "2",
                    "ref_id": "BIBREF2"
                },
                {
                    "start": 792,
                    "end": 793,
                    "text": "4",
                    "ref_id": "BIBREF4"
                },
                {
                    "start": 948,
                    "end": 949,
                    "text": "5",
                    "ref_id": "BIBREF5"
                },
                {
                    "start": 1127,
                    "end": 1128,
                    "text": "6",
                    "ref_id": "BIBREF6"
                },
                {
                    "start": 1341,
                    "end": 1343,
                    "text": "7,",
                    "ref_id": "BIBREF7"
                },
                {
                    "start": 1344,
                    "end": 1345,
                    "text": "8",
                    "ref_id": "BIBREF8"
                },
                {
                    "start": 1586,
                    "end": 1587,
                    "text": "9",
                    "ref_id": "BIBREF9"
                }
            ],
            "ref_spans": [],
            "section": ""
        },
        {
            "text": "The objective of the current study was to describe the 2015 KAMC-R outbreak, with special attention to the differences in the course and outcomes between patients and HCWs.",
            "cite_spans": [],
            "ref_spans": [],
            "section": ""
        },
        {
            "text": "The current study was conducted at KAMC-R, which is an approximately 1,000-bed tertiary care facility. The ED is a 150-bed multisection complex area that serves more than 250,000 visits a year. There are 13 different intensive care units (ICUs) in the institution with a bed capacity of 185 serving approximately 3,000 admissions and 57,000 patient-days of care every year. Additionally, other specialties are covered in 36 wards serving approximately 27,000 admissions and 244,000 patient-days of care every year. KAMC-R provides healthcare services to approximately 750,000 Saudi National Guard soldiers, employees, and their families. The care provided ranges from primary and preventive care to tertiary care. Approximately 9,170 HCWs were working for KAMC-R in jobs that involve direct patient care, including approximately 1,670 physicians, 4,660 nurses, and 2,840 other HCWs. Additionally, another 3,400 individuals were working for KAMC-R in administrative jobs that involve no direct patient care. The data about the served population and HCWs of KAMC-R were obtained from the annual census reports for 2013 and 2014.",
            "cite_spans": [],
            "ref_spans": [],
            "section": "Setting"
        },
        {
            "text": "The current study design was a prospective surveillance study for all suspected patients and exposed HCWs at KAMC-R during the outbreak period, mid-June to mid-September, 2015.",
            "cite_spans": [],
            "ref_spans": [],
            "section": "Study Design"
        },
        {
            "text": "The population screened in the current study was suspected patients either admitted or evaluated at the ED as well as exposed HCWs. The case definition used was based on the definition update released by the Saudi Ministry of Health in June 2015. 10 Suspected patients were defined as those who had fever and/or respiratory symptoms or received a diagnosis of pneumonia (community-acquired or healthcare-acquired) based on clinical or radiologic evidence, with or without documented exposure to camels or to a confirmed/probable case of MERS-CoV infection in the previous 2 weeks. Exposed HCWs were defined as those who had been working in any department of KAMC-R during the outbreak period (mid-June to mid-September, 2015) and who had direct exposure (within 2 meters) or indirect exposure (being in the same room/department) to a confirmed or probable case of MERS-CoV infection within the previous 2 weeks with or without symptoms. A probable case was defined as a suspected patient or exposed HCW with inconclusive laboratory results (such as lack of confirmation by the Ministry of Health central laboratory, or having positive polymerase chain reaction on only 1 of the 2 genomic targets). A confirmed case was defined as a suspected patient or exposed HCW who had a positive reverse transcriptionpolymerase chain reaction test for MERS-CoV (Real-Time RT-PCR Kit; TibMolbiol). The sensitivity and specificity of the test were determined locally at 96% and 95%, respectively.",
            "cite_spans": [
                {
                    "start": 247,
                    "end": 249,
                    "text": "10",
                    "ref_id": "BIBREF10"
                }
            ],
            "ref_spans": [],
            "section": "Case Definition"
        },
        {
            "text": "Once a case was classified as probable or confirmed, a list of all exposed HCWs and/or patients was generated (by respective department and/or HCWs) and contact tracing was started. Nasopharyngeal swab samples were obtained from all exposed HCWs and nasopharyngeal swab samples or other appropriate types of specimens were obtained from all exposed/suspected patients. Once a case was classified as probable or confirmed, infection preventionists collected demographic information, exposure, medical history, symptoms, and outcome.",
            "cite_spans": [],
            "ref_spans": [],
            "section": "Case Finding"
        },
        {
            "text": "As the first 2 cases were admitted on June 21 and July 15, respectively, the preexisting Infectious Disease Epidemic Plan, which was established by the local hospital outbreak committee on the basis of US Centers for Disease Control and Prevention 11 and World Health Organization 12 guidelines, was activated during the week of August 2. The plan included strict enforcing of infection control measures, including droplet/ contact isolation for suspected and probable cases and airborne/contact isolation for confirmed cases in addition to strict hand hygiene compliance. As the situation escalated, stricter measures were implemented, including airborne/ contact isolation for suspected/probable cases. Because of ongoing identification of new cases, the plan was escalated on August 18, 2015, to the highest level-that is, level 3, which includes closure of the ED, cancellation of elective surgical procedures, and suspension of all outpatient appointments and visits. Complete evacuation of the ED was achieved on August 22, 2015. With shutdown of the hospital services and engineering modifications, more locations (ICUs and wards) were dedicated for isolation and more rooms were converted to negative pressure rooms. Probable or confirmed HCWs were allowed to return to work after having a symptom-free week in addition to at least 1 negative reverse transcription-polymerase chain reaction test. The end of the outbreak was declared on September 28, 2015, after the completion of two 14-day incubation periods without further identification of new cases.",
            "cite_spans": [
                {
                    "start": 248,
                    "end": 250,
                    "text": "11",
                    "ref_id": "BIBREF11"
                }
            ],
            "ref_spans": [],
            "section": "Control Measures"
        },
        {
            "text": "The number of MERS-CoV cases was plotted against weeks of onset of symptoms between mid-June and mid-September, 2015, to create the epidemic curve. For asymptomatic cases, the date of onset was replaced by the date of sample collection. Series of epidemic curve were further stratified by the type of case, diagnostic classification, symptoms, location of isolation, and different outcome measures. Because the screening and the behavior of the MERS-CoV infection was considerably different in patients and HCWs, we compared demographic information, symptoms, medical history, and outcome measures between both groups. The \u03c7 2 or Fisher exact test, as appropriate, was used to test significant differences of categorical variables between the 2 study groups. The t test or Mann-Whitney test, as appropriate, was used to test significant differences of continuous variables between the 2 study groups. All P values were 2-tailed and P < .05 was considered significant. SPSS, version 22.0 (IBM), was used for all statistical analyses.",
            "cite_spans": [],
            "ref_spans": [],
            "section": "Statistical Methods"
        },
        {
            "text": "During the outbreak period, a total of 130 cases, including 87 patients (67%) and 43 HCWs (33%), were diagnosed as confirmed (n = 81) or probable (n = 49) MERS-CoV infection. The demographic characteristics and classification of cases are shown in Table 1 , P = .03), with no significant difference in the percentage of obesity between the 2 groups. The patients were either National Guard Health Affairs employees (23%) or their dependents (41%), and approximately one-third (36%) of the patients were not from the official National Guard Health Affairs served population. The majority (63%) of HCWs were nurses, and the rest were either physicians (12%) or other HCWs (26%), mainly patient care technicians and respiratory therapists. The majority (47%) of HCWs were working at the ED, while the rest were working in wards (23%), outpatient clinics (9%), ICUs (9%), and multiple locations within the KAMC-R (12%). The majority (86%) of HCWs were discovered after screening of exposed HCWs, with 37 (1.2%) positive of 2,992 processed swabs. The majority (77%) of patients were classified as confirmed cases whereas the majority (67%) of HCWs were classified as probable (P < .001). Whereas all HCW infections (n = 43) were classified as healthcare-acquired, one-third (n = 29) of patients had community-acquired infection and two-thirds (n = 58) had healthcare-acquired infection. As shown in Figure 1A , the community-acquired infections started the outbreak and continued through the peak. On the other hand, healthcare-acquired infections were the majority of cases during the center of the outbreak and the only type of transmission toward its end. Of the healthcare-acquired infections, more than half (54%) were believed to be caught at the ED and 24% were caught at wards. Although decreasing during the second half of the outbreak, transmission at the ED occurred throughout the outbreak (Fig. 1B) .",
            "cite_spans": [],
            "ref_spans": [
                {
                    "start": 248,
                    "end": 255,
                    "text": "Table 1",
                    "ref_id": null
                },
                {
                    "start": 1394,
                    "end": 1403,
                    "text": "Figure 1A",
                    "ref_id": "FIGREF0"
                },
                {
                    "start": 1897,
                    "end": 1906,
                    "text": "(Fig. 1B)",
                    "ref_id": "FIGREF0"
                }
            ],
            "section": "results"
        },
        {
            "text": "As shown in Table 2 , 84% of all cases were symptomatic, with higher frequency of symptomatic cases among patients than HCWs (97% vs 58%, P < .001). Additionally, among symptomatic cases, patient reported higher mean (SD) number of all symptoms ( 3], P = .54) compared with HCWs. Eighteen of the 21 asymptomatic cases (detected during contact screening) were HCWs. As the frequency of HCWs relatively increased towards the end of the outbreak ( Fig. 2A) , the frequency of probable diagnosis (and asymptomatic cases) relatively increased towards the end of the outbreak (Fig. 2B) .",
            "cite_spans": [],
            "ref_spans": [
                {
                    "start": 12,
                    "end": 19,
                    "text": "Table 2",
                    "ref_id": "TABREF2"
                },
                {
                    "start": 445,
                    "end": 453,
                    "text": "Fig. 2A)",
                    "ref_id": "FIGREF1"
                },
                {
                    "start": 570,
                    "end": 579,
                    "text": "(Fig. 2B)",
                    "ref_id": "FIGREF1"
                }
            ],
            "section": "results"
        },
        {
            "text": "Overall, respiratory symptoms (95%), especially shortness of breath (73%) and/or cough (68%), were the most common symptoms reported, followed by fever (81%), other constitutional symptoms (61%), and gastrointestinal symptoms (39%). For respiratory symptoms, patients reported more shortness of breath (P < .01) but less sore throat (P = .03) compared with HCWs. For other symptoms, patients reported more gastrointestinal symptoms (P < .01) and dizziness or decreased level of consciousness (P = .03) compared with HCWs. In all cases, respiratory symptoms (71%) and/or fever (41%) were by far the most frequently starting symptoms.",
            "cite_spans": [],
            "ref_spans": [],
            "section": "results"
        },
        {
            "text": "As shown in Table 3 , patients had clearly more comorbidity than HCWs in terms of its presence (99% vs 42%, P < .001) or the number of comorbid diseases (5.6 [2.3] vs 2.0 [1.1], P < .001). The most common diseases among patients were hypertension (81%), diabetes (78%), heart disease (52%), chronic kidney disease (44%), immunosuppressive disease (41%), neurologic disease including stroke (28%), respiratory disease (25%), cancer (22%), and dyslipidemia (20%). All these diseases were significantly higher among patients than HCWs with the exception of respiratory diseases, which were not significantly different between groups.",
            "cite_spans": [],
            "ref_spans": [
                {
                    "start": 12,
                    "end": 19,
                    "text": "Table 3",
                    "ref_id": "TABREF3"
                }
            ],
            "section": "results"
        },
        {
            "text": "Of the 130 cases, 96 (74%) were hospitalized and 34 (26%) were home isolated (Table 4 ). Almost all patients (97%) were hospitalized whereas the majority (72%) of HCWs were home isolated. Among all 130 cases, 51 (39%) died; these deaths represented 59% of patients and 61% of those who had been hospitalized. No deaths occurred among HCWs. The death Figures 2C and 2D , respectively.",
            "cite_spans": [],
            "ref_spans": [
                {
                    "start": 77,
                    "end": 85,
                    "text": "(Table 4",
                    "ref_id": "TABREF4"
                },
                {
                    "start": 350,
                    "end": 367,
                    "text": "Figures 2C and 2D",
                    "ref_id": "FIGREF1"
                }
            ],
            "section": "results"
        },
        {
            "text": "We are reporting a large hospital outbreak affecting both patients and HCWs at a major tertiary care hospital in Riyadh. Although the attack rate among HCWs was reported to be lower than patients and family contacts, 13 HCWs represented a significant proportion of all detected cases of MERS-CoV in the current study and elsewhere. One-third of the confirmed cases in the current outbreak were HCWs. This was similar to what was observed in the Jeddah outbreak, where 31% of the 255 confirmed cases were HCWs. 14 Additionally, 40% of the 55 MERS-CoV cases reviewed in the United Arab Emirates were HCWs. 15 However, it was considerably higher than seen in other outbreaks: 13% in the Eastern region outbreak and 14% in the Korean outbreak. 5, 8 Additionally, a review of the 99 cases detected after more than 5,000 screenings over a year in Saudi Arabia found that 19% were HCWs. 13 One reason that may explain the high proportion of HCWs at the time of outbreak, including in the current study, is the active screening for patient contacts, mass screening of certain units that harbor patients, and proactive screening of anxious HCWs. Additionally, the higher than expected (from previous outbreaks) number of community cases of MERS-CoV may have amplified transmission and increased the risk of HCWs. More than half of the healthcare-acquired infections in the current study were identified in the ED, a 150-bed multisection complex that served more than 800 visits per day during the outbreak. Factors that facilitated the spread of infection in and from the ED included the extreme overcrowding, uncontrolled patient movement, high visitor traffic, non-strict compliance with infection control recommendations, late recognition/isolation of some cases, and HCWs serving on both ED and other hospital locations. This was closely similar to the conditions believed to have contributed to the rapid spread of MERS-CoV in several hospitals in Saudi Arabia and South Korea. 4, 16 For example, combinations of several contributing factors, such as crowded ED environment, close and unprotected contacts with a symptomatic case, and possibly fomite transmission, have been suggested as causes in the Korean outbreak. 16 Additionally, the ED received during the outbreak more than the expected number of community cases of MERS-CoV, which amplified ED transmission. This observation is also supported by the fact that there was an immediate decrease in new cases just after closure of the ED. Moreover, the commitment of KAMC-R to care for eligible patients regardless of the availability of beds and for noneligible cases in case of emergency, in addition to the lack of a divergence system, made this outbreak inevitable with difficult containment.",
            "cite_spans": [
                {
                    "start": 217,
                    "end": 219,
                    "text": "13",
                    "ref_id": "BIBREF13"
                },
                {
                    "start": 604,
                    "end": 606,
                    "text": "15",
                    "ref_id": "BIBREF15"
                },
                {
                    "start": 740,
                    "end": 742,
                    "text": "5,",
                    "ref_id": "BIBREF5"
                },
                {
                    "start": 743,
                    "end": 744,
                    "text": "8",
                    "ref_id": "BIBREF8"
                },
                {
                    "start": 880,
                    "end": 882,
                    "text": "13",
                    "ref_id": "BIBREF13"
                },
                {
                    "start": 1974,
                    "end": 1976,
                    "text": "4,",
                    "ref_id": "BIBREF4"
                },
                {
                    "start": 1977,
                    "end": 1979,
                    "text": "16",
                    "ref_id": "BIBREF16"
                },
                {
                    "start": 2215,
                    "end": 2217,
                    "text": "16",
                    "ref_id": "BIBREF16"
                }
            ],
            "ref_spans": [],
            "section": "discussion"
        },
        {
            "text": "The current study reconfirmed significant differences between the MERS-CoV course and outcome among patients and HCWs at a healthcare setting. Obviously, HCWs were younger, healthier, and with fewer comorbidities. Additionally, HCWs had a less severe version of the disease, as indicated by the higher frequency of asymptomatic cases and probable diagnosis. This may have reflected more intensive ascertainment rather than different disease behavior. For example, HCWs working in areas like ED and the dialysis unit were mass-screened to detect cases that otherwise would have been missed. Additionally, anxious HCWs were closely monitoring their symptoms and sought help frequently before they turned positive. This explanation was supported by the lack of major differences in the frequency of fever and respiratory symptoms among symptomatic cases of both patients and HCWs. One of the most striking finding of the current study, yet previously reported, is the high mortality among patients and lack of such mortality among HCWs. Similarly, there was higher mortality among confirmed cases (mainly patients) than probable cases (mainly HCWs). This may reflect the younger age, better health, and earlier diagnosis among HCWs. This difference may reflect a detection bias that is typically seen in hospital outbreaks and may not be controlled except in a planned study design. The current 39% overall mortality and 59% patient mortality were similar to the Jeddah outbreak, where overall mortality was 36% and patient mortality was 59%. 14 Additionally, the overall mortality among accumulated cases in Saudi Arabia during the past 3 years was 43%. 2 However, the current mortality numbers were much higher than reported in the Korean outbreak, where 36 (19%) of the 186 died. 8 Interestingly, the mortality was 40% in the first half of the Korean outbreak before it significantly decreased at the end of outbreak. 17 This was explained by the possibility of a better ascertainment rate and the infection of younger, healthier individuals in the second half of the outbreak. 17 The mortality difference between the current and the Korean outbreaks may also reflect the higher comorbidity (80% vs 55%) and symptomatic disease (81% vs 74% for fever and 68% vs 18% for cough) in the current outbreak compared with the Korean outbreak. 8 The current outbreak reemphasizes the fact that MERS-CoV remains a major threat to advanced healthcare settings with a high possibility of hospital outbreaks. These outbreaks are costly in terms of lives, healthcare resources, and health service continuity. Early recognition of cases and rapid implementation of recommended infection control guidance is necessary to prevent and/or reduce the impact of healthcare-associated outbreaks, including MERS-CoV. However, most healthcare systems need to place drastic efforts into revamping national .32 Ventilation days, mean (SD) b 11.1 (11.9) 14.6 (6.7) 11.4 (11.6) .13 Hospital days before death, mean (SD) 34.9 (99.1) 34.9 (99.1) NA ICU days before death, mean (SD) 9 .0 (7.6) 9.0 (7.6) NA NOTE. The column heads represent the maximum number; the denominator was sometimes lower when data were missing. HCW, healthcare worker; ICU, intensive care unit; KAMC, King Abdulaziz Medical City; MERS-CoV, Middle East respiratory syndrome coronavirus. a Mann-Whitney test. b Two HCW data outliers were removed from analysis.",
            "cite_spans": [
                {
                    "start": 1780,
                    "end": 1781,
                    "text": "8",
                    "ref_id": "BIBREF8"
                },
                {
                    "start": 1918,
                    "end": 1920,
                    "text": "17",
                    "ref_id": "BIBREF17"
                },
                {
                    "start": 2078,
                    "end": 2080,
                    "text": "17",
                    "ref_id": "BIBREF17"
                },
                {
                    "start": 2335,
                    "end": 2336,
                    "text": "8",
                    "ref_id": "BIBREF8"
                },
                {
                    "start": 2913,
                    "end": 2914,
                    "text": "b",
                    "ref_id": null
                },
                {
                    "start": 3052,
                    "end": 3053,
                    "text": "9",
                    "ref_id": "BIBREF9"
                }
            ],
            "ref_spans": [],
            "section": "discussion"
        },
        {
            "text": "healthcare systems so that holistic infection control programs are adopted and not limited to the basics of hand hygiene and personal protective equipment. 18 acknowledgments",
            "cite_spans": [
                {
                    "start": 156,
                    "end": 158,
                    "text": "18",
                    "ref_id": "BIBREF18"
                }
            ],
            "ref_spans": [],
            "section": "discussion"
        }
    ],
    "bib_entries": {
        "BIBREF0": {
            "ref_id": "b0",
            "title": "Waseem Khan, and Yahya Bakheet. Financial support. None reported. Potential conflicts of interest. All authors report no conflicts of interest relevant to this article. Address correspondence to Hanan Balkhy, MD, Infection Prevention and Control Department",
            "authors": [
                {
                    "first": "Bassema",
                    "middle": [],
                    "last": "Shadfan",
                    "suffix": ""
                },
                {
                    "first": "Dina",
                    "middle": [],
                    "last": "Afurong",
                    "suffix": ""
                },
                {
                    "first": "Eman",
                    "middle": [],
                    "last": "Mazroa",
                    "suffix": ""
                },
                {
                    "first": "Fatimah",
                    "middle": [],
                    "last": "Abdulkarim",
                    "suffix": ""
                },
                {
                    "first": "Francesca",
                    "middle": [],
                    "last": "Bambilla",
                    "suffix": ""
                },
                {
                    "first": "Gassem",
                    "middle": [],
                    "last": "Anizi",
                    "suffix": ""
                },
                {
                    "first": "Hisham",
                    "middle": [],
                    "last": "Eid",
                    "suffix": ""
                },
                {
                    "first": "Irma",
                    "middle": [],
                    "last": "Trofeo",
                    "suffix": ""
                },
                {
                    "first": "Joseph",
                    "middle": [],
                    "last": "Tannous",
                    "suffix": ""
                },
                {
                    "first": "Kassem",
                    "middle": [],
                    "last": "Yassine",
                    "suffix": ""
                },
                {
                    "first": "Kassem",
                    "middle": [],
                    "last": "Zehri",
                    "suffix": ""
                },
                {
                    "first": "Khalid",
                    "middle": [
                        "Al"
                    ],
                    "last": "Qahtani",
                    "suffix": ""
                },
                {
                    "first": "Khawla",
                    "middle": [],
                    "last": "Salman",
                    "suffix": ""
                }
            ],
            "year": null,
            "venue": "King Abdulaziz Medical City",
            "volume": "",
            "issn": "",
            "pages": "",
            "other_ids": {}
        },
        "BIBREF1": {
            "ref_id": "b1",
            "title": "Isolation of a novel coronavirus from a man with pneumonia in Saudi Arabia",
            "authors": [
                {
                    "first": "A",
                    "middle": [
                        "M"
                    ],
                    "last": "Zaki",
                    "suffix": ""
                },
                {
                    "first": "S",
                    "middle": [],
                    "last": "Van Boheemen",
                    "suffix": ""
                },
                {
                    "first": "T",
                    "middle": [
                        "M"
                    ],
                    "last": "Bestebroer",
                    "suffix": ""
                },
                {
                    "first": "A",
                    "middle": [
                        "D"
                    ],
                    "last": "Osterhaus",
                    "suffix": ""
                },
                {
                    "first": "R",
                    "middle": [
                        "A"
                    ],
                    "last": "Fouchier",
                    "suffix": ""
                }
            ],
            "year": 2012,
            "venue": "N Engl J Med",
            "volume": "367",
            "issn": "",
            "pages": "1814--1820",
            "other_ids": {}
        },
        "BIBREF2": {
            "ref_id": "b2",
            "title": "Saudi Ministry of Health. MERS-CoV daily updates",
            "authors": [],
            "year": 2015,
            "venue": "",
            "volume": "",
            "issn": "",
            "pages": "",
            "other_ids": {}
        },
        "BIBREF3": {
            "ref_id": "b3",
            "title": "Middle East respiratory syndrome coronavirus (MERS-CoV)-Saudi Arabia",
            "authors": [],
            "year": 2015,
            "venue": "",
            "volume": "",
            "issn": "",
            "pages": "",
            "other_ids": {}
        },
        "BIBREF4": {
            "ref_id": "b4",
            "title": "Middle East respiratory syndrome coronavirus in healthcare settings",
            "authors": [
                {
                    "first": "J",
                    "middle": [
                        "A"
                    ],
                    "last": "Al-Tawfiq",
                    "suffix": ""
                },
                {
                    "first": "T",
                    "middle": [
                        "M"
                    ],
                    "last": "Perl",
                    "suffix": ""
                }
            ],
            "year": 2015,
            "venue": "Curr Opin Infect Dis",
            "volume": "28",
            "issn": "",
            "pages": "392--396",
            "other_ids": {}
        },
        "BIBREF5": {
            "ref_id": "b5",
            "title": "Hospital outbreak of Middle East respiratory syndrome coronavirus",
            "authors": [
                {
                    "first": "A",
                    "middle": [],
                    "last": "Assiri",
                    "suffix": ""
                },
                {
                    "first": "A",
                    "middle": [],
                    "last": "Mcgeer",
                    "suffix": ""
                },
                {
                    "first": "T",
                    "middle": [
                        "M"
                    ],
                    "last": "Perl",
                    "suffix": ""
                }
            ],
            "year": 2013,
            "venue": "N Engl J Med",
            "volume": "369",
            "issn": "",
            "pages": "407--416",
            "other_ids": {}
        },
        "BIBREF6": {
            "ref_id": "b6",
            "title": "An observational, laboratory-based study of outbreaks of Middle East respiratory syndrome coronavirus in Jeddah and Riyadh, Kingdom of Saudi Arabia",
            "authors": [
                {
                    "first": "C",
                    "middle": [],
                    "last": "Drosten",
                    "suffix": ""
                },
                {
                    "first": "D",
                    "middle": [],
                    "last": "Muth",
                    "suffix": ""
                },
                {
                    "first": "V",
                    "middle": [
                        "M"
                    ],
                    "last": "Corman",
                    "suffix": ""
                }
            ],
            "year": 2014,
            "venue": "Clin Infect Dis",
            "volume": "60",
            "issn": "",
            "pages": "369--377",
            "other_ids": {}
        },
        "BIBREF7": {
            "ref_id": "b7",
            "title": "Korean Society of Infectious Diseases. An unexpected outbreak of Middle East respiratory syndrome coronavirus infection in the Republic of Korea",
            "authors": [],
            "year": 2015,
            "venue": "Infect Chemother",
            "volume": "47",
            "issn": "",
            "pages": "120--122",
            "other_ids": {}
        },
        "BIBREF8": {
            "ref_id": "b8",
            "title": "Middle East respiratory syndrome coronavirus outbreak in the Republic of Korea",
            "authors": [],
            "year": 2015,
            "venue": "Korea Centers for Disease Control and Prevention",
            "volume": "6",
            "issn": "",
            "pages": "269--278",
            "other_ids": {}
        },
        "BIBREF9": {
            "ref_id": "b9",
            "title": "Middle East respiratory syndrome coronavirus (MERS-Cov) screening of exposed healthcare workers in a tertiary care hospital in Saudi Arabia",
            "authors": [
                {
                    "first": "K",
                    "middle": [],
                    "last": "Alameer",
                    "suffix": ""
                },
                {
                    "first": "B",
                    "middle": [],
                    "last": "Abukhzam",
                    "suffix": ""
                },
                {
                    "first": "W",
                    "middle": [],
                    "last": "Khan",
                    "suffix": ""
                },
                {
                    "first": "A",
                    "middle": [],
                    "last": "El-Saed",
                    "suffix": ""
                },
                {
                    "first": "H",
                    "middle": [],
                    "last": "Balkhy",
                    "suffix": ""
                }
            ],
            "year": 2015,
            "venue": "Antimicrob Resist Infect Control",
            "volume": "4",
            "issn": "",
            "pages": "57--57",
            "other_ids": {}
        },
        "BIBREF10": {
            "ref_id": "b10",
            "title": "Saudi Ministry of Health. Case definition and surveillance guidance-updated",
            "authors": [],
            "year": 2015,
            "venue": "",
            "volume": "",
            "issn": "",
            "pages": "",
            "other_ids": {}
        },
        "BIBREF11": {
            "ref_id": "b11",
            "title": "Interim infection prevention and control recommendations for hospitalized patients with Middle East respiratory syndrome coronavirus (MERS-CoV)",
            "authors": [],
            "year": null,
            "venue": "Centers for Disease Control and Prevention (CDC)",
            "volume": "",
            "issn": "",
            "pages": "",
            "other_ids": {}
        },
        "BIBREF12": {
            "ref_id": "b12",
            "title": "Infection prevention and control of epidemic-and pandemic-prone acute respiratory diseases in health care",
            "authors": [],
            "year": 2007,
            "venue": "",
            "volume": "",
            "issn": "",
            "pages": "",
            "other_ids": {}
        },
        "BIBREF13": {
            "ref_id": "b13",
            "title": "Screening for Middle East respiratory syndrome coronavirus infection in hospital patients and their healthcare worker and family contacts: a prospective descriptive study",
            "authors": [
                {
                    "first": "Z",
                    "middle": [
                        "A"
                    ],
                    "last": "Memish",
                    "suffix": ""
                },
                {
                    "first": "J",
                    "middle": [
                        "A"
                    ],
                    "last": "Al-Tawfiq",
                    "suffix": ""
                },
                {
                    "first": "H",
                    "middle": [
                        "Q"
                    ],
                    "last": "Makhdoom",
                    "suffix": ""
                }
            ],
            "year": 2014,
            "venue": "Clin Microbiol Infect",
            "volume": "20",
            "issn": "",
            "pages": "469--474",
            "other_ids": {}
        },
        "BIBREF14": {
            "ref_id": "b14",
            "title": "MERS-CoV outbreak in Jeddah-a link to health care facilities",
            "authors": [
                {
                    "first": "I",
                    "middle": [
                        "K"
                    ],
                    "last": "Oboho",
                    "suffix": ""
                },
                {
                    "first": "S",
                    "middle": [
                        "M"
                    ],
                    "last": "Tomczyk",
                    "suffix": ""
                },
                {
                    "first": "A",
                    "middle": [
                        "M"
                    ],
                    "last": "Al-Asmari",
                    "suffix": ""
                }
            ],
            "year": 2014,
            "venue": "N Engl J Med",
            "volume": "372",
            "issn": "",
            "pages": "846--854",
            "other_ids": {}
        },
        "BIBREF15": {
            "ref_id": "b15",
            "title": "Acute Middle East respiratory syndrome coronavirus: temporal lung changes observed on the chest radiographs of 55 patients",
            "authors": [
                {
                    "first": "K",
                    "middle": [
                        "M"
                    ],
                    "last": "Das",
                    "suffix": ""
                },
                {
                    "first": "E",
                    "middle": [
                        "Y"
                    ],
                    "last": "Lee",
                    "suffix": ""
                },
                {
                    "first": "S",
                    "middle": [
                        "E"
                    ],
                    "last": "Jawder",
                    "suffix": ""
                }
            ],
            "year": 2015,
            "venue": "AJR Am J Roentgenol",
            "volume": "205",
            "issn": "",
            "pages": "267--274",
            "other_ids": {}
        },
        "BIBREF16": {
            "ref_id": "b16",
            "title": "Middle East respiratory syndrome coronavirus (MERS-CoV): summary and risk assessment of current situation in the Republic of Korea and China, as of 19",
            "authors": [],
            "year": 2015,
            "venue": "",
            "volume": "",
            "issn": "",
            "pages": "",
            "other_ids": {}
        },
        "BIBREF17": {
            "ref_id": "b17",
            "title": "Estimating the risk of Middle East respiratory syndrome (MERS) death during the course of the outbreak in the Republic of Korea",
            "authors": [
                {
                    "first": "K",
                    "middle": [],
                    "last": "Mizumoto",
                    "suffix": ""
                },
                {
                    "first": "M",
                    "middle": [],
                    "last": "Saitoh",
                    "suffix": ""
                },
                {
                    "first": "G",
                    "middle": [],
                    "last": "Chowell",
                    "suffix": ""
                },
                {
                    "first": "Y",
                    "middle": [],
                    "last": "Miyamatsu",
                    "suffix": ""
                },
                {
                    "first": "H",
                    "middle": [],
                    "last": "Nishiura",
                    "suffix": ""
                }
            ],
            "year": 2015,
            "venue": "Intl J Infect Dis",
            "volume": "39",
            "issn": "",
            "pages": "7--9",
            "other_ids": {}
        },
        "BIBREF18": {
            "ref_id": "b18",
            "title": "MERS CoV: a trigger for healthcare transformation",
            "authors": [
                {
                    "first": "H",
                    "middle": [],
                    "last": "Balkhy",
                    "suffix": ""
                }
            ],
            "year": 2015,
            "venue": "J Infect Public Health",
            "volume": "9",
            "issn": "",
            "pages": "1--2",
            "other_ids": {}
        }
    },
    "ref_entries": {
        "FIGREF0": {
            "text": "Epidemic curves describing the transmission of Middle East respiratory syndrome coronavirus infection during the outbreak at King Abdulaziz Medical City-Riyadh (mid-June to mid-September, 2015) including type of transmission (A) and probable exposure location (B).",
            "latex": null,
            "type": "figure"
        },
        "FIGREF1": {
            "text": "Epidemic curves describing the characteristics of Middle East respiratory syndrome coronavirus cases during the outbreak at King Abdulaziz Medical City-Riyadh (mid-June to mid-September, 2015) including type of case (A), diagnostic classification (B), need for intensive care unit admission (C), and discharge status (D).",
            "latex": null,
            "type": "figure"
        },
        "TABREF0": {
            "text": ". The mean (SD) age of cases was 64.4(18.3)    table 1. Demographic Characteristics and Classification of MERS-CoV Cases at KAMC-Riyadh (Mid-June to Mid-September, 2015) NOTE. The column heads represent the maximum number; the denominator was sometimes lower when data were missing. BMI, body mass index (calculated as weight in kilograms divided by height in meters squared); HCW, healthcare worker; KAMC, King Abdulaziz Medical City; MERS-CoV, Middle East respiratory syndrome coronavirus; NGHA, National Guard Health Affairs. years, with patients having significantly older age than HCWs (56.3 [19.9] vs 40.1[11.3]  years, P < .001). Overall, males and females were equally represented but males represented the majority (64%) of patients whereas females represented the majority (77%) of HCWs (P < .001). The majority (94%) of patients were Saudi whereas the majority (84%) of HCWs were non-Saudi, mainly from the Philippines (P < .001). Patients had slightly higher body mass index (calculated as weight in kilograms divided by height in meters squared)",
            "latex": null,
            "type": "table"
        },
        "TABREF2": {
            "text": "Clinical Symptoms of MERS-CoV Cases at KAMC-Riyadh (Mid-June to Mid-September, 2015)",
            "latex": null,
            "type": "table"
        },
        "TABREF3": {
            "text": "Comorbidity of MERS-CoV cases at KAMC-Riyadh (mid-June to mid-September, 2015)",
            "latex": null,
            "type": "table"
        },
        "TABREF4": {
            "text": "Course and Outcome of MERS-CoV Cases at KAMC-Riyadh (Mid-June to Mid-September, 2015) Variable Patients (N = 87) HCWs (N = 43) Overall (N = 130) P value",
            "latex": null,
            "type": "table"
        }
    },
    "back_matter": []
}