{
    "paper_id": "b073cda95dea79db6973f9c1f84d4860f3bddf0e",
    "metadata": {
        "title": "Dynamics of Bacterial Colonization With Streptococcus pneumoniae, Haemophilus influenzae, and Moraxella catarrhalis During Symptomatic and Asymptomatic Viral Upper Respiratory Tract Infection",
        "authors": [
            {
                "first": "Gregory",
                "middle": [
                    "P"
                ],
                "last": "Demuri",
                "suffix": "",
                "affiliation": {},
                "email": ""
            },
            {
                "first": "James",
                "middle": [
                    "E"
                ],
                "last": "Gern",
                "suffix": "",
                "affiliation": {},
                "email": ""
            },
            {
                "first": "Jens",
                "middle": [
                    "C"
                ],
                "last": "Eickhoff",
                "suffix": "",
                "affiliation": {
                    "laboratory": "",
                    "institution": "University of Wisconsin",
                    "location": {
                        "settlement": "Madison"
                    }
                },
                "email": ""
            },
            {
                "first": "Susan",
                "middle": [
                    "V"
                ],
                "last": "Lynch",
                "suffix": "",
                "affiliation": {
                    "laboratory": "",
                    "institution": "University of California",
                    "location": {
                        "settlement": "San Francisco"
                    }
                },
                "email": ""
            },
            {
                "first": "Ellen",
                "middle": [
                    "R"
                ],
                "last": "Wald",
                "suffix": "",
                "affiliation": {},
                "email": ""
            }
        ]
    },
    "abstract": [
        {
            "text": "Virus is detected in about 80% of upper respiratory tract infections (URTIs) in children and is also detectable in the nasopharynx of 30% of asymptomatic children. The effect of asymptomatic viral infection on the dynamics of bacterial density and colonization of the nasopharynx has not been reported. The current study was performed to assess the presence and density of Streptococcus pneumoniae, Haemophilus influenzae, and Moraxella catarrhalis in the nasopharynx of 4-7-year-old children during URTI and when well.",
            "cite_spans": [],
            "ref_spans": [],
            "section": "Abstract"
        },
        {
            "text": "Methods. Nasal samples were obtained during 4 surveillance periods when children were asymptomatic and whenever they had symptoms of URTI. Respiratory viruses and bacterial pathogens were identified and quantified using polymerase chain reaction.",
            "cite_spans": [],
            "ref_spans": [],
            "section": "Abstract"
        },
        {
            "text": "Results. The proportion of children colonized with all 3 bacteria was higher during visits for acute URTI than during asymptomatic surveillance visits. Mean bacterial densities were significantly higher at all visits for all 3 pathogens when a virus was detected. The differences between the means were 1.0, 0.4, and 0.7 log 10 colony-forming unit equivalents per milliliter for S. pneumoniae, H. influenzae, and M. catarrhalis, respectively, compared with visits in which virus was not detected. The percentage of children colonized and density were also higher at asymptomatic visits in which virus was detected than at visits in which virus was not detected.",
            "cite_spans": [],
            "ref_spans": [],
            "section": "Abstract"
        },
        {
            "text": "Conclusion. The density and frequency of colonization with S. pneumoniae, H. influenzae, and M. catarrhalis in nasal wash samples increase during periods of both symptomatic and asymptomatic viral infection. Increases in bacterial colonization observed during asymptomatic viral infection were nearly the same magnitude as when children were symptomatic.",
            "cite_spans": [],
            "ref_spans": [],
            "section": "Abstract"
        },
        {
            "text": "PATIENTS AND METHODS",
            "cite_spans": [],
            "ref_spans": [],
            "section": "Abstract"
        },
        {
            "text": "Healthy children aged 48-96 months were recruited throughout the study period from 2 pediatric practices in Madison, Wisconsin, and followed up for 1 year. Children were excluded if they had an underlying condition, reported by the parent or noted in the medical record, that was likely to alter the natural history of URTI, including asthma, congenital or acquired immunodeficiency, craniofacial abnormalities, cystic fibrosis, allergic rhinitis, or a history of chronic sinusitis. Written, informed consent was secured, and assent was obtained from",
            "cite_spans": [],
            "ref_spans": [],
            "section": "Abstract"
        }
    ],
    "body_text": [
        {
            "text": "Upper respiratory tract infection (URTI) is the most common infectious disease of childhood and one of the most frequent indications for medical care [1] . Although URTIs are caused by respiratory viruses, the common local bacterial complications of URTI, acute otitis media, acute bacterial sinusitis and pneumonia, result from pathogenic bacteria found in the nose and nasopharynx. The current understanding of these complications is that viral URTI precedes bacterial infection and that alterations in mucosal conditions facilitate proliferation of bacteria in the respiratory tract and the development of secondary bacterial infections. Previous studies, performed using semiquantitative culture techniques, have supported this theory [2] [3] [4] . A virus is detected in about 80% of URTIs in children, but notably \u226530% of asymptomatic children will also have a detectable virus in the nasopharynx, depending on the population studied [5] [6] [7] [8] [9] . The effect of asymptomatic viral infection on the dynamics of bacterial colonization of the nasopharynx has not been reported. The objective of the current study was to prospectively investigate the frequency and density of bacterial colonization during periods of symptomatic and asymptomatic respiratory viral infection in an observational cohort of 4-7-year-old children.",
            "cite_spans": [
                {
                    "start": 150,
                    "end": 153,
                    "text": "[1]",
                    "ref_id": "BIBREF0"
                },
                {
                    "start": 739,
                    "end": 742,
                    "text": "[2]",
                    "ref_id": null
                },
                {
                    "start": 743,
                    "end": 746,
                    "text": "[3]",
                    "ref_id": "BIBREF3"
                },
                {
                    "start": 747,
                    "end": 750,
                    "text": "[4]",
                    "ref_id": "BIBREF4"
                },
                {
                    "start": 940,
                    "end": 943,
                    "text": "[5]",
                    "ref_id": "BIBREF5"
                },
                {
                    "start": 944,
                    "end": 947,
                    "text": "[6]",
                    "ref_id": "BIBREF6"
                },
                {
                    "start": 948,
                    "end": 951,
                    "text": "[7]",
                    "ref_id": "BIBREF7"
                },
                {
                    "start": 952,
                    "end": 955,
                    "text": "[8]",
                    "ref_id": "BIBREF8"
                },
                {
                    "start": 956,
                    "end": 959,
                    "text": "[9]",
                    "ref_id": "BIBREF9"
                }
            ],
            "ref_spans": [],
            "section": ""
        },
        {
            "text": "children \u22657 years of age. Subjects received a small stipend for participation. The study was approved by the University of Wisconsin Institutional Review Board.",
            "cite_spans": [],
            "ref_spans": [],
            "section": ""
        },
        {
            "text": "Nasal samples were obtained at entry and during 4 surveillance visits (February, April, September, and December) when children were asymptomatic as verified by study nurses. If respiratory symptoms were present, the surveillance visit was postponed for 2 weeks. Parents were instructed to call the study nurse at the first sign of a URTI, which was defined as \u226548 hours of respiratory symptoms, including nasal congestion, nasal discharge, or cough. Nasal samples were obtained on day 2-3 (range, day 1-9) of illness by the study nurse. and a recovery sample was obtained at about day 15. However, because of variability in scheduling, the recovery swab sample was obtained 10-42 days after onset of URTI. A clinical assessment at the time of the visit assured that symptoms reflected illness confined to the upper respiratory tract.",
            "cite_spans": [],
            "ref_spans": [],
            "section": "Procedures"
        },
        {
            "text": "Samples of nasal mucus were obtained using an established nose-blowing technique [10] [11] [12] . Saline nasal spray was sprayed into each of the child's nostrils. The study nurse then held a transparent plastic bag to the nose and occluded one of the nostrils, taking care to not touch the inside of the bag. The child was then instructed to blow their nose forcefully into the plastic bag. This procedure was then repeated with the other nostril. If children were unable to blow their nose, a sufficient sample was obtained by allowing the sprayed saline to drip into the plastic bag. The sample was placed in M4RT transport medium (Remel) and transported on ice to the processing laboratory.",
            "cite_spans": [
                {
                    "start": 81,
                    "end": 85,
                    "text": "[10]",
                    "ref_id": "BIBREF10"
                },
                {
                    "start": 86,
                    "end": 90,
                    "text": "[11]",
                    "ref_id": "BIBREF11"
                },
                {
                    "start": 91,
                    "end": 95,
                    "text": "[12]",
                    "ref_id": null
                }
            ],
            "ref_spans": [],
            "section": "Collection of Samples"
        },
        {
            "text": "Diagnostic virology was performed on nasal samples by multiplex polymerase chain reaction (PCR; Respiratory Multicode Assay [EraGen Biosciences] or Respiratory Viral Panel [Luminex] ) to test for the following viruses: respiratory syncytial virus (RSV; groups A and B), rhinovirus (RV; approximately 160 known types), parainfluenza (1, 2, 3, 4a and 4b), influenza (A, B and C), adenovirus (B, C and E), coronavirus (229E, NL63, OC43, HK, and severe acute respiratory syndrome), enterovirus, human bocavirus, and human metapneumovirus (A and B). Nasal specimens were also analyzed by means of partial sequencing to determine which RV types were present and differentiate closely related enterovirus from RV [13] .",
            "cite_spans": [
                {
                    "start": 172,
                    "end": 181,
                    "text": "[Luminex]",
                    "ref_id": null
                },
                {
                    "start": 706,
                    "end": 710,
                    "text": "[13]",
                    "ref_id": "BIBREF14"
                }
            ],
            "ref_spans": [],
            "section": "Virus Identification"
        },
        {
            "text": "Nasal samples were also analyzed for Streptococcus pneumoniae, H. influenzae, and Moraxella catarrhalis by using quantitative real-time PCR. DNA was extracted with the BiOstic Bacteremia DNA Isolation Kit (Mo Bio Laboratories). Quantitative LytA PCR for the detection of S. pneumoniae [14] was combined with hpd PCR for the detection of H. influenzae [15] and copB PCR for the detection of M. catarrhalis [16] , as described elsewhere. All primers and probes were obtained from Applied Biosystems, and the real-time PCR assay was performed with a 7300 Applied Biosystems instrument. Standard curves consisted of bacterial DNA extracted from known quantities of clinical isolates of each bacterium obtained from the University of Wisconsin Hospital Clinical Microbiology Laboratory, and PCR results were expressed as colony-forming unit equivalents (CFUe) per milliliter. The same standards were used throughout the study and were internally consistent. Colonization was defined as any detectable bacteria by PCR (\u22651 CFUe/mL) in nasal samples.",
            "cite_spans": [
                {
                    "start": 285,
                    "end": 289,
                    "text": "[14]",
                    "ref_id": "BIBREF15"
                },
                {
                    "start": 351,
                    "end": 355,
                    "text": "[15]",
                    "ref_id": "BIBREF16"
                },
                {
                    "start": 405,
                    "end": 409,
                    "text": "[16]",
                    "ref_id": "BIBREF17"
                }
            ],
            "ref_spans": [],
            "section": "Bacterial Polymerase Chain Reaction"
        },
        {
            "text": "Demographic characteristics were summarized in terms of means and standard deviation or percentages. The proportion of subjects colonized was analyzed using the generalized estimating equation approach, with a logit link function to account for multiple visits. Proportions were summarized along with the corresponding 95% confidence intervals, stratified by visit type and virus detection status. Tukey's honestly significant difference method was used to control the type I error when conducting multiple comparisons between visit types. Bacterial density values (in CFUe per milliliter) were log (base 10) transformed and analyzed using a linear mixed-effects model with subject-specific random effects. A compound symmetry correlation structure was used to account for correlations between repeated visits within the same subject. Residual plots were examined to verify model assumptions. All reported P values are 2 sided, and P < .05 was used to define statistical significance. Statistical analyses were conducted using SAS software (version 9.4; SAS Institute).",
            "cite_spans": [],
            "ref_spans": [],
            "section": "Statistical Methods"
        },
        {
            "text": "Invitations to participate in this study were sent to families of 4516 patients from 2 pediatric clinics after screening 6394 possible participants; 1878 subjects were not eligible owing to an underlying medical condition ( Figure 1 ). From February 2012 to September 2015, a total of 279 subjects were enrolled. One subject was excluded after enrollment because nasal samples could not be obtained, 205 were followed up for an entire year, and the remaining 73 subjects had \u22651 surveillance sample taken. The demographic characteristics of enrolled subjects are shown in Table 1 .",
            "cite_spans": [],
            "ref_spans": [
                {
                    "start": 224,
                    "end": 232,
                    "text": "Figure 1",
                    "ref_id": "FIGREF0"
                },
                {
                    "start": 571,
                    "end": 578,
                    "text": "Table 1",
                    "ref_id": "TABREF4"
                }
            ],
            "section": "RESULTS"
        },
        {
            "text": "There were 847 surveillance, 363 acute URTI, and 298 recovery visits ( Figure 1 ) A virus was detected in 34% of nasal samples obtained during surveillance visits, 81% of those obtained during acute URTI visits, and 32% of those obtained during recovery visits. The rates of detection of individual viruses at each visit type are detailed in Table 2 . As expected, RV was the most common virus detected for all 3 visit types.",
            "cite_spans": [],
            "ref_spans": [
                {
                    "start": 71,
                    "end": 79,
                    "text": "Figure 1",
                    "ref_id": "FIGREF0"
                },
                {
                    "start": 342,
                    "end": 349,
                    "text": "Table 2",
                    "ref_id": "TABREF1"
                }
            ],
            "section": "RESULTS"
        },
        {
            "text": "The proportion of children colonized was determined at the initial surveillance visit for each bacterial pathogen, and these proportions are shown in Table 3 . The proportion of children colonized was significantly higher for S. pneumoniae (54%) than for Haemophilus influenzae (26%) or M. catarrhalis (33%) (P < .001) and higher for M. catarrhalis than for H. influenzae (P = .04). Next we compared the proportion of children colonized at surveillance visits where virus was detected compared with visits where a virus was not detected. The proportion colonized was significantly higher when virus was detected than when not detected for all 3 respiratory pathogens (62% vs 47% for S. pneumoniae [P < .001], 28% vs 20% for H. influenzae [P = .007], and 43% vs 36% for M. catarrhalis [P = .03]; Table 4 ). Patients were often colonized with >1 bacterial pathogen. The proportions of children colonized with \u22651 pathogen at surveillance and acute visits are shown in Table 5 . Colonization with any 1 of the 3 bacteria was more common during acute visits than during surveillance visits (P < .001), as was the detection of any 2 bacteria (P < .001) or all 3 bacteria in the same sample (P = .05).",
            "cite_spans": [],
            "ref_spans": [
                {
                    "start": 150,
                    "end": 157,
                    "text": "Table 3",
                    "ref_id": "TABREF2"
                },
                {
                    "start": 795,
                    "end": 802,
                    "text": "Table 4",
                    "ref_id": "TABREF3"
                },
                {
                    "start": 965,
                    "end": 972,
                    "text": "Table 5",
                    "ref_id": "TABREF5"
                }
            ],
            "section": "RESULTS"
        },
        {
            "text": "Bacterial densities in nasal samples obtained at study visits are shown in Figure 2 . Densities were significantly higher at acute URTI visits for S. pneumoniae, H. influenzae and M. catarrhalis, demonstrating nearly a log increase in density compared with surveillance visits. In addition, bacterial densities for all 3 bacteria were significantly decreased at recovery visits compared with acute URTI visits. Bacterial densities at recovery visits dropped to near baseline surveillance levels for S. pneumoniae and H. influenzae but remained significantly above those for surveillance visits for M. catarrhalis (P < .05).",
            "cite_spans": [],
            "ref_spans": [
                {
                    "start": 75,
                    "end": 83,
                    "text": "Figure 2",
                    "ref_id": "FIGREF1"
                }
            ],
            "section": "RESULTS"
        },
        {
            "text": "To isolate the effect of viral URTIs on bacterial density, the mean densities of bacteria were compared between visits at which a virus was detected and those at which a virus was not detected. Mean densities were significantly higher at all visits for all 3 bacterial pathogens ( Figure 3A ), when a virus was detected, with mean differences in density of 1.0, 0.4, and 0.7 log 10 CFUe/mL for S. pneumoniae, H. influenzae, and M. catarrhalis, respectively, compared with visits at which a virus was not detected (P < .001). The effect of viral infection on increasing bacterial density occurred regardless of whether symptoms were present. Figure 3B shows bacterial densities for asymptomatic visits at which a virus was detected compared with those at which a virus was not detected. At surveillance visits, the mean differences in density between these visits were 0.8, 0.4, and 0.4 log 10 CFUe/mL for S. pneumoniae, H. influenzae, and M. catarrhalis, respectively (P < .01). Bacterial densities were analyzed for individual respiratory viruses ( Table 6 ). Samples that had >1 virus detected were labeled as mixed. Samples in which RV was detected had significantly higher densities for all 3 bacterial pathogens than samples without detection of a virus. Samples with mixed virus detection showed significantly higher densities of S. pneumoniae and M. catarrhalis but not H. influenzae. Comparison between other individual respiratory viruses was not possible because of low numbers.",
            "cite_spans": [],
            "ref_spans": [
                {
                    "start": 281,
                    "end": 290,
                    "text": "Figure 3A",
                    "ref_id": "FIGREF2"
                },
                {
                    "start": 641,
                    "end": 650,
                    "text": "Figure 3B",
                    "ref_id": "FIGREF2"
                },
                {
                    "start": 1050,
                    "end": 1057,
                    "text": "Table 6",
                    "ref_id": "TABREF6"
                }
            ],
            "section": "RESULTS"
        },
        {
            "text": "To further determine the role of viral infection in affecting bacterial colonization and density, we compared 4 groups: surveillance visits with no virus detected (SN), surveillance visits with virus detected (SV), acute URTI visits with no virus detected (AN), and acute URTI visits with virus detected (AV). Differences were adjusted for multiple comparisons. For S. pneumoniae ( Figure 4A ), the proportions of children colonized were similar for SV and AV visits, and both were significantly higher than for SN visits. The density of each bacterial species was grouped into 4 levels (1-100, 100-1000, 1000-10 000, or >10 000 CFUe/mL) for each of the visit types (SN, SV, AN, and AV). For S. pneumoniae, when a virus was detected, the greatest increase in the proportion of samples occurred in the group with >10 000 CFUe/mL. For H. influenzae ( Figure 4B ) colonization frequency was significantly higher for SV, AN, and AV visits than for SN visits. Again the greatest change in bacterial density occurred in the proportion of samples with >10 000 CFUe/mL. For M. catarrhalis ( Figure 4C ), the density of colonization was higher for both AN and AV visits than for SN visits, also with the greatest change in the >10 000 CFUe/mL group. Bacterial density for all 3 pathogens was tracked over the time course of a URTI. The mean observed duration for bacterial density to return to baseline levels was 13.6 days (range, 5-40 days). Overall 223 of 295 or 75% of URTIs (95% confidence interval, 70%-80%) showed a return to baseline of bacterial density by day 14 of illness for all 3 bacterial pathogens. The rate of return to baseline density did not differ between URTIs by virus type detected (data not shown).",
            "cite_spans": [],
            "ref_spans": [
                {
                    "start": 382,
                    "end": 391,
                    "text": "Figure 4A",
                    "ref_id": null
                },
                {
                    "start": 849,
                    "end": 858,
                    "text": "Figure 4B",
                    "ref_id": null
                },
                {
                    "start": 1083,
                    "end": 1092,
                    "text": "Figure 4C",
                    "ref_id": null
                }
            ],
            "section": "RESULTS"
        },
        {
            "text": "In this study, dynamic changes in upper respiratory bacterial flora associated with viral infection were demonstrated. The density of all 3 of the common respiratory bacterial pathogens in nasal samples, S. pneumoniae, H. influenzae, and M. catarrhalis, increased by nearly a factor of 10 between surveillance periods and episodes of symptomatic URTI. In addition, it has been shown for the first time that bacterial detection and density of all 3 sinus pathogens increase during asymptomatic viral infection. In general, bacterial density was lowest for asymptomatic visits at which virus was not detected and highest for acute URTI visits at which virus was detected. Bacterial densities decreased to near-baseline levels during recovery. The impact of virus detection on bacterial detection and density lasted about 14 days from the onset of symptoms.",
            "cite_spans": [],
            "ref_spans": [],
            "section": "DISCUSSION"
        },
        {
            "text": "The effect of virus on increasing bacterial density and colonization was greatest for S. pneumoniae. This large effect of virus detection on S. pneumoniae was also observed during asymptomatic viral infections. Interestingly, the proportion colonized for all 3 pathogens was similar between surveillance visits with virus detected and acute URTI visits with no virus detected. Furthermore, there were no differences in the frequency of bacterial colonization between episodes of acute URTI with virus and those without virus. Accordingly, it is possible that the upper respiratory tract symptoms in acute episodes of URTI without virus are in fact caused by a virus not in our PCR panel or present in undetectable amounts.",
            "cite_spans": [],
            "ref_spans": [],
            "section": "DISCUSSION"
        },
        {
            "text": "For all 3 pathogens, bacterial density (but not colonization) was higher for symptomatic URTI visits at which a virus was detected than for surveillance visits at which a virus was detected. This suggests that increased density of pathogenic bacteria may itself be a cause of respiratory symptoms without viral coinfection or contribute to symptoms (not only complications) when virus is present. A similar observation was made by Kloepfer et al [17] for S. pneumoniae and M. catarrhalis but not H. influenzae in a group of children with or without asthma who were followed up for 5 weeks in the autumn season. These differences (in bacterial species) may be explained by season or age, but the suggestion that bacterial species may cause respiratory symptoms is the same and may have therapeutic implications.",
            "cite_spans": [
                {
                    "start": 446,
                    "end": 450,
                    "text": "[17]",
                    "ref_id": "BIBREF18"
                }
            ],
            "ref_spans": [],
            "section": "DISCUSSION"
        },
        {
            "text": "The proportion of children colonized in our study was higher than expected for S. pneumoniae, whereas H. influenzae and M. catarrhalis were detected at frequencies similar to those previously reported [4, [18] [19] [20] . A study done in infants demonstrated a higher risk of URTI when subjects were colonized with M. catarrhalis and S. pneumoniae but not H. influenzae [20] . In contrast, our study did not demonstrate an increased risk of URTI with colonization with any of the bacteria tested. This difference may be due to the ages of populations studied and the methods used to detect colonization (culture vs PCR).",
            "cite_spans": [
                {
                    "start": 201,
                    "end": 204,
                    "text": "[4,",
                    "ref_id": "BIBREF4"
                },
                {
                    "start": 205,
                    "end": 209,
                    "text": "[18]",
                    "ref_id": "BIBREF19"
                },
                {
                    "start": 210,
                    "end": 214,
                    "text": "[19]",
                    "ref_id": "BIBREF20"
                },
                {
                    "start": 215,
                    "end": 219,
                    "text": "[20]",
                    "ref_id": "BIBREF21"
                },
                {
                    "start": 370,
                    "end": 374,
                    "text": "[20]",
                    "ref_id": "BIBREF21"
                }
            ],
            "ref_spans": [],
            "section": "DISCUSSION"
        },
        {
            "text": "The results of our study affirm previous important insights into the pathogenesis of the bacterial complications of viral URTIs. Proliferation of S. pneumoniae, H. influenzae, and M. catarrhalis is thought to be a necessary step in the development of these conditions. Faden et al demonstrated an increase in the carriage rate of otopathogens in the nasopharynx of children with acute otitis media during URTI, compared with well children [21, 22] . Other more recent studies, using culture and quantitative PCR, have shown an increase in pneumococcal carriage [23] and density during acute URTI [24] [25] [26] . Xu et al [27] also recently reported that nasopharyngeal colonization rates of otopathogens during health were significantly lower than during URTI. Studies of otitis media and sinusitis have demonstrated that the presence of pathogenic bacteria in the nasopharynx markedly increases the risk of these complications [2] [3] [4] [28] [29] [30] [31] . During URTI, there are complex interactions between bacteria and viruses [32, 33] . These observations suggest that the combination of virus and bacteria is necessary but not sufficient for the development of bacterial complications of URTI.",
            "cite_spans": [
                {
                    "start": 439,
                    "end": 443,
                    "text": "[21,",
                    "ref_id": "BIBREF22"
                },
                {
                    "start": 444,
                    "end": 447,
                    "text": "22]",
                    "ref_id": "BIBREF23"
                },
                {
                    "start": 561,
                    "end": 565,
                    "text": "[23]",
                    "ref_id": "BIBREF24"
                },
                {
                    "start": 596,
                    "end": 600,
                    "text": "[24]",
                    "ref_id": "BIBREF25"
                },
                {
                    "start": 601,
                    "end": 605,
                    "text": "[25]",
                    "ref_id": "BIBREF26"
                },
                {
                    "start": 606,
                    "end": 610,
                    "text": "[26]",
                    "ref_id": "BIBREF27"
                },
                {
                    "start": 622,
                    "end": 626,
                    "text": "[27]",
                    "ref_id": "BIBREF28"
                },
                {
                    "start": 929,
                    "end": 932,
                    "text": "[2]",
                    "ref_id": null
                },
                {
                    "start": 933,
                    "end": 936,
                    "text": "[3]",
                    "ref_id": "BIBREF3"
                },
                {
                    "start": 937,
                    "end": 940,
                    "text": "[4]",
                    "ref_id": "BIBREF4"
                },
                {
                    "start": 941,
                    "end": 945,
                    "text": "[28]",
                    "ref_id": "BIBREF29"
                },
                {
                    "start": 946,
                    "end": 950,
                    "text": "[29]",
                    "ref_id": "BIBREF30"
                },
                {
                    "start": 951,
                    "end": 955,
                    "text": "[30]",
                    "ref_id": "BIBREF31"
                },
                {
                    "start": 956,
                    "end": 960,
                    "text": "[31]",
                    "ref_id": "BIBREF32"
                },
                {
                    "start": 1036,
                    "end": 1040,
                    "text": "[32,",
                    "ref_id": "BIBREF33"
                },
                {
                    "start": 1041,
                    "end": 1044,
                    "text": "33]",
                    "ref_id": "BIBREF34"
                }
            ],
            "ref_spans": [],
            "section": "DISCUSSION"
        },
        {
            "text": "Detection of viruses during surveillance, when patients are asymptomatic, is not a new finding [6, 7, 34] . However, the implications of the finding that bacterial densities increase substantially during periods of asymptomatic viral infection are important and may have clinical relevance. These data allow us to understand the development of cases of acute otitis media, acute bacterial sinusitis, and their complications (mastoiditis and subperiosteal orbital cellulitis) in children without respiratory symptoms or whose respiratory symptoms are extremely modest [35] . In nearly 50% of children presenting with complications of sinusitis, the complication is the first signal of the underlying sinus infection. The current findings demonstrate that, even in the absence of symptoms, viral infection enhances bacterial colonization and density. We can speculate that this enhancement of colonization, especially with S. pneumoniae, predisposes the patient to the complications of URTI.",
            "cite_spans": [
                {
                    "start": 95,
                    "end": 98,
                    "text": "[6,",
                    "ref_id": "BIBREF6"
                },
                {
                    "start": 99,
                    "end": 101,
                    "text": "7,",
                    "ref_id": "BIBREF7"
                },
                {
                    "start": 102,
                    "end": 105,
                    "text": "34]",
                    "ref_id": "BIBREF35"
                },
                {
                    "start": 567,
                    "end": 571,
                    "text": "[35]",
                    "ref_id": "BIBREF36"
                }
            ],
            "ref_spans": [],
            "section": "DISCUSSION"
        },
        {
            "text": "The mechanism by which viral URTI increases bacterial colonization and density is not well understood. A cotton rat model of RSV infection demonstrated a higher frequency of colonization of nontypable H. influenzae than non-RSV infected rats during acute RSV infection. This was not associated with changes in bacterial adherence to epithelial cells or to changes in production of specific antibacterial antibody [36] . In vitro studies have shown that RV facilitates the binding, translocation, and persistence of bacteria by disrupting epithelial barrier function [37] . In addition, increased mucus production and host cell debris may enhance the nutritional milieu for bacterial growth during infection with influenza virus [38] .",
            "cite_spans": [
                {
                    "start": 413,
                    "end": 417,
                    "text": "[36]",
                    "ref_id": "BIBREF37"
                },
                {
                    "start": 566,
                    "end": 570,
                    "text": "[37]",
                    "ref_id": "BIBREF38"
                },
                {
                    "start": 728,
                    "end": 732,
                    "text": "[38]",
                    "ref_id": "BIBREF39"
                }
            ],
            "ref_spans": [],
            "section": "DISCUSSION"
        },
        {
            "text": "This study has several unique characteristics and possible limitations that should be considered. The longitudinal follow-up of subjects for 1 year allowed the avoidance of seasonal variation in viral infections. Sensitive PCR techniques permitted identification of viruses and quantitation of bacterial colonization. Obtaining nasal samples during surveillance and illness permitted new observations of increased bacterial density even when subjects had asymptomatic viral infection. Samples were obtained with a nasal blow technique rather than by nasopharyngeal swab sample for patient comfort and to improve adherence. This method may seem to be prone to inconsistency, given the potential for variations in dilution. However, this technique is well established and has been used in many other studies of viral URTI [11, 12, 17, [39] [40] [41] [42] [43] .",
            "cite_spans": [
                {
                    "start": 820,
                    "end": 824,
                    "text": "[11,",
                    "ref_id": "BIBREF11"
                },
                {
                    "start": 825,
                    "end": 828,
                    "text": "12,",
                    "ref_id": null
                },
                {
                    "start": 829,
                    "end": 832,
                    "text": "17,",
                    "ref_id": "BIBREF18"
                },
                {
                    "start": 833,
                    "end": 837,
                    "text": "[39]",
                    "ref_id": "BIBREF40"
                },
                {
                    "start": 838,
                    "end": 842,
                    "text": "[40]",
                    "ref_id": "BIBREF41"
                },
                {
                    "start": 843,
                    "end": 847,
                    "text": "[41]",
                    "ref_id": "BIBREF42"
                },
                {
                    "start": 848,
                    "end": 852,
                    "text": "[42]",
                    "ref_id": "BIBREF43"
                },
                {
                    "start": 853,
                    "end": 857,
                    "text": "[43]",
                    "ref_id": "BIBREF44"
                }
            ],
            "ref_spans": [],
            "section": "DISCUSSION"
        },
        {
            "text": "Although specimens obtained during URTI could theoretically have higher concentrations of mucus, and thus higher concentrations of bacteria, similar densities of bacteria were detected during asymptomatic viral infections. This latter observation suggests that an increased yield of mucous during URTI did not affect these results. In addition, our overall colonization proportions were higher than those previously reported, supporting the contention that the use of nasal wash samples did not underestimate the detection of bacterial pathogens. It is also notable that, despite the potential for dilution, the increases in bacterial density and colonization were very consistently found during viral URTI in this study and in others [17] .",
            "cite_spans": [
                {
                    "start": 735,
                    "end": 739,
                    "text": "[17]",
                    "ref_id": "BIBREF18"
                }
            ],
            "ref_spans": [],
            "section": "DISCUSSION"
        },
        {
            "text": "In conclusion, we have shown that the density and frequency of colonization with the bacterial pathogens S. pneumoniae, H. influenzae, and M. catarrhalis in nasal wash samples increase during periods of symptomatic and asymptomatic viral infection. In the current study, episodes of symptomatic respiratory infection with or without virus identification were similar with regard to bacterial colonization, suggesting that virus may be present even when undetected. Furthermore, the frequency of bacterial colonization observed during asymptomatic viral infection, especially for S. pneumoniae, was nearly of the same magnitude as that observed when children were symptomatic. These observations provide important insights into the pathogenesis of the bacterial complications of URTI, particularly in patients without respiratory symptoms. Further investigations that determine the precise mechanism of virus-bacterial interaction are needed. ",
            "cite_spans": [],
            "ref_spans": [],
            "section": "DISCUSSION"
        }
    ],
    "bib_entries": {
        "BIBREF0": {
            "ref_id": "b0",
            "title": "The economic burden of non-influenza-related viral respiratory tract infection in the United States",
            "authors": [
                {
                    "first": "A",
                    "middle": [
                        "M"
                    ],
                    "last": "Fendrick",
                    "suffix": ""
                },
                {
                    "first": "A",
                    "middle": [
                        "S"
                    ],
                    "last": "Monto",
                    "suffix": ""
                },
                {
                    "first": "B",
                    "middle": [],
                    "last": "Nightengale",
                    "suffix": ""
                },
                {
                    "first": "M",
                    "middle": [],
                    "last": "Sarnes",
                    "suffix": ""
                }
            ],
            "year": 2003,
            "venue": "Arch Intern Med",
            "volume": "163",
            "issn": "",
            "pages": "487--94",
            "other_ids": {}
        },
        "BIBREF2": {
            "ref_id": "b2",
            "title": "Relationship between nasopharyngeal colonization and the development of otitis media in children",
            "authors": [
                {
                    "first": "",
                    "middle": [],
                    "last": "Tonawanda/ Williamsville",
                    "suffix": ""
                },
                {
                    "first": "",
                    "middle": [],
                    "last": "Pediatrics",
                    "suffix": ""
                }
            ],
            "year": 1997,
            "venue": "J Infect Dis",
            "volume": "175",
            "issn": "",
            "pages": "1440--1445",
            "other_ids": {}
        },
        "BIBREF3": {
            "ref_id": "b3",
            "title": "Changes in nasopharyngeal flora during otitis media of childhood",
            "authors": [
                {
                    "first": "H",
                    "middle": [],
                    "last": "Faden",
                    "suffix": ""
                },
                {
                    "first": "J",
                    "middle": [],
                    "last": "Stanievich",
                    "suffix": ""
                },
                {
                    "first": "L",
                    "middle": [],
                    "last": "Brodsky",
                    "suffix": ""
                },
                {
                    "first": "J",
                    "middle": [],
                    "last": "Bernstein",
                    "suffix": ""
                },
                {
                    "first": "P",
                    "middle": [
                        "L"
                    ],
                    "last": "Ogra",
                    "suffix": ""
                }
            ],
            "year": 1990,
            "venue": "Pediatr Infect Dis J",
            "volume": "9",
            "issn": "",
            "pages": "623--629",
            "other_ids": {}
        },
        "BIBREF4": {
            "ref_id": "b4",
            "title": "Outcome of acute otitis media and its relation to clinical features and nasopharyngeal colonization at the time of diagnosis",
            "authors": [
                {
                    "first": "Y",
                    "middle": [],
                    "last": "Harabuchi",
                    "suffix": ""
                },
                {
                    "first": "H",
                    "middle": [],
                    "last": "Kodama",
                    "suffix": ""
                },
                {
                    "first": "H",
                    "middle": [],
                    "last": "Faden",
                    "suffix": ""
                }
            ],
            "year": 2001,
            "venue": "Acta Otolaryngol",
            "volume": "121",
            "issn": "",
            "pages": "908--922",
            "other_ids": {}
        },
        "BIBREF5": {
            "ref_id": "b5",
            "title": "Detecting respiratory viruses in asymptomatic children",
            "authors": [
                {
                    "first": "S",
                    "middle": [],
                    "last": "Advani",
                    "suffix": ""
                },
                {
                    "first": "A",
                    "middle": [],
                    "last": "Sengupta",
                    "suffix": ""
                },
                {
                    "first": "M",
                    "middle": [],
                    "last": "Forman",
                    "suffix": ""
                },
                {
                    "first": "A",
                    "middle": [],
                    "last": "Valsamakis",
                    "suffix": ""
                },
                {
                    "first": "A",
                    "middle": [
                        "M"
                    ],
                    "last": "Milstone",
                    "suffix": ""
                }
            ],
            "year": 2012,
            "venue": "Pediatr Infect Dis J",
            "volume": "31",
            "issn": "",
            "pages": "1221--1227",
            "other_ids": {}
        },
        "BIBREF6": {
            "ref_id": "b6",
            "title": "Community surveillance of respiratory viruses among families in the Utah Better Identification of Germs-Longitudinal Viral Epidemiology (BIG-LoVE) Study",
            "authors": [
                {
                    "first": "C",
                    "middle": [
                        "L"
                    ],
                    "last": "Byington",
                    "suffix": ""
                },
                {
                    "first": "K",
                    "middle": [],
                    "last": "Ampofo",
                    "suffix": ""
                },
                {
                    "first": "C",
                    "middle": [],
                    "last": "Stockmann",
                    "suffix": ""
                }
            ],
            "year": 2015,
            "venue": "Clin Infect Dis",
            "volume": "61",
            "issn": "",
            "pages": "1217--1241",
            "other_ids": {}
        },
        "BIBREF7": {
            "ref_id": "b7",
            "title": "Symptomatic and asymptomatic respiratory viral infections in the first year of life: association with acute otitis media development",
            "authors": [
                {
                    "first": "T",
                    "middle": [],
                    "last": "Chonmaitree",
                    "suffix": ""
                },
                {
                    "first": "P",
                    "middle": [],
                    "last": "Alvarez-Fernandez",
                    "suffix": ""
                },
                {
                    "first": "K",
                    "middle": [],
                    "last": "Jennings",
                    "suffix": ""
                }
            ],
            "year": 2015,
            "venue": "Clin Infect Dis",
            "volume": "60",
            "issn": "",
            "pages": "1--9",
            "other_ids": {}
        },
        "BIBREF8": {
            "ref_id": "b8",
            "title": "Frequent detection of respiratory viruses without symptoms: toward defining clinically relevant cutoff values",
            "authors": [
                {
                    "first": "R",
                    "middle": [
                        "R"
                    ],
                    "last": "Jansen",
                    "suffix": ""
                },
                {
                    "first": "J",
                    "middle": [],
                    "last": "Wieringa",
                    "suffix": ""
                },
                {
                    "first": "S",
                    "middle": [
                        "M"
                    ],
                    "last": "Koekkoek",
                    "suffix": ""
                }
            ],
            "year": 2011,
            "venue": "J Clin Microbiol",
            "volume": "49",
            "issn": "",
            "pages": "2631--2637",
            "other_ids": {}
        },
        "BIBREF9": {
            "ref_id": "b9",
            "title": "Clinical features, virus identification, and sinusitis as a complication of upper respiratory tract illness in children ages 4-7 years",
            "authors": [
                {
                    "first": "G",
                    "middle": [
                        "P"
                    ],
                    "last": "Demuri",
                    "suffix": ""
                },
                {
                    "first": "J",
                    "middle": [
                        "E"
                    ],
                    "last": "Gern",
                    "suffix": ""
                },
                {
                    "first": "S",
                    "middle": [
                        "C"
                    ],
                    "last": "Moyer",
                    "suffix": ""
                },
                {
                    "first": "M",
                    "middle": [
                        "J"
                    ],
                    "last": "Lindstrom",
                    "suffix": ""
                },
                {
                    "first": "S",
                    "middle": [
                        "V"
                    ],
                    "last": "Lynch",
                    "suffix": ""
                },
                {
                    "first": "E",
                    "middle": [
                        "R"
                    ],
                    "last": "Wald",
                    "suffix": ""
                }
            ],
            "year": 2016,
            "venue": "J Pediatr",
            "volume": "171",
            "issn": "",
            "pages": "133--142",
            "other_ids": {}
        },
        "BIBREF10": {
            "ref_id": "b10",
            "title": "Weekly monitoring of children with asthma for infections and illness during common cold seasons",
            "authors": [
                {
                    "first": "J",
                    "middle": [
                        "P"
                    ],
                    "last": "Olenec",
                    "suffix": ""
                },
                {
                    "first": "W",
                    "middle": [
                        "K"
                    ],
                    "last": "Kim",
                    "suffix": ""
                },
                {
                    "first": "W",
                    "middle": [
                        "M"
                    ],
                    "last": "Lee",
                    "suffix": ""
                }
            ],
            "year": 2010,
            "venue": "J Allergy Clin Immunol",
            "volume": "125",
            "issn": "",
            "pages": "1001--1007",
            "other_ids": {}
        },
        "BIBREF11": {
            "ref_id": "b11",
            "title": "Improved method for collection of nasal mucus",
            "authors": [
                {
                    "first": "K",
                    "middle": [
                        "R"
                    ],
                    "last": "Powell",
                    "suffix": ""
                },
                {
                    "first": "R",
                    "middle": [],
                    "last": "Shorr",
                    "suffix": ""
                },
                {
                    "first": "J",
                    "middle": [
                        "D"
                    ],
                    "last": "Cherry",
                    "suffix": ""
                },
                {
                    "first": "J",
                    "middle": [
                        "O"
                    ],
                    "last": "Hendley",
                    "suffix": ""
                }
            ],
            "year": 1977,
            "venue": "J Infect Dis",
            "volume": "136",
            "issn": "",
            "pages": "109--120",
            "other_ids": {}
        },
        "BIBREF13": {
            "ref_id": "b13",
            "title": "Pleconaril Respiratory Infection Study Group. Efficacy and safety of oral pleconaril for treatment of colds due to picornaviruses in adults: results of 2 double-blind, randomized, placebo-controlled trials",
            "authors": [],
            "year": 2003,
            "venue": "Clin Infect Dis",
            "volume": "36",
            "issn": "",
            "pages": "1523--1555",
            "other_ids": {}
        },
        "BIBREF14": {
            "ref_id": "b14",
            "title": "Improved molecular typing assay for rhinovirus species A, B, and C",
            "authors": [
                {
                    "first": "Y",
                    "middle": [
                        "A"
                    ],
                    "last": "Bochkov",
                    "suffix": ""
                },
                {
                    "first": "K",
                    "middle": [],
                    "last": "Grindle",
                    "suffix": ""
                },
                {
                    "first": "F",
                    "middle": [],
                    "last": "Vang",
                    "suffix": ""
                },
                {
                    "first": "M",
                    "middle": [
                        "D"
                    ],
                    "last": "Evans",
                    "suffix": ""
                },
                {
                    "first": "J",
                    "middle": [
                        "E"
                    ],
                    "last": "Gern",
                    "suffix": ""
                }
            ],
            "year": 2014,
            "venue": "J Clin Microbiol",
            "volume": "52",
            "issn": "",
            "pages": "2461--71",
            "other_ids": {}
        },
        "BIBREF15": {
            "ref_id": "b15",
            "title": "Evaluation of several biochemical and molecular techniques for identification of Streptococcus pneumoniae and Streptococcus pseudopneumoniae and their detection in respiratory samples",
            "authors": [
                {
                    "first": "E",
                    "middle": [],
                    "last": "Wessels",
                    "suffix": ""
                },
                {
                    "first": "J",
                    "middle": [
                        "J"
                    ],
                    "last": "Schelfaut",
                    "suffix": ""
                },
                {
                    "first": "A",
                    "middle": [
                        "T"
                    ],
                    "last": "Bernards",
                    "suffix": ""
                },
                {
                    "first": "E",
                    "middle": [
                        "C"
                    ],
                    "last": "Claas",
                    "suffix": ""
                }
            ],
            "year": 2012,
            "venue": "J Clin Microbiol",
            "volume": "50",
            "issn": "",
            "pages": "1171--1178",
            "other_ids": {}
        },
        "BIBREF16": {
            "ref_id": "b16",
            "title": "Detection of bacterial pathogens in Mongolia meningitis surveillance with a new real-time PCR assay to detect Haemophilus influenzae",
            "authors": [
                {
                    "first": "X",
                    "middle": [],
                    "last": "Wang",
                    "suffix": ""
                },
                {
                    "first": "R",
                    "middle": [],
                    "last": "Mair",
                    "suffix": ""
                },
                {
                    "first": "C",
                    "middle": [],
                    "last": "Hatcher",
                    "suffix": ""
                }
            ],
            "year": 2011,
            "venue": "Int J Med Microbiol",
            "volume": "301",
            "issn": "",
            "pages": "303--312",
            "other_ids": {}
        },
        "BIBREF17": {
            "ref_id": "b17",
            "title": "Quantitative detection of Moraxella catarrhalis in nasopharyngeal secretions by real-time PCR",
            "authors": [
                {
                    "first": "O",
                    "middle": [],
                    "last": "Greiner",
                    "suffix": ""
                },
                {
                    "first": "P",
                    "middle": [
                        "J"
                    ],
                    "last": "Day",
                    "suffix": ""
                },
                {
                    "first": "M",
                    "middle": [],
                    "last": "Altwegg",
                    "suffix": ""
                },
                {
                    "first": "D",
                    "middle": [],
                    "last": "Nadal",
                    "suffix": ""
                }
            ],
            "year": 2003,
            "venue": "J Clin Microbiol",
            "volume": "41",
            "issn": "",
            "pages": "1386--90",
            "other_ids": {}
        },
        "BIBREF18": {
            "ref_id": "b18",
            "title": "Detection of pathogenic bacteria during rhinovirus infection is associated with increased respiratory symptoms and asthma exacerbations",
            "authors": [
                {
                    "first": "K",
                    "middle": [
                        "M"
                    ],
                    "last": "Kloepfer",
                    "suffix": ""
                },
                {
                    "first": "W",
                    "middle": [
                        "M"
                    ],
                    "last": "Lee",
                    "suffix": ""
                },
                {
                    "first": "T",
                    "middle": [
                        "E"
                    ],
                    "last": "Pappas",
                    "suffix": ""
                }
            ],
            "year": 2014,
            "venue": "J Allergy Clin Immunol",
            "volume": "133",
            "issn": "",
            "pages": "1--3",
            "other_ids": {}
        },
        "BIBREF19": {
            "ref_id": "b19",
            "title": "Frequency of recovery of pathogens from the nasopharynx of children with acute maxillary sinusitis before and after the introduction of vaccination with the 7-valent pneumococcal vaccine",
            "authors": [
                {
                    "first": "I",
                    "middle": [],
                    "last": "Brook",
                    "suffix": ""
                },
                {
                    "first": "A",
                    "middle": [
                        "E"
                    ],
                    "last": "Gober",
                    "suffix": ""
                }
            ],
            "year": 2007,
            "venue": "Int J Pediatr Otorhinolaryngol",
            "volume": "71",
            "issn": "",
            "pages": "575--584",
            "other_ids": {}
        },
        "BIBREF20": {
            "ref_id": "b20",
            "title": "New patterns in the otopathogens causing acute otitis media six to eight years after introduction of pneumococcal conjugate vaccine",
            "authors": [
                {
                    "first": "J",
                    "middle": [
                        "R"
                    ],
                    "last": "Casey",
                    "suffix": ""
                },
                {
                    "first": "D",
                    "middle": [
                        "G"
                    ],
                    "last": "Adlowitz",
                    "suffix": ""
                },
                {
                    "first": "M",
                    "middle": [
                        "E"
                    ],
                    "last": "Pichichero",
                    "suffix": ""
                }
            ],
            "year": 2010,
            "venue": "Pediatr Infect Dis J",
            "volume": "29",
            "issn": "",
            "pages": "304--313",
            "other_ids": {}
        },
        "BIBREF21": {
            "ref_id": "b21",
            "title": "Acute otitis media and other complications of viral respiratory infection",
            "authors": [
                {
                    "first": "T",
                    "middle": [],
                    "last": "Chonmaitree",
                    "suffix": ""
                },
                {
                    "first": "R",
                    "middle": [],
                    "last": "Trujillo",
                    "suffix": ""
                },
                {
                    "first": "K",
                    "middle": [],
                    "last": "Jennings",
                    "suffix": ""
                }
            ],
            "year": 2016,
            "venue": "Pediatrics",
            "volume": "137",
            "issn": "",
            "pages": "",
            "other_ids": {}
        },
        "BIBREF22": {
            "ref_id": "b22",
            "title": "Micro-ecology of the nasopharyngeal bacterial flora in otitis-prone and non-otitis-prone children",
            "authors": [
                {
                    "first": "J",
                    "middle": [
                        "M"
                    ],
                    "last": "Bernstein",
                    "suffix": ""
                },
                {
                    "first": "H",
                    "middle": [
                        "F"
                    ],
                    "last": "Faden",
                    "suffix": ""
                },
                {
                    "first": "D",
                    "middle": [
                        "M"
                    ],
                    "last": "Dryja",
                    "suffix": ""
                },
                {
                    "first": "J",
                    "middle": [],
                    "last": "Wactawski-Wende",
                    "suffix": ""
                }
            ],
            "year": 1993,
            "venue": "Acta Otolaryngol",
            "volume": "113",
            "issn": "",
            "pages": "88--92",
            "other_ids": {}
        },
        "BIBREF23": {
            "ref_id": "b23",
            "title": "Nasopharyngeal flora in the first three years of life in normal and otitis-prone children",
            "authors": [
                {
                    "first": "H",
                    "middle": [],
                    "last": "Faden",
                    "suffix": ""
                },
                {
                    "first": "M",
                    "middle": [
                        "J"
                    ],
                    "last": "Waz",
                    "suffix": ""
                },
                {
                    "first": "J",
                    "middle": [
                        "M"
                    ],
                    "last": "Bernstein",
                    "suffix": ""
                },
                {
                    "first": "L",
                    "middle": [],
                    "last": "Brodsky",
                    "suffix": ""
                },
                {
                    "first": "J",
                    "middle": [],
                    "last": "Stanievich",
                    "suffix": ""
                },
                {
                    "first": "P",
                    "middle": [
                        "L"
                    ],
                    "last": "Ogra",
                    "suffix": ""
                }
            ],
            "year": 1991,
            "venue": "Ann Otol Rhinol Laryngol",
            "volume": "100",
            "issn": "",
            "pages": "612--617",
            "other_ids": {}
        },
        "BIBREF24": {
            "ref_id": "b24",
            "title": "Nasopharyngeal carriage of Streptococcus pneumoniae in Finnish children younger than 2 years old",
            "authors": [
                {
                    "first": "R",
                    "middle": [
                        "K"
                    ],
                    "last": "Syrj\u00e4nen",
                    "suffix": ""
                },
                {
                    "first": "T",
                    "middle": [
                        "M"
                    ],
                    "last": "Kilpi",
                    "suffix": ""
                },
                {
                    "first": "T",
                    "middle": [
                        "H"
                    ],
                    "last": "Kaijalainen",
                    "suffix": ""
                },
                {
                    "first": "E",
                    "middle": [
                        "E"
                    ],
                    "last": "Herva",
                    "suffix": ""
                },
                {
                    "first": "A",
                    "middle": [
                        "K"
                    ],
                    "last": "Takala",
                    "suffix": ""
                }
            ],
            "year": 2001,
            "venue": "J Infect Dis",
            "volume": "184",
            "issn": "",
            "pages": "451--460",
            "other_ids": {}
        },
        "BIBREF25": {
            "ref_id": "b25",
            "title": "Bacterial density, serotype distribution and antibiotic resistance of pneumococcal strains from the nasopharynx of Peruvian children before and after pneumococcal conjugate vaccine 7",
            "authors": [
                {
                    "first": "C",
                    "middle": [
                        "R"
                    ],
                    "last": "Hanke",
                    "suffix": ""
                },
                {
                    "first": "C",
                    "middle": [
                        "G"
                    ],
                    "last": "Grijalva",
                    "suffix": ""
                },
                {
                    "first": "S",
                    "middle": [],
                    "last": "Chochua",
                    "suffix": ""
                }
            ],
            "year": 2016,
            "venue": "Pediatr Infect Dis J",
            "volume": "35",
            "issn": "",
            "pages": "432--441",
            "other_ids": {}
        },
        "BIBREF26": {
            "ref_id": "b26",
            "title": "The value of nasopharyngeal culture in predicting the etiology of acute otitis media in children less than two years of age",
            "authors": [
                {
                    "first": "R",
                    "middle": [
                        "K"
                    ],
                    "last": "Syrj\u00e4nen",
                    "suffix": ""
                },
                {
                    "first": "E",
                    "middle": [
                        "E"
                    ],
                    "last": "Herva",
                    "suffix": ""
                },
                {
                    "first": "P",
                    "middle": [
                        "H"
                    ],
                    "last": "M\u00e4kel\u00e4",
                    "suffix": ""
                }
            ],
            "year": 2006,
            "venue": "Pediatr Infect Dis J",
            "volume": "25",
            "issn": "",
            "pages": "1032--1038",
            "other_ids": {}
        },
        "BIBREF27": {
            "ref_id": "b27",
            "title": "Nasopharyngeal pneumococcal density and evolution of acute respiratory illnesses in young children",
            "authors": [
                {
                    "first": "R",
                    "middle": [
                        "R"
                    ],
                    "last": "Fan",
                    "suffix": ""
                },
                {
                    "first": "L",
                    "middle": [
                        "M"
                    ],
                    "last": "Howard",
                    "suffix": ""
                },
                {
                    "first": "M",
                    "middle": [
                        "R"
                    ],
                    "last": "Griffin",
                    "suffix": ""
                }
            ],
            "year": 2009,
            "venue": "Emerg Infect Dis",
            "volume": "22",
            "issn": "",
            "pages": "1996--2005",
            "other_ids": {}
        },
        "BIBREF28": {
            "ref_id": "b28",
            "title": "Nasopharyngeal polymicrobial colonization during health, viral upper respiratory infection and upper respiratory bacterial infection",
            "authors": [
                {
                    "first": "Q",
                    "middle": [],
                    "last": "Xu",
                    "suffix": ""
                },
                {
                    "first": "J",
                    "middle": [],
                    "last": "Wischmeyer",
                    "suffix": ""
                },
                {
                    "first": "E",
                    "middle": [],
                    "last": "Gonzalez",
                    "suffix": ""
                },
                {
                    "first": "M",
                    "middle": [
                        "E"
                    ],
                    "last": "Pichichero",
                    "suffix": ""
                }
            ],
            "year": 2017,
            "venue": "J Infect",
            "volume": "75",
            "issn": "",
            "pages": "26--34",
            "other_ids": {}
        },
        "BIBREF29": {
            "ref_id": "b29",
            "title": "Acute bacterial sinusitis complicating viral upper respiratory tract infection in young children",
            "authors": [
                {
                    "first": "T",
                    "middle": [],
                    "last": "Marom",
                    "suffix": ""
                },
                {
                    "first": "P",
                    "middle": [
                        "E"
                    ],
                    "last": "Alvarez-Fernandez",
                    "suffix": ""
                },
                {
                    "first": "Jennings",
                    "middle": [
                        "K"
                    ],
                    "last": "Patel",
                    "suffix": ""
                },
                {
                    "first": "J",
                    "middle": [
                        "A"
                    ],
                    "last": "Mccormick",
                    "suffix": ""
                },
                {
                    "first": "D",
                    "middle": [
                        "P"
                    ],
                    "last": "Chonmaitree",
                    "suffix": ""
                },
                {
                    "first": "T",
                    "middle": [],
                    "last": "",
                    "suffix": ""
                }
            ],
            "year": 2014,
            "venue": "Pediatr Infect Dis J",
            "volume": "33",
            "issn": "",
            "pages": "803--811",
            "other_ids": {}
        },
        "BIBREF30": {
            "ref_id": "b30",
            "title": "Association of nasopharyngeal bacterial colonization during upper respiratory tract infection and the development of acute otitis media",
            "authors": [
                {
                    "first": "K",
                    "middle": [],
                    "last": "Revai",
                    "suffix": ""
                },
                {
                    "first": "D",
                    "middle": [],
                    "last": "Mamidi",
                    "suffix": ""
                },
                {
                    "first": "T",
                    "middle": [],
                    "last": "Chonmaitree",
                    "suffix": ""
                }
            ],
            "year": 2008,
            "venue": "Clin Infect Dis",
            "volume": "46",
            "issn": "",
            "pages": "34--41",
            "other_ids": {}
        },
        "BIBREF31": {
            "ref_id": "b31",
            "title": "Are nasopharyngeal cultures useful in diagnosis of acute bacterial sinusitis in children",
            "authors": [
                {
                    "first": "N",
                    "middle": [],
                    "last": "Shaikh",
                    "suffix": ""
                },
                {
                    "first": "A",
                    "middle": [],
                    "last": "Hoberman",
                    "suffix": ""
                },
                {
                    "first": "D",
                    "middle": [
                        "K"
                    ],
                    "last": "Colborn",
                    "suffix": ""
                }
            ],
            "year": 2013,
            "venue": "Clin Pediatr (Phila)",
            "volume": "52",
            "issn": "",
            "pages": "1118--1139",
            "other_ids": {}
        },
        "BIBREF32": {
            "ref_id": "b32",
            "title": "The value of nasopharyngeal culture in predicting the etiology of acute otitis media in children less than two years of age",
            "authors": [
                {
                    "first": "R",
                    "middle": [
                        "K"
                    ],
                    "last": "Syrj\u00e4nen",
                    "suffix": ""
                },
                {
                    "first": "E",
                    "middle": [
                        "E"
                    ],
                    "last": "Herva",
                    "suffix": ""
                },
                {
                    "first": "P",
                    "middle": [
                        "H"
                    ],
                    "last": "M\u00e4kel\u00e4",
                    "suffix": ""
                }
            ],
            "year": 2006,
            "venue": "Pediatr Infect Dis J",
            "volume": "25",
            "issn": "",
            "pages": "1032--1038",
            "other_ids": {}
        },
        "BIBREF33": {
            "ref_id": "b33",
            "title": "Viral-bacterial interactions and risk of acute otitis media complicating upper respiratory tract infection",
            "authors": [
                {
                    "first": "M",
                    "middle": [
                        "M"
                    ],
                    "last": "Pettigrew",
                    "suffix": ""
                },
                {
                    "first": "J",
                    "middle": [
                        "F"
                    ],
                    "last": "Gent",
                    "suffix": ""
                },
                {
                    "first": "R",
                    "middle": [
                        "B"
                    ],
                    "last": "Pyles",
                    "suffix": ""
                },
                {
                    "first": "A",
                    "middle": [
                        "L"
                    ],
                    "last": "Miller",
                    "suffix": ""
                },
                {
                    "first": "J",
                    "middle": [],
                    "last": "Nokso-Koivisto",
                    "suffix": ""
                },
                {
                    "first": "T",
                    "middle": [],
                    "last": "Chonmaitree",
                    "suffix": ""
                }
            ],
            "year": 2011,
            "venue": "J Clin Microbiol",
            "volume": "49",
            "issn": "",
            "pages": "3750--3755",
            "other_ids": {}
        },
        "BIBREF34": {
            "ref_id": "b34",
            "title": "Microbial interactions during upper respiratory tract infections",
            "authors": [
                {
                    "first": "M",
                    "middle": [
                        "M"
                    ],
                    "last": "Pettigrew",
                    "suffix": ""
                },
                {
                    "first": "J",
                    "middle": [
                        "F"
                    ],
                    "last": "Gent",
                    "suffix": ""
                },
                {
                    "first": "K",
                    "middle": [],
                    "last": "Revai",
                    "suffix": ""
                },
                {
                    "first": "J",
                    "middle": [
                        "A"
                    ],
                    "last": "Patel",
                    "suffix": ""
                },
                {
                    "first": "T",
                    "middle": [],
                    "last": "Chonmaitree",
                    "suffix": ""
                }
            ],
            "year": 2008,
            "venue": "Emerg Infect Dis",
            "volume": "14",
            "issn": "",
            "pages": "1584--91",
            "other_ids": {}
        },
        "BIBREF35": {
            "ref_id": "b35",
            "title": "Highly frequent infections with human rhinovirus in healthy young children: a longitudinal cohort study",
            "authors": [
                {
                    "first": "M",
                    "middle": [
                        "M"
                    ],
                    "last": "Van Der Zalm",
                    "suffix": ""
                },
                {
                    "first": "B",
                    "middle": [],
                    "last": "Wilbrink",
                    "suffix": ""
                },
                {
                    "first": "B",
                    "middle": [
                        "E"
                    ],
                    "last": "Van Ewijk",
                    "suffix": ""
                },
                {
                    "first": "P",
                    "middle": [],
                    "last": "Overduin",
                    "suffix": ""
                },
                {
                    "first": "T",
                    "middle": [
                        "F"
                    ],
                    "last": "Wolfs",
                    "suffix": ""
                },
                {
                    "first": "C",
                    "middle": [
                        "K"
                    ],
                    "last": "Van Der Ent",
                    "suffix": ""
                }
            ],
            "year": 2011,
            "venue": "J Clin Virol",
            "volume": "52",
            "issn": "",
            "pages": "317--337",
            "other_ids": {}
        },
        "BIBREF36": {
            "ref_id": "b36",
            "title": "Timing of rhinosinusitis complications in children",
            "authors": [
                {
                    "first": "A",
                    "middle": [],
                    "last": "Kristo",
                    "suffix": ""
                },
                {
                    "first": "M",
                    "middle": [],
                    "last": "Uhari",
                    "suffix": ""
                }
            ],
            "year": 2009,
            "venue": "Pediatr Infect Dis J",
            "volume": "28",
            "issn": "",
            "pages": "769--71",
            "other_ids": {}
        },
        "BIBREF37": {
            "ref_id": "b37",
            "title": "Effect of respiratory syncytial virus on adherence, colonization and immunity of non-typable Haemophilus influenzae: implications for otitis media",
            "authors": [
                {
                    "first": "J",
                    "middle": [],
                    "last": "Patel",
                    "suffix": ""
                },
                {
                    "first": "H",
                    "middle": [],
                    "last": "Faden",
                    "suffix": ""
                },
                {
                    "first": "S",
                    "middle": [],
                    "last": "Sharma",
                    "suffix": ""
                },
                {
                    "first": "P",
                    "middle": [
                        "L"
                    ],
                    "last": "Ogra",
                    "suffix": ""
                }
            ],
            "year": 1992,
            "venue": "Int J Pediatr Otorhinolaryngol",
            "volume": "23",
            "issn": "",
            "pages": "15--23",
            "other_ids": {}
        },
        "BIBREF38": {
            "ref_id": "b38",
            "title": "Rhinovirus disrupts the barrier function of polarized airway epithelial cells",
            "authors": [
                {
                    "first": "U",
                    "middle": [],
                    "last": "Sajjan",
                    "suffix": ""
                },
                {
                    "first": "Q",
                    "middle": [],
                    "last": "Wang",
                    "suffix": ""
                },
                {
                    "first": "Y",
                    "middle": [],
                    "last": "Zhao",
                    "suffix": ""
                },
                {
                    "first": "D",
                    "middle": [
                        "C"
                    ],
                    "last": "Gruenert",
                    "suffix": ""
                },
                {
                    "first": "M",
                    "middle": [
                        "B"
                    ],
                    "last": "Hershenson",
                    "suffix": ""
                }
            ],
            "year": 2008,
            "venue": "Am J Respir Crit Care Med",
            "volume": "178",
            "issn": "",
            "pages": "1271--81",
            "other_ids": {}
        },
        "BIBREF39": {
            "ref_id": "b39",
            "title": "Influenza promotes pneumococcal growth during coinfection by providing host sialylated substrates as a nutrient source",
            "authors": [
                {
                    "first": "S",
                    "middle": [
                        "J"
                    ],
                    "last": "Siegel",
                    "suffix": ""
                },
                {
                    "first": "A",
                    "middle": [
                        "M"
                    ],
                    "last": "Roche",
                    "suffix": ""
                },
                {
                    "first": "J",
                    "middle": [
                        "N"
                    ],
                    "last": "Weiser",
                    "suffix": ""
                }
            ],
            "year": 2014,
            "venue": "Cell Host Microbe",
            "volume": "16",
            "issn": "",
            "pages": "55--67",
            "other_ids": {}
        },
        "BIBREF40": {
            "ref_id": "b40",
            "title": "Rhinovirus illnesses during infancy predict subsequent childhood wheezing",
            "authors": [
                {
                    "first": "R",
                    "middle": [
                        "F"
                    ],
                    "last": "Lemanske",
                    "suffix": ""
                },
                {
                    "first": "D",
                    "middle": [
                        "J"
                    ],
                    "last": "Jackson",
                    "suffix": ""
                },
                {
                    "first": "R",
                    "middle": [
                        "E"
                    ],
                    "last": "Gangnon",
                    "suffix": ""
                }
            ],
            "year": 2005,
            "venue": "J Allergy Clin Immunol",
            "volume": "116",
            "issn": "",
            "pages": "571--578",
            "other_ids": {}
        },
        "BIBREF41": {
            "ref_id": "b41",
            "title": "High-throughput, sensitive, and accurate multiplex PCR-microsphere flow cytometry system for large-scale comprehensive detection of respiratory viruses",
            "authors": [
                {
                    "first": "W",
                    "middle": [
                        "M"
                    ],
                    "last": "Lee",
                    "suffix": ""
                },
                {
                    "first": "K",
                    "middle": [],
                    "last": "Grindle",
                    "suffix": ""
                },
                {
                    "first": "T",
                    "middle": [],
                    "last": "Pappas",
                    "suffix": ""
                }
            ],
            "year": 2007,
            "venue": "J Clin Microbiol",
            "volume": "45",
            "issn": "",
            "pages": "2626--2660",
            "other_ids": {}
        },
        "BIBREF42": {
            "ref_id": "b42",
            "title": "Wheezing rhinovirus illnesses in early life predict asthma development in high-risk children",
            "authors": [
                {
                    "first": "D",
                    "middle": [
                        "J"
                    ],
                    "last": "Jackson",
                    "suffix": ""
                },
                {
                    "first": "R",
                    "middle": [
                        "E"
                    ],
                    "last": "Gangnon",
                    "suffix": ""
                },
                {
                    "first": "M",
                    "middle": [
                        "D"
                    ],
                    "last": "Evans",
                    "suffix": ""
                }
            ],
            "year": 2008,
            "venue": "Am J Respir Crit Care Med",
            "volume": "178",
            "issn": "",
            "pages": "667--72",
            "other_ids": {}
        },
        "BIBREF43": {
            "ref_id": "b43",
            "title": "Comparison of the etiology of viral respiratory illnesses in inner-city and suburban infants",
            "authors": [
                {
                    "first": "J",
                    "middle": [
                        "E"
                    ],
                    "last": "Gern",
                    "suffix": ""
                },
                {
                    "first": "T",
                    "middle": [],
                    "last": "Pappas",
                    "suffix": ""
                },
                {
                    "first": "C",
                    "middle": [
                        "M"
                    ],
                    "last": "Visness",
                    "suffix": ""
                }
            ],
            "year": 2012,
            "venue": "J Infect Dis",
            "volume": "206",
            "issn": "",
            "pages": "1342--1351",
            "other_ids": {}
        },
        "BIBREF44": {
            "ref_id": "b44",
            "title": "Human rhinovirus species and season of infection determine illness severity",
            "authors": [
                {
                    "first": "W",
                    "middle": [
                        "M"
                    ],
                    "last": "Lee",
                    "suffix": ""
                },
                {
                    "first": "R",
                    "middle": [
                        "F"
                    ],
                    "last": "Lemanske",
                    "suffix": ""
                },
                {
                    "first": "M",
                    "middle": [
                        "D"
                    ],
                    "last": "Evans",
                    "suffix": ""
                }
            ],
            "year": 2012,
            "venue": "Am J Respir Crit Care Med",
            "volume": "186",
            "issn": "",
            "pages": "886--91",
            "other_ids": {}
        }
    },
    "ref_entries": {
        "FIGREF0": {
            "text": "Enrollment of subjects. Abbreviation: URTI, upper respiratory tract infection.",
            "latex": null,
            "type": "figure"
        },
        "FIGREF1": {
            "text": "Bacterial density for Streptococcus pneumoniae, Haemophilus influenzae, and Moraxella catarrhalis at surveillance visits (n = 847), acute upper respiratory tract infection (URTI) visits (n = 363), and recovery visits (n = 298). *P < .001 for surveillance versus acute URTI visits; \u2020P < .01 for acute URTI versus recovery visits; \u2021P = .03 for recovery versus surveillance visits. Error bars show 95% confidence intervals. Abbreviation: CFUe, colony-forming unit equivalents.",
            "latex": null,
            "type": "figure"
        },
        "FIGREF2": {
            "text": "Bacterial density for Streptococcus pneumoniae, Haemophilus influenzae, and Moraxella catarrhalis for all visits (n = 1508; A) and surveillance visits (n = 847; B) at which a virus was detected versus not detected. *P < .01 for virus detected versus not detected. Abbreviation: CFUe, colony-forming unit equivalents.",
            "latex": null,
            "type": "figure"
        },
        "TABREF1": {
            "text": "Virus Identification at Study Visits",
            "latex": null,
            "type": "table"
        },
        "TABREF2": {
            "text": "Colonization Frequency at Initial Surveillance Visits",
            "latex": null,
            "type": "table"
        },
        "TABREF3": {
            "text": "Colonization Frequency at Surveillance Visits: Virus Versus No Virus",
            "latex": null,
            "type": "table"
        },
        "TABREF4": {
            "text": "",
            "latex": null,
            "type": "table"
        },
        "TABREF5": {
            "text": "Bacteria Detected",
            "latex": null,
            "type": "table"
        },
        "TABREF6": {
            "text": "Adjusted Mean Bacterial Density By Virus for All Visits a Abbreviations: AdV, adenovirus; CI, confidence interval; CoV, coronavirus; EV, enterovirus; FluA, influenza A virus; FluB, influenza B virus; hBoV, human bocavirus; MPV, metapneumovirus,; PIV, parainfluenza virus; RSV, respiratory syncytial virus; RV, rhinovirus. a Based on a linear mixed-effects model. b P = .04 for comparison with mixed results. c P < .02 for comparison with negative results..",
            "latex": null,
            "type": "table"
        }
    },
    "back_matter": []
}