{
    "paper_id": "fa5ab7bb8d82ae7c970b9dc6a2f10eadf0873623",
    "metadata": {
        "title": "Phylogenetic and recombination analysis of coronavirus HKU1, a novel coronavirus from patients with pneumonia",
        "authors": [
            {
                "first": "P",
                "middle": [
                    "C Y"
                ],
                "last": "Woo",
                "suffix": "",
                "affiliation": {
                    "laboratory": "",
                    "institution": "The University of Hong Kong",
                    "location": {
                        "settlement": "Hong Kong"
                    }
                },
                "email": ""
            },
            {
                "first": "S",
                "middle": [
                    "K P"
                ],
                "last": "Lau",
                "suffix": "",
                "affiliation": {
                    "laboratory": "",
                    "institution": "The University of Hong Kong",
                    "location": {
                        "settlement": "Hong Kong"
                    }
                },
                "email": ""
            },
            {
                "first": "Y",
                "middle": [],
                "last": "Huang",
                "suffix": "",
                "affiliation": {
                    "laboratory": "",
                    "institution": "The University of Hong Kong",
                    "location": {
                        "settlement": "Hong Kong"
                    }
                },
                "email": ""
            },
            {
                "first": "H.-W",
                "middle": [],
                "last": "Tsoi",
                "suffix": "",
                "affiliation": {
                    "laboratory": "",
                    "institution": "The University of Hong Kong",
                    "location": {
                        "settlement": "Hong Kong"
                    }
                },
                "email": ""
            },
            {
                "first": "K.-H",
                "middle": [],
                "last": "Chan",
                "suffix": "",
                "affiliation": {
                    "laboratory": "",
                    "institution": "The University of Hong Kong",
                    "location": {
                        "settlement": "Hong Kong"
                    }
                },
                "email": ""
            },
            {
                "first": "K.-Y",
                "middle": [],
                "last": "Yuen",
                "suffix": "",
                "affiliation": {
                    "laboratory": "",
                    "institution": "The University of Hong Kong",
                    "location": {
                        "settlement": "Hong Kong"
                    }
                },
                "email": ""
            }
        ]
    },
    "abstract": [
        {
            "text": "Phylogenetic trees constructed using predicted amino acid sequences of putative proteins of coronavirus HKU1 (CoV-HKU1) revealed that CoV-HKU1 formed a distinct branch among group 2 coronaviruses. Of the 14 trees from p65 to nsp10, nine showed that CoV-HKU1 was clustered with murine hepatitis virus. From nsp11, the topologies of the trees changed dramatically. For the eight trees from nsp11 to N, seven showed that the CoV-HKU1 branch was the first branch. The codon usage patterns of CoV-HKU1 differed significantly from those in other group 2 coronaviruses. Split decomposition analysis revealed that recombination events had occurred between CoV-HKU1 and other coronaviruses. * These authors contributed equally to the manuscript.",
            "cite_spans": [],
            "ref_spans": [],
            "section": "Abstract"
        }
    ],
    "body_text": [
        {
            "text": "It has been estimated that coronaviruses [human coronaviruses 229E (HCoV-229E) and OC43 (HCoV-OC43)] cause about 5-30% of respiratory tract infections. In late 2002 and 2003, Severe Acute Respiratory Syndrome (SARS), caused by SARS coronavirus (SARS-CoV), has resulted in more than 750 deaths [12, 15, 16, 17, [22] [23] [24] . In early 2004, a novel coronavirus associated with respiratory tract infections, human coronavirus NL63 (HCoV-NL63), was discovered [3, 20] . As a result of a unique mechanism of viral replication, coronaviruses have a high frequency of recombination [9, 10, 13, 14] . Coronaviruses were divided into three groups, with HCoV-229E and HCoV-NL63 being group 1 coronaviruses and HCoV-OC43 a group 2 coronavirus respectively [11] . For SARS-CoV, it was initially proposed that SARS-CoV constituted a distinct group of coronavirus [15, 17] . However, after more extensive phylogenetic analysis, it was discovered that SARS-CoV probably represents a distant relative of group 2 coronaviruses [2, 18] . Further in silico analysis also predicted that SARS-CoV could be a product of recombination between mammalian and avian coronaviruses [19] .",
            "cite_spans": [
                {
                    "start": 293,
                    "end": 297,
                    "text": "[12,",
                    "ref_id": "BIBREF11"
                },
                {
                    "start": 298,
                    "end": 301,
                    "text": "15,",
                    "ref_id": null
                },
                {
                    "start": 302,
                    "end": 305,
                    "text": "16,",
                    "ref_id": "BIBREF15"
                },
                {
                    "start": 306,
                    "end": 309,
                    "text": "17,",
                    "ref_id": "BIBREF16"
                },
                {
                    "start": 310,
                    "end": 314,
                    "text": "[22]",
                    "ref_id": "BIBREF21"
                },
                {
                    "start": 315,
                    "end": 319,
                    "text": "[23]",
                    "ref_id": "BIBREF22"
                },
                {
                    "start": 320,
                    "end": 324,
                    "text": "[24]",
                    "ref_id": "BIBREF23"
                },
                {
                    "start": 459,
                    "end": 462,
                    "text": "[3,",
                    "ref_id": "BIBREF2"
                },
                {
                    "start": 463,
                    "end": 466,
                    "text": "20]",
                    "ref_id": "BIBREF19"
                },
                {
                    "start": 578,
                    "end": 581,
                    "text": "[9,",
                    "ref_id": "BIBREF8"
                },
                {
                    "start": 582,
                    "end": 585,
                    "text": "10,",
                    "ref_id": "BIBREF9"
                },
                {
                    "start": 586,
                    "end": 589,
                    "text": "13,",
                    "ref_id": "BIBREF12"
                },
                {
                    "start": 590,
                    "end": 593,
                    "text": "14]",
                    "ref_id": "BIBREF13"
                },
                {
                    "start": 748,
                    "end": 752,
                    "text": "[11]",
                    "ref_id": "BIBREF10"
                },
                {
                    "start": 853,
                    "end": 857,
                    "text": "[15,",
                    "ref_id": null
                },
                {
                    "start": 858,
                    "end": 861,
                    "text": "17]",
                    "ref_id": "BIBREF16"
                },
                {
                    "start": 1013,
                    "end": 1016,
                    "text": "[2,",
                    "ref_id": null
                },
                {
                    "start": 1017,
                    "end": 1020,
                    "text": "18]",
                    "ref_id": "BIBREF17"
                },
                {
                    "start": 1157,
                    "end": 1161,
                    "text": "[19]",
                    "ref_id": "BIBREF18"
                }
            ],
            "ref_spans": [],
            "section": "Introduction"
        },
        {
            "text": "Recently, we have described the discovery of a novel coronavirus associated with pneumonia, coronavirus HKU1 (CoV-HKU1) [21] . Based on analysis of the putative chymotrypsin-like protease (3CL pro ), RNA-dependent RNA polymerase (Pol), helicase, hemagglutinin-esterase (HE), spike (S), envelope (E), membrane (M) and nucleocapsid (N), CoV-HKU1 is a member of group 2 coronaviruses. However, the origin of CoV-HKU1 is still unknown. In this study, we performed a detailed phylogenetic analysis of CoV-HKU1. Possible recombination events were predicted and the origin of CoV-HKU1 discussed.",
            "cite_spans": [
                {
                    "start": 120,
                    "end": 124,
                    "text": "[21]",
                    "ref_id": "BIBREF20"
                }
            ],
            "ref_spans": [],
            "section": "Introduction"
        },
        {
            "text": "The predicted amino acid (a.a.) sequences of p65, conserved portions of nsp1 [papain-like protease 1 (PL1 pro ), Appr-1-p processing enzyme family (A1pp), papain-like protease 2 (PL2 pro ), hydrophobic domain 1 (HD1), and hydrophobic domain 2 (HD2)], nsp2-7, nsp9-13, HE, S, E, M and N were extracted from the CoV-HKU1 genome sequence (GenBank accession no. AY597011) [21] . The corresponding a.a. sequences of murine hepatitis virus (MHV), HCoV-OC43, bovine coronavirus (BCoV), porcine hemagglutinating encephalomyelitis virus (PHEV), rat sialodacryoadenitis coronavirus (SDAV) and puffinosis virus (PV) were extracted from complete genome sequences of MHV (GenBank accession no.AF201929), HCoV-OC43 (GenBank accession no. AY585229) and BCoV (GenBank accession no. NC 003045), and sequences of PHEV, SDAV and PV available in GenBank. The a.a. sequence of HE of MHV was extracted from MHV strain JHM (GenBank accession no. BAA00661) because the HE gene in MHV (GenBank accession no. AF201929) stopped prematurely after the 97th a.a. Phylogenetic tree construction was performed using neighbour joining method with ClustalX 1.83. The corresponding a.a. sequences of HCoV-229E were used as outgroups, except for p65 and HE because these were not available in the genome of HCoV-229E. For p65 and HE, the corresponding a.a. sequences in SARS-CoV and influenza C virus were used as the outgroups respectively. Phylogenetic trees were not constructed for p28 and the predicted hypothetical protein of ORF4 and ORF8 in CoV-HKU1 because no a.a. sequences that can be used as the appropriate outgroups can be found.",
            "cite_spans": [
                {
                    "start": 368,
                    "end": 372,
                    "text": "[21]",
                    "ref_id": "BIBREF20"
                }
            ],
            "ref_spans": [],
            "section": "Materials and methods"
        },
        {
            "text": "The amino-terminal 800 a.a. residues of the S proteins in various group 1 coronaviruses [porcine transmissible gastroenteritis virus (TGEV), HCoV-NL63 and HCoV-229E], various group 2 coronaviruses (PHEV, SDAV, MHV, HCoV-OC43 and BCoV), infectious bronchitis virus (IBV) (a group 3 coronavirus), SARS-CoV and CoV-HKU1 were aligned using ClustalX 1.83. The presence and positions of conserved cysteine residues in the various peptides were compared.",
            "cite_spans": [],
            "ref_spans": [],
            "section": "Materials and methods"
        },
        {
            "text": "Correspondence analysis was used to compare the codon usage pattern variation in the different genes among group 2 coronaviruses in a multidimensional space [5] . All available sequences of ORF 1ab, HE, S, M and N of MHV, HCoV-OC43, BCoV, PHEV, SDAV, PV and SARS-CoV were downloaded from the GenBank ( Table 1) . Analysis of codon usage in these sequences and the corresponding ones in CoV-HKU1 was performed using CodonW (http://www.molbiol.ox.ac.uk/cu/), with each gene represented as a 59 dimensional vector, representing the 59 possible sense codons. AUG, the only codon for methionine, UGG, the only codon for tryptophan, and the three stop codons were excluded. The ORF for E was excluded because the length of the gene was too short.",
            "cite_spans": [
                {
                    "start": 157,
                    "end": 160,
                    "text": "[5]",
                    "ref_id": "BIBREF4"
                }
            ],
            "ref_spans": [
                {
                    "start": 302,
                    "end": 310,
                    "text": "Table 1)",
                    "ref_id": "TABREF0"
                }
            ],
            "section": "Materials and methods"
        },
        {
            "text": "To delineate the importance of recombination on the evolution of CoV-HKU1, split decomposition analysis was performed. Deduced a.a. sequences of group 1, 2 and 3 coronaviruses and SARS-CoV available in GenBank, that were homologous to 3CL pro , Pol, helicase, HE, S, ORF4, E, M and N in CoV-HKU1 [21] , were retrieved. Split decomposition analysis was performed with SplitsTree version 3.2 [7] using Hamming correction and is presented with the same edge length.",
            "cite_spans": [
                {
                    "start": 296,
                    "end": 300,
                    "text": "[21]",
                    "ref_id": "BIBREF20"
                },
                {
                    "start": 390,
                    "end": 393,
                    "text": "[7]",
                    "ref_id": "BIBREF6"
                }
            ],
            "ref_spans": [],
            "section": "Materials and methods"
        },
        {
            "text": "The genome organizations of CoV-HKU1 and other group 2 coronaviruses were shown in Fig. 1a . Phylogenetic trees using predicted a.a. sequences of putative proteins and polypeptides of CoV-HKU1 and other group 2 coronaviruses were constructed (Fig. 1b) . The putative proteins and polypeptides included p65, conserved portions of nsp1 (PL1 pro , A1pp, PL2 pro , HD1 and HD2), nsp2-7, nsp9-13, HE, S, E, M and N. All trees revealed that CoV-HKU1 formed a distinct branch among group 2 coronaviruses. Interestingly, of the 14 trees of p65 to nsp10, nine (64%) (p65, HD1, HD2, nsp3, nsp4, nsp6, nsp7, nsp9 and nsp10) showed that CoV-HKU1 was clustered with MHV (Fig. 1b) . However, for the eight trees of nsp11 to N, seven (88%) showed that the CoV-HKU1 branch appeared as the first branch among group 2 coronaviruses (Fig. 1b) .",
            "cite_spans": [],
            "ref_spans": [
                {
                    "start": 83,
                    "end": 90,
                    "text": "Fig. 1a",
                    "ref_id": "FIGREF1"
                },
                {
                    "start": 242,
                    "end": 251,
                    "text": "(Fig. 1b)",
                    "ref_id": "FIGREF1"
                },
                {
                    "start": 657,
                    "end": 666,
                    "text": "(Fig. 1b)",
                    "ref_id": "FIGREF1"
                },
                {
                    "start": 814,
                    "end": 823,
                    "text": "(Fig. 1b)",
                    "ref_id": "FIGREF1"
                }
            ],
            "section": "Results"
        },
        {
            "text": "Comparison of the cysteine residues in the N-terminal 800 a.a. residues of S in CoV-HKU1 and those in the different groups of coronaviruses revealed that almost all the conserved cysteine residues in group 2 coronaviruses were present in CoV-HKU1 (Fig. 2a) , supporting that CoV-HKU1 is a member of group 2 coronaviruses.",
            "cite_spans": [],
            "ref_spans": [
                {
                    "start": 247,
                    "end": 256,
                    "text": "(Fig. 2a)",
                    "ref_id": "FIGREF4"
                }
            ],
            "section": "Results"
        },
        {
            "text": "The number of ORF 1ab, HE, S, M and N sequences in the group 2 coronaviruses used for correspondence analysis is shown in Table 1 . The results of the For ORF 1ab, HE, S and M, the scores on axis 1 in group 2 coronaviruses other than CoV-HKU1 were clustered between \u22120.16 and 0.28 and those in CoV-HKU1 were clustered between \u22120.40 and \u22120.24 (Fig. 2b) . For N, the scores on axis 1 in group 2 coronaviruses other than CoV-HKU1 were clustered between 0.48 and 0.57 and that in CoV-HKU1 was at 0.11 (Fig. 2b) . These indicated that the codon usage patterns in the genes in CoV-HKU1 differed significantly from those in other group 2 coronaviruses. Split decomposition analysis revealed that recombination events had occurred between CoV-HKU1 and other group 2 coronaviruses in 3CL pro , Pol, helicase, HE, S, ORF4, E and M (Fig. 3) . No evidence of recombination was shown between the N of CoV-HKU1 and those of other group 2 coronaviruses.",
            "cite_spans": [],
            "ref_spans": [
                {
                    "start": 122,
                    "end": 129,
                    "text": "Table 1",
                    "ref_id": "TABREF0"
                },
                {
                    "start": 342,
                    "end": 351,
                    "text": "(Fig. 2b)",
                    "ref_id": "FIGREF4"
                },
                {
                    "start": 497,
                    "end": 506,
                    "text": "(Fig. 2b)",
                    "ref_id": "FIGREF4"
                },
                {
                    "start": 821,
                    "end": 829,
                    "text": "(Fig. 3)",
                    "ref_id": "FIGREF5"
                }
            ],
            "section": "Results"
        },
        {
            "text": "CoV-HKU1 is a distinct member of group 2 coronaviruses. It was confirmed by both phylogenetic analysis of 22 protein coding regions (Fig. 1b) and analysis of the conserved cysteine residues in the amino-terminal of the S proteins (Fig. 2a) that CoV-HKU1 is a group 2 coronavirus. Furthermore, phylogenetic analysis of the 22 protein coding regions revealed that there were 10-54% a.a. differences between a particular protein coding region in CoV-HKU1 and the corresponding region in the most closely related sequence, indicating that CoV-HKU1 is distinct from the other group 2 coronaviruses. This fact was further supported by results of correspondence analysis of codon usage (Fig. 2b) .",
            "cite_spans": [],
            "ref_spans": [
                {
                    "start": 132,
                    "end": 141,
                    "text": "(Fig. 1b)",
                    "ref_id": "FIGREF1"
                },
                {
                    "start": 230,
                    "end": 239,
                    "text": "(Fig. 2a)",
                    "ref_id": "FIGREF4"
                },
                {
                    "start": 679,
                    "end": 688,
                    "text": "(Fig. 2b)",
                    "ref_id": "FIGREF4"
                }
            ],
            "section": "Discussion"
        },
        {
            "text": "Recombination events were common among CoV-HKU1 and other group 2 coronaviruses. Coronaviruses have high frequency of homologous RNA recombination, which has been observed in both tissue culture [10, 14] and experimentally infected animals [8] . In split tree analysis, recombination events would result in reticulations instead of simple branching structures. As shown in Fig. 3 , recombination was particularly frequent in CoV-HKU1 and MHV as compared to other group 2 coronaviruses such as BCoV and HCoV-OC43. The particular high recombination frequency in MHV [1] is in line with evidence of a lot of interstrain recombination, as shown by the high number of reticulations in various ORFs of the different MHV strains (Fig. 3) . Complete genome sequencing of additional CoV-HKU1 and further split tree analysis would shed light on whether CoV-HKU1 behaves more like MHV or BCoV and HCoV-OC43. CoV-HKU1 may have originated from a major recombination event and numerous minor recombination events among group 2 coronaviruses. In feline coronavirus, the site of recombination has been pinpointed to a region of about 50 nucleotides in the M gene by multiple alignment [6] .As for recombination between different strains of MHV, in vitro studies have shown both variable sites and rates of recombination, with the S gene have a frequency three fold that of the polymerase gene [4, 14] . In CoV-HKU1, nine of the 14 phylogenetic trees constructed using deduced a.a. sequences of p65 to nsp10 showed that CoV-HKU1 was clustered with MHV (Fig. 1b) . Interestingly, the topologies of the phylogenetic trees changed dramatically from nsp11. For the eight trees from nsp11 to N, seven revealed that the CoV-HKU1 branch appeared as the first branch among the group 2 coronaviruses (Fig. 1b) (P < 0.01 by chi-square test). A logical explanation was that a major recombination event has taken place in the region between nsp10 and nsp11 when CoV-HKU1 first appeared. However, this recombination event was not evident in multiple alignment performed at the junction between nsp10 and nsp11 (data not shown). This is because although CoV-HKU1 is more clustered with MHV from p65 to nsp10, the difference in phylogenetic distances between CoV-HKU1 and MHV and those between CoV-HKU1 and BCoV/HCoV-OC43 is not marked (Fig. 1b) , in contrast to what was observed in feline coronavirus [6] . Furthermore, bootscanning analysis in the whole genome did not reveal any putative recombination break point (data not shown). We speculate that this could be due to numerous minor recombination events between p65 and nsp10, such as between p65 and nsp1-PL1 pro , between nsp1-PL2 pro and nsp1-HD1, between nsp4 and nsp5, and between nsp5 and nsp6. This has resulted in CoV-HKU1 being clustered with MHV in only nine of the 14 phylogenetic trees constructed using deduced a.a. from p65 to nsp10, but four of the 14 trees with the CoV-HKU1 branch being the first branch among the group 2 coronaviruses.",
            "cite_spans": [
                {
                    "start": 195,
                    "end": 199,
                    "text": "[10,",
                    "ref_id": "BIBREF9"
                },
                {
                    "start": 200,
                    "end": 203,
                    "text": "14]",
                    "ref_id": "BIBREF13"
                },
                {
                    "start": 240,
                    "end": 243,
                    "text": "[8]",
                    "ref_id": "BIBREF7"
                },
                {
                    "start": 564,
                    "end": 567,
                    "text": "[1]",
                    "ref_id": "BIBREF0"
                },
                {
                    "start": 1169,
                    "end": 1172,
                    "text": "[6]",
                    "ref_id": "BIBREF5"
                },
                {
                    "start": 1377,
                    "end": 1380,
                    "text": "[4,",
                    "ref_id": "BIBREF3"
                },
                {
                    "start": 1381,
                    "end": 1384,
                    "text": "14]",
                    "ref_id": "BIBREF13"
                },
                {
                    "start": 2371,
                    "end": 2374,
                    "text": "[6]",
                    "ref_id": "BIBREF5"
                }
            ],
            "ref_spans": [
                {
                    "start": 373,
                    "end": 379,
                    "text": "Fig. 3",
                    "ref_id": "FIGREF5"
                },
                {
                    "start": 722,
                    "end": 730,
                    "text": "(Fig. 3)",
                    "ref_id": "FIGREF5"
                },
                {
                    "start": 1535,
                    "end": 1544,
                    "text": "(Fig. 1b)",
                    "ref_id": "FIGREF1"
                },
                {
                    "start": 1774,
                    "end": 1783,
                    "text": "(Fig. 1b)",
                    "ref_id": "FIGREF1"
                },
                {
                    "start": 2304,
                    "end": 2313,
                    "text": "(Fig. 1b)",
                    "ref_id": "FIGREF1"
                }
            ],
            "section": "Discussion"
        }
    ],
    "bib_entries": {
        "BIBREF0": {
            "ref_id": "b0",
            "title": "Establishing a genetic recombination map for murine coronavirus strain A59 complementation groups",
            "authors": [
                {
                    "first": "R",
                    "middle": [
                        "S"
                    ],
                    "last": "Baric",
                    "suffix": ""
                },
                {
                    "first": "K",
                    "middle": [],
                    "last": "Fu",
                    "suffix": ""
                },
                {
                    "first": "M",
                    "middle": [
                        "C"
                    ],
                    "last": "Schaad",
                    "suffix": ""
                },
                {
                    "first": "S",
                    "middle": [
                        "A"
                    ],
                    "last": "Stohlman",
                    "suffix": ""
                }
            ],
            "year": 1990,
            "venue": "Virology",
            "volume": "177",
            "issn": "",
            "pages": "646--656",
            "other_ids": {}
        },
        "BIBREF2": {
            "ref_id": "b2",
            "title": "A previously undescribed coronavirus associated with respiratory disease in humans",
            "authors": [
                {
                    "first": "R",
                    "middle": [
                        "A"
                    ],
                    "last": "Fouchier",
                    "suffix": ""
                },
                {
                    "first": "N",
                    "middle": [
                        "G"
                    ],
                    "last": "Hartwig",
                    "suffix": ""
                },
                {
                    "first": "T",
                    "middle": [
                        "M"
                    ],
                    "last": "Bestebroer",
                    "suffix": ""
                },
                {
                    "first": "B",
                    "middle": [],
                    "last": "Niemever",
                    "suffix": ""
                },
                {
                    "first": "J",
                    "middle": [
                        "C"
                    ],
                    "last": "De Jong",
                    "suffix": ""
                },
                {
                    "first": "J",
                    "middle": [
                        "H"
                    ],
                    "last": "Simon",
                    "suffix": ""
                },
                {
                    "first": "A",
                    "middle": [
                        "D"
                    ],
                    "last": "Osterhaus",
                    "suffix": ""
                }
            ],
            "year": 2004,
            "venue": "Proc Natl Acad Sci",
            "volume": "101",
            "issn": "",
            "pages": "6212--6216",
            "other_ids": {}
        },
        "BIBREF3": {
            "ref_id": "b3",
            "title": "Evidence for variable rates of recombination in the MHV genome",
            "authors": [
                {
                    "first": "K",
                    "middle": [],
                    "last": "Fu",
                    "suffix": ""
                },
                {
                    "first": "R",
                    "middle": [
                        "S"
                    ],
                    "last": "Baric",
                    "suffix": ""
                }
            ],
            "year": 1992,
            "venue": "Virology",
            "volume": "189",
            "issn": "",
            "pages": "88--102",
            "other_ids": {}
        },
        "BIBREF4": {
            "ref_id": "b4",
            "title": "Codon frequencies in 119 individual genes confirm consistent choices of degenerate bases according to genome type",
            "authors": [
                {
                    "first": "R",
                    "middle": [],
                    "last": "Grantham",
                    "suffix": ""
                },
                {
                    "first": "C",
                    "middle": [],
                    "last": "Gautier",
                    "suffix": ""
                },
                {
                    "first": "M",
                    "middle": [],
                    "last": "Gouy",
                    "suffix": ""
                }
            ],
            "year": 1980,
            "venue": "Nucleic Acids Res",
            "volume": "8",
            "issn": "",
            "pages": "1893--1912",
            "other_ids": {}
        },
        "BIBREF5": {
            "ref_id": "b5",
            "title": "Feline coronavirus type II strains 79-1683 and 79-1146 originate from a double recombination between feline coronavirus type I and canine coronavirus",
            "authors": [
                {
                    "first": "A",
                    "middle": [
                        "A"
                    ],
                    "last": "Herrewegh",
                    "suffix": ""
                },
                {
                    "first": "I",
                    "middle": [],
                    "last": "Smeenk",
                    "suffix": ""
                },
                {
                    "first": "M",
                    "middle": [
                        "C"
                    ],
                    "last": "Horzinek",
                    "suffix": ""
                },
                {
                    "first": "P",
                    "middle": [
                        "J"
                    ],
                    "last": "Rottier",
                    "suffix": ""
                },
                {
                    "first": "R",
                    "middle": [
                        "J"
                    ],
                    "last": "De Groot",
                    "suffix": ""
                }
            ],
            "year": 1998,
            "venue": "J Virol",
            "volume": "72",
            "issn": "",
            "pages": "4508--4514",
            "other_ids": {}
        },
        "BIBREF6": {
            "ref_id": "b6",
            "title": "SplitsTree: analyzing and visualizing evolutionary data",
            "authors": [
                {
                    "first": "D",
                    "middle": [
                        "H"
                    ],
                    "last": "Huson",
                    "suffix": ""
                }
            ],
            "year": 1998,
            "venue": "Bioinformatics",
            "volume": "14",
            "issn": "",
            "pages": "68--73",
            "other_ids": {}
        },
        "BIBREF7": {
            "ref_id": "b7",
            "title": "In vivo RNA-RNA recombination of coronavirus in mouse brain",
            "authors": [
                {
                    "first": "J",
                    "middle": [
                        "G"
                    ],
                    "last": "Keck",
                    "suffix": ""
                },
                {
                    "first": "G",
                    "middle": [
                        "K"
                    ],
                    "last": "Matsushima",
                    "suffix": ""
                },
                {
                    "first": "S",
                    "middle": [],
                    "last": "Makino",
                    "suffix": ""
                },
                {
                    "first": "J",
                    "middle": [
                        "O"
                    ],
                    "last": "Fleming",
                    "suffix": ""
                },
                {
                    "first": "D",
                    "middle": [
                        "M"
                    ],
                    "last": "Vannier",
                    "suffix": ""
                },
                {
                    "first": "S",
                    "middle": [
                        "A"
                    ],
                    "last": "Stohlman",
                    "suffix": ""
                },
                {
                    "first": "M",
                    "middle": [
                        "M"
                    ],
                    "last": "Lai",
                    "suffix": ""
                }
            ],
            "year": 1988,
            "venue": "J Virol",
            "volume": "62",
            "issn": "",
            "pages": "1810--1813",
            "other_ids": {}
        },
        "BIBREF8": {
            "ref_id": "b8",
            "title": "Sequence evidence for RNA recombination in field isolates of avian coronavirus infectious bronchitis virus",
            "authors": [
                {
                    "first": "J",
                    "middle": [
                        "G"
                    ],
                    "last": "Kusters",
                    "suffix": ""
                },
                {
                    "first": "E",
                    "middle": [
                        "J"
                    ],
                    "last": "Jager",
                    "suffix": ""
                },
                {
                    "first": "H",
                    "middle": [
                        "G"
                    ],
                    "last": "Niesters",
                    "suffix": ""
                },
                {
                    "first": "B",
                    "middle": [
                        "A"
                    ],
                    "last": "Van Der Zeijst",
                    "suffix": ""
                }
            ],
            "year": 1990,
            "venue": "Vaccine",
            "volume": "8",
            "issn": "",
            "pages": "605--608",
            "other_ids": {}
        },
        "BIBREF9": {
            "ref_id": "b9",
            "title": "Recombination between nonsegmented RNA genomes of murine coronaviruses",
            "authors": [
                {
                    "first": "M",
                    "middle": [
                        "M"
                    ],
                    "last": "Lai",
                    "suffix": ""
                },
                {
                    "first": "R",
                    "middle": [
                        "S"
                    ],
                    "last": "Baric",
                    "suffix": ""
                },
                {
                    "first": "S",
                    "middle": [],
                    "last": "Makino",
                    "suffix": ""
                },
                {
                    "first": "J",
                    "middle": [
                        "G"
                    ],
                    "last": "Keck",
                    "suffix": ""
                },
                {
                    "first": "J",
                    "middle": [],
                    "last": "Egbert",
                    "suffix": ""
                },
                {
                    "first": "J",
                    "middle": [
                        "L"
                    ],
                    "last": "Leibowitz",
                    "suffix": ""
                },
                {
                    "first": "S",
                    "middle": [
                        "A"
                    ],
                    "last": "Stohlman",
                    "suffix": ""
                }
            ],
            "year": 1985,
            "venue": "J Virol",
            "volume": "56",
            "issn": "",
            "pages": "449--456",
            "other_ids": {}
        },
        "BIBREF10": {
            "ref_id": "b10",
            "title": "The molecular biology of coronaviruses",
            "authors": [
                {
                    "first": "M",
                    "middle": [
                        "M"
                    ],
                    "last": "Lai",
                    "suffix": ""
                },
                {
                    "first": "D",
                    "middle": [],
                    "last": "Cavanagh",
                    "suffix": ""
                }
            ],
            "year": 1997,
            "venue": "Adv Virus Res",
            "volume": "48",
            "issn": "",
            "pages": "1--100",
            "other_ids": {}
        },
        "BIBREF11": {
            "ref_id": "b11",
            "title": "Detection of severe acute respiratory syndrome (SARS) coronavirus nucleoapsid protein in SARS patients by enzyme-linked immunosorbent assay",
            "authors": [
                {
                    "first": "S",
                    "middle": [
                        "K"
                    ],
                    "last": "Lau",
                    "suffix": ""
                },
                {
                    "first": "P",
                    "middle": [
                        "C"
                    ],
                    "last": "Woo",
                    "suffix": ""
                },
                {
                    "first": "B",
                    "middle": [
                        "H"
                    ],
                    "last": "Wong",
                    "suffix": ""
                },
                {
                    "first": "G",
                    "middle": [
                        "K"
                    ],
                    "last": "Woo",
                    "suffix": ""
                },
                {
                    "first": "R",
                    "middle": [
                        "W"
                    ],
                    "last": "Poon",
                    "suffix": ""
                },
                {
                    "first": "H",
                    "middle": [
                        "W"
                    ],
                    "last": "Tsoi",
                    "suffix": ""
                },
                {
                    "first": "K",
                    "middle": [
                        "H"
                    ],
                    "last": "Chan",
                    "suffix": ""
                },
                {
                    "first": "W",
                    "middle": [
                        "I"
                    ],
                    "last": "Wei",
                    "suffix": ""
                },
                {
                    "first": "J",
                    "middle": [
                        "S"
                    ],
                    "last": "Peiris",
                    "suffix": ""
                },
                {
                    "first": "K",
                    "middle": [
                        "Y"
                    ],
                    "last": "Yuen",
                    "suffix": ""
                }
            ],
            "year": 2004,
            "venue": "J Clin Microbiol",
            "volume": "42",
            "issn": "",
            "pages": "2884--2889",
            "other_ids": {}
        },
        "BIBREF12": {
            "ref_id": "b12",
            "title": "Evidence of genetic diversity generated by recombination among avian coronavirus IBV",
            "authors": [
                {
                    "first": "C",
                    "middle": [
                        "W"
                    ],
                    "last": "Lee",
                    "suffix": ""
                },
                {
                    "first": "M",
                    "middle": [
                        "W"
                    ],
                    "last": "Jackwood",
                    "suffix": ""
                }
            ],
            "year": 2000,
            "venue": "Arch Virol",
            "volume": "145",
            "issn": "",
            "pages": "2135--2148",
            "other_ids": {}
        },
        "BIBREF13": {
            "ref_id": "b13",
            "title": "High-frequency RNA recombination of murine coronaviruses",
            "authors": [
                {
                    "first": "S",
                    "middle": [],
                    "last": "Makino",
                    "suffix": ""
                },
                {
                    "first": "J",
                    "middle": [
                        "G"
                    ],
                    "last": "Keck",
                    "suffix": ""
                },
                {
                    "first": "S",
                    "middle": [
                        "A"
                    ],
                    "last": "Stohlman",
                    "suffix": ""
                },
                {
                    "first": "M",
                    "middle": [
                        "M"
                    ],
                    "last": "Lai",
                    "suffix": ""
                }
            ],
            "year": 1986,
            "venue": "J Virol",
            "volume": "57",
            "issn": "",
            "pages": "729--737",
            "other_ids": {}
        },
        "BIBREF15": {
            "ref_id": "b15",
            "title": "Coronavirus as a possible cause of severe acute respiratory syndrome",
            "authors": [
                {
                    "first": "J",
                    "middle": [
                        "S"
                    ],
                    "last": "Peiris",
                    "suffix": ""
                },
                {
                    "first": "S",
                    "middle": [
                        "T"
                    ],
                    "last": "Lai",
                    "suffix": ""
                },
                {
                    "first": "L",
                    "middle": [
                        "L"
                    ],
                    "last": "Poon",
                    "suffix": ""
                },
                {
                    "first": "Y",
                    "middle": [],
                    "last": "Guan",
                    "suffix": ""
                },
                {
                    "first": "L",
                    "middle": [
                        "Y"
                    ],
                    "last": "Yam",
                    "suffix": ""
                },
                {
                    "first": "W",
                    "middle": [],
                    "last": "Lim",
                    "suffix": ""
                },
                {
                    "first": "J",
                    "middle": [],
                    "last": "Nicholls",
                    "suffix": ""
                },
                {
                    "first": "W",
                    "middle": [
                        "K"
                    ],
                    "last": "Yee",
                    "suffix": ""
                },
                {
                    "first": "W",
                    "middle": [
                        "W"
                    ],
                    "last": "Yan",
                    "suffix": ""
                },
                {
                    "first": "M",
                    "middle": [
                        "T"
                    ],
                    "last": "Cheung",
                    "suffix": ""
                },
                {
                    "first": "V",
                    "middle": [
                        "C"
                    ],
                    "last": "Cheng",
                    "suffix": ""
                },
                {
                    "first": "K",
                    "middle": [
                        "H"
                    ],
                    "last": "Chan",
                    "suffix": ""
                },
                {
                    "first": "D",
                    "middle": [
                        "N"
                    ],
                    "last": "Tsang",
                    "suffix": ""
                },
                {
                    "first": "R",
                    "middle": [
                        "W"
                    ],
                    "last": "Yung",
                    "suffix": ""
                },
                {
                    "first": "T",
                    "middle": [
                        "K"
                    ],
                    "last": "Ng",
                    "suffix": ""
                },
                {
                    "first": "K",
                    "middle": [
                        "Y"
                    ],
                    "last": "Yuen",
                    "suffix": ""
                }
            ],
            "year": 2003,
            "venue": "SARS study group",
            "volume": "361",
            "issn": "",
            "pages": "1319--1325",
            "other_ids": {}
        },
        "BIBREF16": {
            "ref_id": "b16",
            "title": "Characterization of a novel coronavirus associated with severe acute respiratory syndrome",
            "authors": [
                {
                    "first": "P",
                    "middle": [
                        "A"
                    ],
                    "last": "Rota",
                    "suffix": ""
                },
                {
                    "first": "M",
                    "middle": [
                        "S"
                    ],
                    "last": "Oberste",
                    "suffix": ""
                },
                {
                    "first": "S",
                    "middle": [
                        "S"
                    ],
                    "last": "Monroe",
                    "suffix": ""
                },
                {
                    "first": "W",
                    "middle": [
                        "A"
                    ],
                    "last": "Nix",
                    "suffix": ""
                },
                {
                    "first": "R",
                    "middle": [],
                    "last": "Campagnoli",
                    "suffix": ""
                },
                {
                    "first": "J",
                    "middle": [
                        "P"
                    ],
                    "last": "Icenogle",
                    "suffix": ""
                },
                {
                    "first": "S",
                    "middle": [],
                    "last": "Penaranda",
                    "suffix": ""
                },
                {
                    "first": "B",
                    "middle": [],
                    "last": "Bankamp",
                    "suffix": ""
                },
                {
                    "first": "K",
                    "middle": [],
                    "last": "Maher",
                    "suffix": ""
                },
                {
                    "first": "M",
                    "middle": [
                        "H"
                    ],
                    "last": "Chen",
                    "suffix": ""
                },
                {
                    "first": "S",
                    "middle": [],
                    "last": "Tong",
                    "suffix": ""
                },
                {
                    "first": "A",
                    "middle": [],
                    "last": "Tamin",
                    "suffix": ""
                },
                {
                    "first": "L",
                    "middle": [],
                    "last": "Lowe",
                    "suffix": ""
                },
                {
                    "first": "M",
                    "middle": [],
                    "last": "Frace",
                    "suffix": ""
                },
                {
                    "first": "J",
                    "middle": [
                        "L"
                    ],
                    "last": "Derisi",
                    "suffix": ""
                },
                {
                    "first": "Q",
                    "middle": [],
                    "last": "Chen",
                    "suffix": ""
                },
                {
                    "first": "D",
                    "middle": [],
                    "last": "Wang",
                    "suffix": ""
                },
                {
                    "first": "D",
                    "middle": [
                        "D"
                    ],
                    "last": "Erdman",
                    "suffix": ""
                },
                {
                    "first": "T",
                    "middle": [
                        "C"
                    ],
                    "last": "Peret",
                    "suffix": ""
                },
                {
                    "first": "C",
                    "middle": [],
                    "last": "Burns",
                    "suffix": ""
                },
                {
                    "first": "T",
                    "middle": [
                        "G"
                    ],
                    "last": "Ksiazek",
                    "suffix": ""
                },
                {
                    "first": "P",
                    "middle": [
                        "E"
                    ],
                    "last": "Rollin",
                    "suffix": ""
                },
                {
                    "first": "A",
                    "middle": [],
                    "last": "Sanchez",
                    "suffix": ""
                },
                {
                    "first": "S",
                    "middle": [],
                    "last": "Liffick",
                    "suffix": ""
                },
                {
                    "first": "B",
                    "middle": [],
                    "last": "Holloway",
                    "suffix": ""
                },
                {
                    "first": "J",
                    "middle": [],
                    "last": "Limor",
                    "suffix": ""
                },
                {
                    "first": "K",
                    "middle": [],
                    "last": "Mccaustland",
                    "suffix": ""
                },
                {
                    "first": "M",
                    "middle": [],
                    "last": "Olsen-Rasmussen",
                    "suffix": ""
                },
                {
                    "first": "R",
                    "middle": [],
                    "last": "Fouchier",
                    "suffix": ""
                },
                {
                    "first": "S",
                    "middle": [],
                    "last": "Gunther",
                    "suffix": ""
                },
                {
                    "first": "A",
                    "middle": [
                        "D"
                    ],
                    "last": "Osterhaus",
                    "suffix": ""
                },
                {
                    "first": "C",
                    "middle": [],
                    "last": "Drosten",
                    "suffix": ""
                },
                {
                    "first": "M",
                    "middle": [
                        "A"
                    ],
                    "last": "Pallansch",
                    "suffix": ""
                },
                {
                    "first": "L",
                    "middle": [
                        "J"
                    ],
                    "last": "Anderson",
                    "suffix": ""
                },
                {
                    "first": "W",
                    "middle": [
                        "J"
                    ],
                    "last": "Bellini",
                    "suffix": ""
                }
            ],
            "year": 2003,
            "venue": "Science",
            "volume": "300",
            "issn": "",
            "pages": "1394--1399",
            "other_ids": {}
        },
        "BIBREF17": {
            "ref_id": "b17",
            "title": "Unique and conserved features of genome and proteome of SARS-coronavirus, an early split-off from the coronavirus group 2 lineage",
            "authors": [
                {
                    "first": "E",
                    "middle": [
                        "J"
                    ],
                    "last": "Snijder",
                    "suffix": ""
                },
                {
                    "first": "P",
                    "middle": [
                        "J"
                    ],
                    "last": "Bredenbeek",
                    "suffix": ""
                },
                {
                    "first": "J",
                    "middle": [
                        "C"
                    ],
                    "last": "Dobbe",
                    "suffix": ""
                },
                {
                    "first": "V",
                    "middle": [],
                    "last": "Thiel",
                    "suffix": ""
                },
                {
                    "first": "J",
                    "middle": [],
                    "last": "Ziebuhr",
                    "suffix": ""
                },
                {
                    "first": "L",
                    "middle": [
                        "L"
                    ],
                    "last": "Poon",
                    "suffix": ""
                },
                {
                    "first": "Y",
                    "middle": [],
                    "last": "Guan",
                    "suffix": ""
                },
                {
                    "first": "M",
                    "middle": [],
                    "last": "Rozanov",
                    "suffix": ""
                },
                {
                    "first": "W",
                    "middle": [
                        "J"
                    ],
                    "last": "Spaan",
                    "suffix": ""
                },
                {
                    "first": "A",
                    "middle": [
                        "E"
                    ],
                    "last": "Gorbalenya",
                    "suffix": ""
                }
            ],
            "year": 2003,
            "venue": "J Mol Biol",
            "volume": "331",
            "issn": "",
            "pages": "991--1004",
            "other_ids": {}
        },
        "BIBREF18": {
            "ref_id": "b18",
            "title": "Mosaic evolution of the severe acute respiratory syndrome coronavirus",
            "authors": [
                {
                    "first": "J",
                    "middle": [],
                    "last": "Stavrinides",
                    "suffix": ""
                },
                {
                    "first": "D",
                    "middle": [
                        "S"
                    ],
                    "last": "Guttman",
                    "suffix": ""
                }
            ],
            "year": 2004,
            "venue": "J Virol",
            "volume": "78",
            "issn": "",
            "pages": "76--82",
            "other_ids": {}
        },
        "BIBREF19": {
            "ref_id": "b19",
            "title": "Identification of a new human coronavirus",
            "authors": [
                {
                    "first": "L",
                    "middle": [],
                    "last": "Van Der Hoek",
                    "suffix": ""
                },
                {
                    "first": "K",
                    "middle": [],
                    "last": "Pyrc",
                    "suffix": ""
                },
                {
                    "first": "M",
                    "middle": [
                        "F"
                    ],
                    "last": "Jebbink",
                    "suffix": ""
                },
                {
                    "first": "W",
                    "middle": [],
                    "last": "Vermeulen-Oost",
                    "suffix": ""
                },
                {
                    "first": "R",
                    "middle": [
                        "J"
                    ],
                    "last": "Berkhout",
                    "suffix": ""
                },
                {
                    "first": "K",
                    "middle": [
                        "C"
                    ],
                    "last": "Wolthers",
                    "suffix": ""
                },
                {
                    "first": "P",
                    "middle": [
                        "M"
                    ],
                    "last": "Wertheim-Van Dillen",
                    "suffix": ""
                },
                {
                    "first": "J",
                    "middle": [],
                    "last": "Kaandorp",
                    "suffix": ""
                },
                {
                    "first": "J",
                    "middle": [],
                    "last": "Spaargaren",
                    "suffix": ""
                },
                {
                    "first": "B",
                    "middle": [],
                    "last": "Berkhout",
                    "suffix": ""
                }
            ],
            "year": 2004,
            "venue": "Nat Med",
            "volume": "10",
            "issn": "",
            "pages": "368--373",
            "other_ids": {}
        },
        "BIBREF20": {
            "ref_id": "b20",
            "title": "Characterization and complete genome sequence of a novel coronavirus, coronavirus HKU1, from patients with pneumonia",
            "authors": [
                {
                    "first": "P",
                    "middle": [
                        "C"
                    ],
                    "last": "Woo",
                    "suffix": ""
                },
                {
                    "first": "S",
                    "middle": [
                        "K"
                    ],
                    "last": "Lau",
                    "suffix": ""
                },
                {
                    "first": "C",
                    "middle": [
                        "M"
                    ],
                    "last": "Chu",
                    "suffix": ""
                },
                {
                    "first": "K",
                    "middle": [
                        "H"
                    ],
                    "last": "Chan",
                    "suffix": ""
                },
                {
                    "first": "H",
                    "middle": [
                        "W"
                    ],
                    "last": "Tsoi",
                    "suffix": ""
                },
                {
                    "first": "Y",
                    "middle": [],
                    "last": "Huang",
                    "suffix": ""
                },
                {
                    "first": "B",
                    "middle": [
                        "H"
                    ],
                    "last": "Wong",
                    "suffix": ""
                },
                {
                    "first": "R",
                    "middle": [
                        "W"
                    ],
                    "last": "Poon",
                    "suffix": ""
                },
                {
                    "first": "J",
                    "middle": [
                        "J"
                    ],
                    "last": "Cai",
                    "suffix": ""
                },
                {
                    "first": "W",
                    "middle": [
                        "K"
                    ],
                    "last": "Luk",
                    "suffix": ""
                },
                {
                    "first": "L",
                    "middle": [
                        "L"
                    ],
                    "last": "Poon",
                    "suffix": ""
                },
                {
                    "first": "S",
                    "middle": [
                        "S"
                    ],
                    "last": "Wong",
                    "suffix": ""
                },
                {
                    "first": "Y",
                    "middle": [],
                    "last": "Guan",
                    "suffix": ""
                },
                {
                    "first": "J",
                    "middle": [
                        "S"
                    ],
                    "last": "Malik",
                    "suffix": ""
                },
                {
                    "first": "K",
                    "middle": [
                        "Y"
                    ],
                    "last": "Yuen",
                    "suffix": ""
                }
            ],
            "year": 2005,
            "venue": "J Virol",
            "volume": "79",
            "issn": "",
            "pages": "884--895",
            "other_ids": {}
        },
        "BIBREF21": {
            "ref_id": "b21",
            "title": "Relative rates of non-pneumonic SARS coronavirus infection and SARS coronavirus pneumonia",
            "authors": [
                {
                    "first": "P",
                    "middle": [
                        "C"
                    ],
                    "last": "Woo",
                    "suffix": ""
                },
                {
                    "first": "S",
                    "middle": [
                        "K"
                    ],
                    "last": "Lau",
                    "suffix": ""
                },
                {
                    "first": "H",
                    "middle": [
                        "W"
                    ],
                    "last": "Tsoi",
                    "suffix": ""
                },
                {
                    "first": "K",
                    "middle": [
                        "H"
                    ],
                    "last": "Chan",
                    "suffix": ""
                },
                {
                    "first": "B",
                    "middle": [
                        "H"
                    ],
                    "last": "Wong",
                    "suffix": ""
                },
                {
                    "first": "X",
                    "middle": [
                        "Y"
                    ],
                    "last": "Che",
                    "suffix": ""
                },
                {
                    "first": "V",
                    "middle": [
                        "K"
                    ],
                    "last": "Tam",
                    "suffix": ""
                },
                {
                    "first": "S",
                    "middle": [
                        "C"
                    ],
                    "last": "Tam",
                    "suffix": ""
                },
                {
                    "first": "V",
                    "middle": [
                        "C"
                    ],
                    "last": "Cheng",
                    "suffix": ""
                },
                {
                    "first": "I",
                    "middle": [
                        "F"
                    ],
                    "last": "Hung",
                    "suffix": ""
                },
                {
                    "first": "S",
                    "middle": [
                        "S"
                    ],
                    "last": "Wong",
                    "suffix": ""
                },
                {
                    "first": "B",
                    "middle": [
                        "J"
                    ],
                    "last": "Zheng",
                    "suffix": ""
                },
                {
                    "first": "Y",
                    "middle": [],
                    "last": "Guan",
                    "suffix": ""
                },
                {
                    "first": "K",
                    "middle": [
                        "Y"
                    ],
                    "last": "Yuen",
                    "suffix": ""
                }
            ],
            "year": 2004,
            "venue": "Lancet",
            "volume": "363",
            "issn": "",
            "pages": "841--845",
            "other_ids": {}
        },
        "BIBREF22": {
            "ref_id": "b22",
            "title": "Longitudinal profile of immunoglobulin G (IgG), IgM, and IgA antibodies against the severe acute respiratory syndrome (SARS) coronavirus nucleocapsid protein in patients with pneumonia due to the SARS coronavirus",
            "authors": [
                {
                    "first": "P",
                    "middle": [
                        "C"
                    ],
                    "last": "Woo",
                    "suffix": ""
                },
                {
                    "first": "S",
                    "middle": [
                        "K"
                    ],
                    "last": "Lau",
                    "suffix": ""
                },
                {
                    "first": "B",
                    "middle": [
                        "H"
                    ],
                    "last": "Wong",
                    "suffix": ""
                },
                {
                    "first": "K",
                    "middle": [
                        "H"
                    ],
                    "last": "Chan",
                    "suffix": ""
                },
                {
                    "first": "C",
                    "middle": [
                        "M"
                    ],
                    "last": "Chu",
                    "suffix": ""
                },
                {
                    "first": "H",
                    "middle": [
                        "W"
                    ],
                    "last": "Tsoi",
                    "suffix": ""
                },
                {
                    "first": "Y",
                    "middle": [],
                    "last": "Huang",
                    "suffix": ""
                },
                {
                    "first": "J",
                    "middle": [
                        "S"
                    ],
                    "last": "Peiris",
                    "suffix": ""
                },
                {
                    "first": "K",
                    "middle": [
                        "Y"
                    ],
                    "last": "Yuen",
                    "suffix": ""
                }
            ],
            "year": 2004,
            "venue": "Clin Diagn Lab Immunol",
            "volume": "11",
            "issn": "",
            "pages": "665--668",
            "other_ids": {}
        },
        "BIBREF23": {
            "ref_id": "b23",
            "title": "Detection of specific antibodies to severe acute respiratory syndrome (SARS) coronavirus nucleocapsid protein for serodiagnosis of SARS coronavirus pneumonia",
            "authors": [
                {
                    "first": "P",
                    "middle": [
                        "C"
                    ],
                    "last": "Woo",
                    "suffix": ""
                },
                {
                    "first": "S",
                    "middle": [
                        "K"
                    ],
                    "last": "Lau",
                    "suffix": ""
                },
                {
                    "first": "B",
                    "middle": [
                        "H"
                    ],
                    "last": "Wong",
                    "suffix": ""
                },
                {
                    "first": "H",
                    "middle": [
                        "W"
                    ],
                    "last": "Tsoi",
                    "suffix": ""
                },
                {
                    "first": "A",
                    "middle": [
                        "M"
                    ],
                    "last": "Fung",
                    "suffix": ""
                },
                {
                    "first": "K",
                    "middle": [
                        "H"
                    ],
                    "last": "Chan",
                    "suffix": ""
                },
                {
                    "first": "V",
                    "middle": [
                        "K"
                    ],
                    "last": "Tam",
                    "suffix": ""
                },
                {
                    "first": "J",
                    "middle": [
                        "S"
                    ],
                    "last": "Peiris",
                    "suffix": ""
                },
                {
                    "first": "K",
                    "middle": [
                        "Y"
                    ],
                    "last": "Yuen",
                    "suffix": ""
                }
            ],
            "year": 2004,
            "venue": "J Clin Microbiol",
            "volume": "42",
            "issn": "",
            "pages": "2306--2309",
            "other_ids": {}
        },
        "BIBREF24": {
            "ref_id": "b24",
            "title": "Author's address: Kwok-yung Yuen",
            "authors": [],
            "year": null,
            "venue": "",
            "volume": "",
            "issn": "",
            "pages": "",
            "other_ids": {}
        }
    },
    "ref_entries": {
        "FIGREF1": {
            "text": "Fig. 1",
            "latex": null,
            "type": "figure"
        },
        "FIGREF3": {
            "text": "Genome organization and phylogenetic analysis of CoV-HKU1. a Genome organization of CoV-HKU1 (GenBank accession no. AY597011), MHV (GenBank accession no. AF201929), HCoV-OC43 (GenBank accession no. AY585229) and BCoV (GenBank accession no. NC 003045). The homologous regions used for phylogenetic analysis were shaded. b Phylogenetic analysis of p65, conserved portions of nsp1 (PL1 pro , A1pp, PL2 pro , HD1 and HD2), nsp2-7, nsp9-13, HE, S, E, M and N in group 2 coronaviruses. The trees were constructed by neighbour joining method using Jukes-Cantor correction and bootstrap values calculated from 1000 trees. 578, 204, 107, 212, 421, 496, 303, 287, 89, 197, 110, 137, 928, 595, 521, 374, 299, 424, 1287, 84, 226 and 445 a.a. positions in p65, PL1 pro , A1pp, PL2 pro ,HD1, HD2, nsp2, nsp3, nsp4, nsp5, nsp6, nsp7, nsp9, nsp10, nsp11, nsp12, nsp13, HE, S, E, M and N respectively were included in the analysis. The scale bar indicates the estimated number of substitutions per 5 or 10 a.a. as indicated. The corresponding a.a. sequences of HCoV-229E were used as the outgroups, except for p65 and HE, for which the corresponding a.a. sequences in SARS-CoV and influenza C virus were used as the outgroups respectively",
            "latex": null,
            "type": "figure"
        },
        "FIGREF4": {
            "text": "Analysis of cysteine positions in the N-terminal 800 a.a. residues of S and codon usage patterns of CoV-HKU1. a Schematic representation of cysteine positions ( ) in the N-terminal domain of S in CoV-HKU1 in comparison with those in other coronaviruses. Conserved cysteine residues of S in different coronaviruses are joined by solid lines. The bar indicates the a.a. residue positions on S. b A scattered plot of the scores for the codon usage patterns of ORF 1ab, HE, S, M and N in MHV, HCoV-OC43, BCoV, PHEV, SDAV, PV and CoV-HKU1 on the first and second axis correspondence analysis with respect to axis 1 and 2 are shown in Fig. 2b. Axis 1 and 2 explained 36.6% and 19.3% of the variations in codon usage respectively.",
            "latex": null,
            "type": "figure"
        },
        "FIGREF5": {
            "text": "Split decomposition graph of 3CL pro , Pol, helicase, HE, S, ORF4, E, M and N in the CoV-HKU1 genome",
            "latex": null,
            "type": "figure"
        },
        "TABREF0": {
            "text": "Number",
            "latex": null,
            "type": "table"
        }
    },
    "back_matter": [
        {
            "text": "This work is partly supported by the Research Grant Council Grant and Research Fund for the Control of Infectious Diseases of the Health, Welfare and Food Bureau of the Hong Kong SAR Government.",
            "cite_spans": [],
            "ref_spans": [],
            "section": "Acknowledgements"
        }
    ]
}