{
    "paper_id": "5f88b4d6e65a19b84991526dab51391ff4acf08f",
    "metadata": {
        "title": "The Natural History of Influenza Infection in the Severely Immunocompromised vs Nonimmunocompromised Hosts",
        "authors": [
            {
                "first": "Matthew",
                "middle": [
                    "J"
                ],
                "last": "Memoli",
                "suffix": "",
                "affiliation": {
                    "laboratory": "Laboratory of Infectious Diseases",
                    "institution": "Viral Pathogenesis and Evolution Section",
                    "location": {}
                },
                "email": ""
            },
            {
                "first": "Rani",
                "middle": [],
                "last": "Athota",
                "suffix": "",
                "affiliation": {
                    "laboratory": "Laboratory of Infectious Diseases",
                    "institution": "Viral Pathogenesis and Evolution Section",
                    "location": {}
                },
                "email": ""
            },
            {
                "first": "Susan",
                "middle": [],
                "last": "Reed",
                "suffix": "",
                "affiliation": {
                    "laboratory": "Laboratory of Infectious Diseases",
                    "institution": "Viral Pathogenesis and Evolution Section",
                    "location": {}
                },
                "email": ""
            },
            {
                "first": "Lindsay",
                "middle": [],
                "last": "Czajkowski",
                "suffix": "",
                "affiliation": {
                    "laboratory": "Laboratory of Infectious Diseases",
                    "institution": "Viral Pathogenesis and Evolution Section",
                    "location": {}
                },
                "email": ""
            },
            {
                "first": "Tyler",
                "middle": [],
                "last": "Bristol",
                "suffix": "",
                "affiliation": {
                    "laboratory": "Laboratory of Infectious Diseases",
                    "institution": "Viral Pathogenesis and Evolution Section",
                    "location": {}
                },
                "email": ""
            },
            {
                "first": "Kathleen",
                "middle": [],
                "last": "Proudfoot",
                "suffix": "",
                "affiliation": {
                    "laboratory": "Laboratory of Infectious Diseases",
                    "institution": "Viral Pathogenesis and Evolution Section",
                    "location": {}
                },
                "email": ""
            },
            {
                "first": "Rachel",
                "middle": [],
                "last": "Hagey",
                "suffix": "",
                "affiliation": {
                    "laboratory": "Laboratory of Infectious Diseases",
                    "institution": "Viral Pathogenesis and Evolution Section",
                    "location": {}
                },
                "email": ""
            },
            {
                "first": "Jocelyn",
                "middle": [],
                "last": "Voell",
                "suffix": "",
                "affiliation": {
                    "laboratory": "",
                    "institution": "National Institutes of Health",
                    "location": {
                        "settlement": "Bethesda",
                        "region": "Maryland"
                    }
                },
                "email": ""
            },
            {
                "first": "Charles",
                "middle": [],
                "last": "Fiorentino",
                "suffix": "",
                "affiliation": {
                    "laboratory": "",
                    "institution": "National Institutes of Health",
                    "location": {
                        "settlement": "Bethesda",
                        "region": "Maryland"
                    }
                },
                "email": ""
            },
            {
                "first": "Angela",
                "middle": [],
                "last": "Ademposi",
                "suffix": "",
                "affiliation": {
                    "laboratory": "",
                    "institution": "Medstar Washington Hospital Center",
                    "location": {
                        "settlement": "Washington",
                        "region": "DC"
                    }
                },
                "email": ""
            },
            {
                "first": "Shmuel",
                "middle": [],
                "last": "Shoham",
                "suffix": "",
                "affiliation": {
                    "laboratory": "",
                    "institution": "Johns Hopkins University School of Medicine",
                    "location": {
                        "settlement": "Baltimore",
                        "region": "Maryland"
                    }
                },
                "email": ""
            },
            {
                "first": "Jeffery",
                "middle": [
                    "K"
                ],
                "last": "Taubenberger",
                "suffix": "",
                "affiliation": {
                    "laboratory": "Laboratory of Infectious Diseases",
                    "institution": "Viral Pathogenesis and Evolution Section",
                    "location": {}
                },
                "email": ""
            }
        ]
    },
    "abstract": [],
    "body_text": [
        {
            "text": "During the past half-century, medical advances have led to an increase in the world's population of immunosuppressed individuals. This includes those receiving immunosuppressive therapies, those with acquired immunosuppressive diseases such as the 34 million worldwide with human immunodeficiency virus (HIV) and AIDS [1] , and individuals living longer with any of the over 150 known primary immunodeficiencies [2] . The most severely immunocompromised are those who have been diagnosed with a hematologic malignancy, solid organ tumor, or who receive other immunosuppressive therapies such as chemotherapy and/or solid organ or stem cell transplants.",
            "cite_spans": [
                {
                    "start": 318,
                    "end": 321,
                    "text": "[1]",
                    "ref_id": "BIBREF0"
                },
                {
                    "start": 412,
                    "end": 415,
                    "text": "[2]",
                    "ref_id": "BIBREF1"
                }
            ],
            "ref_spans": [],
            "section": ""
        },
        {
            "text": "Over 100 000 individuals annually receive solid organ transplants (SOT) worldwide [3] and more than 50 000 with hematologic malignancies and other diseases are treated with hematopoietic stem cell transplants (HSCT) annually [4] , leaving most of these individuals immunosuppressed for long periods. Even larger numbers of individuals are receiving immunosuppressive chemotherapies making immunocompromised individuals a larger part of the population than during any of the influenza pandemics of the twentieth century.",
            "cite_spans": [
                {
                    "start": 82,
                    "end": 85,
                    "text": "[3]",
                    "ref_id": "BIBREF2"
                },
                {
                    "start": 225,
                    "end": 228,
                    "text": "[4]",
                    "ref_id": "BIBREF3"
                }
            ],
            "ref_spans": [],
            "section": ""
        },
        {
            "text": "Epidemiologic studies have shown that severe immunosuppression is a major comorbidity that places individuals at the highest risk of severe morbidity and mortality due to influenza infection. Patients with AIDS have increased duration of disease due to influenza and higher incidence of pneumonia leading to increased mortality [5] [6] [7] . A study of hospitalized patients with leukemia and influenza reported 80% with pneumonia and 33% mortality [8] . More recently during the 2009 pandemic, studies reported similarly high levels of lower respiratory tract disease and need for hospitalization in those with hematologic malignancies and solid tumors undergoing chemotherapy [9] .",
            "cite_spans": [
                {
                    "start": 328,
                    "end": 331,
                    "text": "[5]",
                    "ref_id": "BIBREF4"
                },
                {
                    "start": 332,
                    "end": 335,
                    "text": "[6]",
                    "ref_id": "BIBREF5"
                },
                {
                    "start": 336,
                    "end": 339,
                    "text": "[7]",
                    "ref_id": "BIBREF6"
                },
                {
                    "start": 449,
                    "end": 452,
                    "text": "[8]",
                    "ref_id": "BIBREF7"
                },
                {
                    "start": 678,
                    "end": 681,
                    "text": "[9]",
                    "ref_id": "BIBREF8"
                }
            ],
            "ref_spans": [],
            "section": ""
        },
        {
            "text": "Similarly, in a large retrospective study of HSCT recipients, 1.3% of all patients developed influenza infection and 29% developed pneumonia [10] . A more recent study of HSCT patients demonstrated that up to 75% developed pneumonia after influenza infection with mortality as high as 43% [11] . In SOT, nosocomial outbreaks [12] and severe complications of influenza such as myocarditis [13] and severe pneumonitis [14] have been reported, even in those previously vaccinated. Multicenter studies of A(H1N1)pdm09 infection in SOT recipients have reported that 30%-40% of individuals infected developed pneumonia, 16%-17.5% required intensive care, with mortality as high as 7% [15] . Influenza following SOT leads to higher morbidity and mortality rates [16] , with increased rates of influenza pneumonia following lung transplantation, and a >20% mortality rate observed in SOT recipients infected with influenza [17, 18] .",
            "cite_spans": [
                {
                    "start": 141,
                    "end": 145,
                    "text": "[10]",
                    "ref_id": "BIBREF9"
                },
                {
                    "start": 289,
                    "end": 293,
                    "text": "[11]",
                    "ref_id": "BIBREF10"
                },
                {
                    "start": 325,
                    "end": 329,
                    "text": "[12]",
                    "ref_id": "BIBREF11"
                },
                {
                    "start": 388,
                    "end": 392,
                    "text": "[13]",
                    "ref_id": "BIBREF12"
                },
                {
                    "start": 416,
                    "end": 420,
                    "text": "[14]",
                    "ref_id": "BIBREF13"
                },
                {
                    "start": 678,
                    "end": 682,
                    "text": "[15]",
                    "ref_id": "BIBREF14"
                },
                {
                    "start": 755,
                    "end": 759,
                    "text": "[16]",
                    "ref_id": "BIBREF15"
                },
                {
                    "start": 915,
                    "end": 919,
                    "text": "[17,",
                    "ref_id": "BIBREF16"
                },
                {
                    "start": 920,
                    "end": 923,
                    "text": "18]",
                    "ref_id": "BIBREF17"
                }
            ],
            "ref_spans": [],
            "section": ""
        },
        {
            "text": "In addition to increased morbidity and mortality following infection, severely immunocompromised patients have been reported to show prolonged influenza shedding [19] [20] [21] [22] [23] [24] [25] . This has been associated with intrahost viral evolution, including antigenic drift within a single immunosuppressed host [24] , the development of antiviral resistance after therapy [19, 21-23, 25, 26] , and simultaneous coinfection with 2 influenza subtypes [27] .",
            "cite_spans": [
                {
                    "start": 162,
                    "end": 166,
                    "text": "[19]",
                    "ref_id": "BIBREF18"
                },
                {
                    "start": 167,
                    "end": 171,
                    "text": "[20]",
                    "ref_id": "BIBREF19"
                },
                {
                    "start": 172,
                    "end": 176,
                    "text": "[21]",
                    "ref_id": "BIBREF20"
                },
                {
                    "start": 177,
                    "end": 181,
                    "text": "[22]",
                    "ref_id": "BIBREF21"
                },
                {
                    "start": 182,
                    "end": 186,
                    "text": "[23]",
                    "ref_id": "BIBREF22"
                },
                {
                    "start": 187,
                    "end": 191,
                    "text": "[24]",
                    "ref_id": "BIBREF23"
                },
                {
                    "start": 192,
                    "end": 196,
                    "text": "[25]",
                    "ref_id": "BIBREF24"
                },
                {
                    "start": 320,
                    "end": 324,
                    "text": "[24]",
                    "ref_id": "BIBREF23"
                },
                {
                    "start": 381,
                    "end": 400,
                    "text": "[19, 21-23, 25, 26]",
                    "ref_id": null
                },
                {
                    "start": 458,
                    "end": 462,
                    "text": "[27]",
                    "ref_id": "BIBREF26"
                }
            ],
            "ref_spans": [],
            "section": ""
        },
        {
            "text": "Rigorous vaccination programs and improved pharmacotherapy have decreased the impact of influenza on the general population; however, influenza still remains a serious threat to severely immunocompromised individuals. The 2009 pandemic was a reminder that it is still unclear how well current vaccination strategies and current pharmacotherapy can perform in preventing and mitigating illness in immunocompromised individuals.",
            "cite_spans": [],
            "ref_spans": [],
            "section": ""
        },
        {
            "text": "The primary goal of this study was to compare the natural history of influenza infection in those who were severely immunocompromised to individuals who were not immunocompromised. Careful examination of symptoms and signs of infection, virological measurements, immunological studies, and clinical parameters were performed to investigate the natural pathogenesis of influenza in this group of severely immunocompromised hosts.",
            "cite_spans": [],
            "ref_spans": [],
            "section": ""
        },
        {
            "text": "Subjects were recruited at the National Institutes of Health (NIH) Clinical Center in Bethesda, MD, and Washington Hospital Center in Washington, DC, under an IRB approved protocol \"Influenza in Nonimmunocompromised and Immunocompromised Hosts\" (Clinicaltrials.gov identifier NCT00533182). All participants or legal guardian signed informed consent. Medically attended patients with a diagnosis of influenza were recruited. History and physical was performed, initial diagnostic specimen collected, and further nasal washes and blood samples collected every 2 days during the first 7 days postdiagnosis. Nasal washes were performed using the method described by Neclerio [28] . Follow-up examinations and sample collection at both 2 weeks and 4 weeks were performed. Subjects who shed virus for an extended period of time were followed throughout the course of their infection, and sampling was performed until the infection resolved. Clinical data were compiled and statistical analyses performed using GraphPad Prism software.",
            "cite_spans": [
                {
                    "start": 671,
                    "end": 675,
                    "text": "[28]",
                    "ref_id": "BIBREF27"
                }
            ],
            "ref_spans": [],
            "section": "Clinical Protocol"
        },
        {
            "text": "Initial diagnosis was made by the clinical laboratories at the facility where samples were collected. Further samples were tested using a matrix one-step Taqman real-time reverse transcription polymerase chain reaction (RT-PCR) assay as described elsewhere [29] and/or the Luminex Multiplex Respiratory Viral Panel kit (Luminex Corp. Austin, TX). Viral isolation used standard MDCK culture methods. Type and subtype were determined by RT-PCR and sequencing of the hemagglutinin (HA) and neuraminidase (NA) genes and comparison to known influenza sequences in Genbank.",
            "cite_spans": [
                {
                    "start": 257,
                    "end": 261,
                    "text": "[29]",
                    "ref_id": "BIBREF28"
                }
            ],
            "ref_spans": [],
            "section": "Viral Isolation and Identification"
        },
        {
            "text": "Total nucleic acid was extracted from samples using the bio-M\u00e9rieux NucliSENS easyMAG system. Viral complementary DNA (cDNA) was reverse transcribed using the influenza specific uni-12 primer, and PCR was performed using custom primers to amplify the viral gene segments (Table 1) . Sanger sequencing was performed on all PCR products.",
            "cite_spans": [],
            "ref_spans": [
                {
                    "start": 271,
                    "end": 280,
                    "text": "(Table 1)",
                    "ref_id": "TABREF0"
                }
            ],
            "section": "Sequencing and Genotype Identification"
        },
        {
            "text": "Serum and nasal wash cytokines were measured using the Bio-Plex Pro Human Cytokine 17-plex assay on a Bio-Rad Bio-Plex 200 (Bio-Rad Hercules, Ca). The following cytokines were measured: interleukin 1\u03b2, interleukin 2, interleukin 4, interleukin 5, interleukin 6 (IL-6), interleukin 7, interleukin 8 (IL-8), interleukin 10, interleukin 12, interleukin 13, interleukin 15, interleukin 17, granulocyte colony-stimulating factor (G-CSF), granulocyte macrophage colony-stimulating factor (GM-CSF), interferon \u03b3, monocyte chemoattractant protein 1 (MCP-1), macrophage inflammatory protein 1\u03b2 (MIP-1\u03b2), and tumor necrosis factor \u03b1 (TNF-\u03b1). Controls used were collected from healthy volunteers. Results were compiled and statistical analysis performed using GraphPad Prism software.",
            "cite_spans": [],
            "ref_spans": [],
            "section": "Immunologic Assays"
        },
        {
            "text": "Eighty-six influenza patients were enrolled over a 3-year period between 2008 and 2011. Of these, 32 (37.2%) were classified as severely immunocompromised, primarily due to a malignancy or condition being treated with either a recent HSCT or immunosuppressive therapy. The remaining 54 patients (62.8%) were classified as nonimmunocompromised and included individuals both with and without underlying comorbidities. The demographics of these individuals are summarized in Table 2 .",
            "cite_spans": [],
            "ref_spans": [
                {
                    "start": 472,
                    "end": 479,
                    "text": "Table 2",
                    "ref_id": "TABREF1"
                }
            ],
            "section": "RESULTS"
        },
        {
            "text": "Of note, 46.5% of the individuals in the study had been vaccinated within 1 year of becoming infected with influenza. A majority of the nonimmunocompromised individuals were overweight or obese (81.4%). Although most patients in the study were nonsmokers, 22.2% of nonimmunocompromised participants were current smokers, whereas there were no current smokers in the immunocompromised group.",
            "cite_spans": [],
            "ref_spans": [],
            "section": "RESULTS"
        },
        {
            "text": "Hematologic conditions were the most common underlying diagnosis (78.1%) and 59.4% of patients had undergone HSCT within 1 year of influenza infection in the immunocompromised ",
            "cite_spans": [],
            "ref_spans": [],
            "section": "RESULTS"
        },
        {
            "text": "group. Most had some form of graft-vs-host disease (GVHD; Table 3 ). Those who did not undergo HSCT (21.9%) were undergoing immunosuppressive therapy (Table 3 ). In the nonimmunocompromised group 17 patients (31.5%) had chronic comorbidities including hypertension, diabetes mellitus, coronary artery disease, asthma or chronic obstructive pulmonary disease, or well-controlled HIV infection. A full symptom evaluation at the time of diagnosis was performed in 80 of 86 patients ( Table 4 ). The most common symptoms noted were dry cough (90%), fever (83.8%), and headache (82.5%). Chills, coryza, productive cough, and sweats were also common. A range of other symptoms were observed including shortness of breath and chest pain. Of interest was the prevalence of multiple gastrointestinal and neurologic symptoms.",
            "cite_spans": [],
            "ref_spans": [
                {
                    "start": 58,
                    "end": 65,
                    "text": "Table 3",
                    "ref_id": "TABREF2"
                },
                {
                    "start": 150,
                    "end": 158,
                    "text": "(Table 3",
                    "ref_id": "TABREF2"
                },
                {
                    "start": 481,
                    "end": 488,
                    "text": "Table 4",
                    "ref_id": "TABREF3"
                }
            ],
            "section": "RESULTS"
        },
        {
            "text": "The majority of symptoms were more prevalent in the nonimmunocompromised group including those that were statistically higher: dry cough, chills, sweats, myalgia, shortness of breath, chemosis, and neurologic symptoms. Gastrointestinal symptoms were slightly more common in the immunocompromised group with decreased appetite observed as the only symptom statistically more prevalent (Table 4) .",
            "cite_spans": [],
            "ref_spans": [
                {
                    "start": 384,
                    "end": 393,
                    "text": "(Table 4)",
                    "ref_id": "TABREF3"
                }
            ],
            "section": "RESULTS"
        },
        {
            "text": "Fifty-seven of the patients had complete physical exams documented on diagnosis, and an overall trend of physical exam abnormalities was observed more in the nonimmunocompromised group, with pulmonary abnormalities in particular being more statistically prevalent (Table 5 ). Pulmonary abnormalities on exam were the most common finding (44% overall). Cardiac abnormalities were noted in 14% of patients, mostly consisting of tachycardia. Other abnormalities were minimal, and many individuals had no significant findings.",
            "cite_spans": [],
            "ref_spans": [
                {
                    "start": 264,
                    "end": 272,
                    "text": "(Table 5",
                    "ref_id": "TABREF4"
                }
            ],
            "section": "RESULTS"
        },
        {
            "text": "All of the immunocompromised patients required hospitalization upon diagnosis. Six patients (18%) in the immmunocompromised group required intensive care and mechanical ventilation. In contrast, only 16 patients (29.6%; P = .0001) of the nonimmunocompromised group required hospitalization, and none required intensive care treatment (P = .0019). There was 1 death observed in the immunocompromised group (3%). The immunocompromised patients also exhibited a significantly longer length of illness (P = .0466) with a mean shedding of 19.0 days, whereas nonimmunocompromised patients were observed to shed for a mean of 6.4 days (Figure 1 ). Consistent with these differences were the radiologic examinations observed. Chest computed tomography (CT) or chest radiograph (CXR) was performed at the time of diagnosis on 58 of the 86 patients recruited. A majority of immunocompromised patients (87.5%) had radiologic studies performed, whereas less (55.5%) were performed on nonimmunocompromised patients. Of these 58 radiologic examinations, 23 (39.7%) showed new abnormalities at the time of diagnosis. The immunocompromised patients were significantly more likely to have new imaging abnormalities with 16 of 28 (57.1%) compared to 7 of 30 (23.3%) in the nonimmunocompromised group (P = .015). Viral diagnoses of the 86 patients enrolled are summarized in Table 6 . Of the 80 influenza A virus strains identified, 6% were seasonal H1N1, 19.7% H3N2, and 66.3% A(H1N1)pdm09 subtypes. Of the 80 patients identified as having influenza A infection, 9 (11.3%) of these patients either were infected with a neuraminidase inhibitor resistant virus or developed resistance during the course of infection and treatment. When adamantane resistance is considered, 100% of the influenza A isolates collected in this study were resistant to at least one class of antiviral drug, and 3 patients (4%) had viral infections developing resistance to both available classes of antivirals ( Table 6 ). The A (H1N1)pdm09 virus was the most prevalent subtype of influenza A virus isolated (66.3%), and as expected, all of these viruses were resistant to the adamantanes as were the H3N2 viruses. All 6 of the seasonal H1N1 isolates identified contained the H275Y NAI resistance mutation conferring resistance to oseltamivir and possibly peramivir [22] . This mutation was noted at the time of initial identification of virus and remained stable in all consecutive isolates collected from those patients. Three immunocompromised patients were infected with influenza viruses that developed neuraminidase inhibitor resistance during treatment. One patient with an H3N2 infection developed a novel deletion mutation in the NA gene. The other 2 cases were A(H1N1)pdm09 infections that developed H275Y mutations. In all of these cases the mutations arose after treatment with oseltamivir and in one case peramivir during a prolonged clinical course [21] [22] [23] .",
            "cite_spans": [
                {
                    "start": 2325,
                    "end": 2329,
                    "text": "[22]",
                    "ref_id": "BIBREF21"
                },
                {
                    "start": 2922,
                    "end": 2926,
                    "text": "[21]",
                    "ref_id": "BIBREF20"
                },
                {
                    "start": 2927,
                    "end": 2931,
                    "text": "[22]",
                    "ref_id": "BIBREF21"
                },
                {
                    "start": 2932,
                    "end": 2936,
                    "text": "[23]",
                    "ref_id": "BIBREF22"
                }
            ],
            "ref_spans": [
                {
                    "start": 628,
                    "end": 637,
                    "text": "(Figure 1",
                    "ref_id": "FIGREF0"
                },
                {
                    "start": 1356,
                    "end": 1363,
                    "text": "Table 6",
                    "ref_id": "TABREF5"
                },
                {
                    "start": 1971,
                    "end": 1978,
                    "text": "Table 6",
                    "ref_id": "TABREF5"
                }
            ],
            "section": "RESULTS"
        },
        {
            "text": "Cytokine response during acute infection was measured both from serum and nasal washes. Of the cytokines measured IL-6, IL-8, TNF-\u03b1, G-CSF, GM-CSF, MCP-1, and MIP-1b were found to be elevated in serum and/or nasal wash compared to controls during infection (Figures 2 and 3) . Overall, no significant differences were noted in these responses between the immunocompromised and non-immunocompromised groups.",
            "cite_spans": [],
            "ref_spans": [
                {
                    "start": 257,
                    "end": 274,
                    "text": "(Figures 2 and 3)",
                    "ref_id": "FIGREF1"
                }
            ],
            "section": "RESULTS"
        },
        {
            "text": "Influenza infection has a major effect on the population in all regions of the world, differing from season to season and emerging unpredictably during a pandemic. The patient population identified in this study reflects the population of the Washington, DC, metropolitan region with the majority of subjects identifying themselves as either white or black. Given the nature of a prospective study of immunocompromised patients, it was not possible to have extremely well matched comparator groups, but they were reasonably well matched ( Table 2) . Most participants were between the ages of 18 and 65 with a mean age of 25.55. This mean age of approximately 25 is consistent with the fact that the 2009 A(H1N1)pdm09 virus was the most prevalent virus identified in this study, and that much of this study was performed during the 2009 pandemic and postpandemic period when a slightly younger population was more affected by influenza than during a typical influenza season [30] A number of significant differences were observed between the severely immunocompromised and nonimmunocompromised groups. The immunocompromised patients experienced more hospitalizations, longer lengths of influenza virus shedding, and more severe disease and complications requiring intensive care and mechanical ventilation. These differences highlight that not only are these patients an important at-risk group for enhanced morbidity and mortality but also should be considered a group that could contribute to viral spread in the general population. The immunocompromised patients in this study shed virus for a mean of approximately 19 days, likely making them contagious for a significant length of time. Many of these patients were asymptomatic for a significant portion of the time in which they were shedding. Importantly, in a number of these cases the viruses they were shedding had developed drug resistance mutations while maintaining their transmissibility [21, 23] , making it possible that these individuals could also be a source for community spread of drug resistant viral strains.",
            "cite_spans": [
                {
                    "start": 975,
                    "end": 979,
                    "text": "[30]",
                    "ref_id": "BIBREF29"
                },
                {
                    "start": 1952,
                    "end": 1956,
                    "text": "[21,",
                    "ref_id": "BIBREF20"
                },
                {
                    "start": 1957,
                    "end": 1960,
                    "text": "23]",
                    "ref_id": "BIBREF22"
                }
            ],
            "ref_spans": [
                {
                    "start": 539,
                    "end": 547,
                    "text": "Table 2)",
                    "ref_id": "TABREF1"
                }
            ],
            "section": "DISCUSSION"
        },
        {
            "text": "Although many of the immunocompromised patients were asymptomatic during some portion of the time they were infected, most exhibited some typical influenza symptoms during the first few days of infection. This was consistent with the cytokine measurements observed, as the acute innate immune response is likely principally responsible for many of the acute symptoms observed.",
            "cite_spans": [],
            "ref_spans": [],
            "section": "DISCUSSION"
        },
        {
            "text": "Cytokine measurements in nasal wash specimens demonstrated similar cytokine responses in both the immunocompromised and nonimmunocompromised groups. These cytokine elevations were consistent with what has been reported previously during influenza infection [31] . In serum, similar elevations were noted in both groups as well, although to a somewhat lesser degree when compared to noninfected controls.",
            "cite_spans": [
                {
                    "start": 257,
                    "end": 261,
                    "text": "[31]",
                    "ref_id": "BIBREF30"
                }
            ],
            "ref_spans": [],
            "section": "DISCUSSION"
        },
        {
            "text": "Despite the similarity in acute innate response between the 2 groups, important differences were noted in overall symptoms between the immunocompromised and nonimmunocompromised groups. Fewer overall symptoms were noted in the immunocompromised group, and all influenza symptoms were found more commonly in the nonimmunocompromised group except for gastrointestinal symptoms, that were likely related to underlying illnesses or therapeutics as many of these immunocompromised individuals suffered from GVHD of the gut or were receiving a toxic chemotherapeutic agent. The overall trend of the more inflammatory and systemic symptoms occurred more often in the nonimmunocompromised group suggesting that although the innate immune response is similar, the clinical manifestations may not be, and the possibility of a blunted illness should be taken into account when evaluating immunocompromised patients with an influenza-like illness.",
            "cite_spans": [],
            "ref_spans": [],
            "section": "DISCUSSION"
        },
        {
            "text": "A significantly higher number of radiographic abnormalities were noted in the immunocompromised group, pointing to their increased risk of pulmonary involvement and complications. These radiologic changes were often in the absence of pulmonary abnormalities on physical exam, which were more prevalent in the nonimmunocompromised group. This is important to consider clinically as the presence or absence of symptoms and signs may not be adequate indicators of disease, especially in immunocompromised individuals who are likely at higher risk of pneumonia, secondary bacterial infections, and other pulmonary complications.",
            "cite_spans": [],
            "ref_spans": [],
            "section": "DISCUSSION"
        },
        {
            "text": "Vaccination remains the cornerstone of prevention for influenza infection and its complications. In this study, approximately 47% of all individuals recruited had been vaccinated within the last year prior to infection yet still became ill with influenza. A larger number of the nonimmunocompromised (59%) were vaccinated compared to only 25% of the immunocompromised. This fact makes this observation even more concerning as a significant number of immunocompetent individuals became infected despite a vaccine that closely matched the infecting virus.",
            "cite_spans": [],
            "ref_spans": [],
            "section": "DISCUSSION"
        },
        {
            "text": "The observations of vaccination made in this study are somewhat consistent with recent observations by the CDC that during recent years the effectiveness of the influenza vaccine, especially in certain groups of individuals has been moderate to poor [32] . Clearly influenza vaccines have variable efficacy that is hard to predict, especially when factoring in emerging viruses and special populations. This highlights that further work needs to be undertaken to find novel vaccine/prevention strategies to reduce the disease burden in the general healthy population and especially in special populations such as the severely immunocompromised, where vaccination is even further hampered by the inability of the host to respond. This may require reconsidering prevention of disease as our goal and shifting our focus to reducing severe disease and complications such as the prolonged shedding and severe illness observed in the immunocompromised patients in this study.",
            "cite_spans": [
                {
                    "start": 250,
                    "end": 254,
                    "text": "[32]",
                    "ref_id": "BIBREF31"
                }
            ],
            "ref_spans": [],
            "section": "DISCUSSION"
        },
        {
            "text": "When vaccines do not prevent infection or are not given, the last step in preventing morbidity and mortality in influenza is therapeutic treatment, of which antivirals are the current gold standard. The prevalence of antiviral drug resistance found in this and other studies is a warning that should not be ignored. Consistent with recent observations, all influenza viruses identified in this study were resistant to at least one class of antiviral. In this group of patients, 4% of viruses were resistant to both major classes of antivirals including some isolates of H3N2 and A(H1N1)pdm09. The majority of these viruses were identified in immunocompromised patients after they had received prolonged courses (beyond 5 days) of antiviral therapy. These data in conjunction with observations that these viruses are transmissible and not attenuated in animal models [21, 23] suggest that the development of multi-drug resistance is a significant concern and that immunocompromised patients may be at risk of acting as hosts for the development and community spread of resistance. Further research, the development of novel therapies, and reevaluation of how immunocompromised individuals are treated for influenza should be undertaken.",
            "cite_spans": [
                {
                    "start": 866,
                    "end": 870,
                    "text": "[21,",
                    "ref_id": "BIBREF20"
                },
                {
                    "start": 871,
                    "end": 874,
                    "text": "23]",
                    "ref_id": "BIBREF22"
                }
            ],
            "ref_spans": [],
            "section": "DISCUSSION"
        },
        {
            "text": "Study of the natural history of influenza is extremely difficult because in almost all cases it is impossible to identify exactly when a patient was infected. Although a relatively small cohort was observed in this study, it is one of the largest cohorts of severely immunocompromised individuals with influenza infection studied prospectively to date. The comparison of these individuals with nonimmunocompromised individuals during influenza infection demonstrated that the immunocompromised patients are at risk of more severe or complicated disease, which may be difficult to prevent with current vaccines and treat with current antivirals. Specific issues to consider when managing severely immunocompromised hosts include the development of asymptomatic shedding that could increase the risk of transmission, the development of multi-drug resistance during prolonged antiviral therapy, and the potential high risk of pulmonary involvement of their disease leading to secondary infections or complications.",
            "cite_spans": [],
            "ref_spans": [],
            "section": "CONCLUSION"
        },
        {
            "text": "A better understanding of the basic human pathogenesis of influenza will be necessary if we are to address how to prevent and treat influenza in a more individualized way, especially for those who are immunocompromised. It is clear that current antivirals are not adequate in all circumstances, current vaccine strategies must be improved, and careful evaluation of each individual case may be necessary to tailor treatment and prevention for not only severely immunocompromised individuals but likely those in other important at-risk populations.",
            "cite_spans": [],
            "ref_spans": [],
            "section": "CONCLUSION"
        }
    ],
    "bib_entries": {
        "BIBREF0": {
            "ref_id": "b0",
            "title": "Global HIV/AIDS Response: Epidemic update and health sector progress towards Universal Access",
            "authors": [
                {
                    "first": "",
                    "middle": [],
                    "last": "Who/Unaids/Unicef",
                    "suffix": ""
                }
            ],
            "year": 2011,
            "venue": "",
            "volume": "",
            "issn": "",
            "pages": "",
            "other_ids": {}
        },
        "BIBREF1": {
            "ref_id": "b1",
            "title": "Incidence and temporal trends of primary immunodeficiency: a population-based cohort study",
            "authors": [
                {
                    "first": "A",
                    "middle": [
                        "Y"
                    ],
                    "last": "Joshi",
                    "suffix": ""
                },
                {
                    "first": "V",
                    "middle": [
                        "N"
                    ],
                    "last": "Iyer",
                    "suffix": ""
                },
                {
                    "first": "J",
                    "middle": [
                        "B"
                    ],
                    "last": "Hagan",
                    "suffix": ""
                },
                {
                    "first": "St",
                    "middle": [],
                    "last": "Sauver",
                    "suffix": ""
                },
                {
                    "first": "J",
                    "middle": [
                        "L"
                    ],
                    "last": "Boyce",
                    "suffix": ""
                },
                {
                    "first": "T",
                    "middle": [
                        "G"
                    ],
                    "last": "",
                    "suffix": ""
                }
            ],
            "year": 2009,
            "venue": "Mayo Clin Proc",
            "volume": "84",
            "issn": "",
            "pages": "16--22",
            "other_ids": {}
        },
        "BIBREF2": {
            "ref_id": "b2",
            "title": "Transplantation immunology: solid organ and bone marrow",
            "authors": [
                {
                    "first": "J",
                    "middle": [],
                    "last": "Chinen",
                    "suffix": ""
                },
                {
                    "first": "R",
                    "middle": [
                        "H"
                    ],
                    "last": "Buckley",
                    "suffix": ""
                }
            ],
            "year": 2010,
            "venue": "J Allergy Clin Immunol",
            "volume": "125",
            "issn": "",
            "pages": "324--359",
            "other_ids": {}
        },
        "BIBREF3": {
            "ref_id": "b3",
            "title": "Hematopoietic stem cell transplantation: a global perspective",
            "authors": [
                {
                    "first": "A",
                    "middle": [],
                    "last": "Gratwohl",
                    "suffix": ""
                },
                {
                    "first": "H",
                    "middle": [],
                    "last": "Baldomero",
                    "suffix": ""
                },
                {
                    "first": "M",
                    "middle": [],
                    "last": "Aljurf",
                    "suffix": ""
                }
            ],
            "year": 2010,
            "venue": "JAMA",
            "volume": "303",
            "issn": "",
            "pages": "1617--1641",
            "other_ids": {}
        },
        "BIBREF4": {
            "ref_id": "b4",
            "title": "Excess mortality due to pneumonia or influenza during influenza seasons among persons with acquired immunodeficiency syndrome",
            "authors": [
                {
                    "first": "J",
                    "middle": [
                        "C"
                    ],
                    "last": "Lin",
                    "suffix": ""
                },
                {
                    "first": "K",
                    "middle": [
                        "L"
                    ],
                    "last": "Nichol",
                    "suffix": ""
                }
            ],
            "year": 2001,
            "venue": "Arch Intern Med",
            "volume": "161",
            "issn": "",
            "pages": "441--447",
            "other_ids": {}
        },
        "BIBREF5": {
            "ref_id": "b5",
            "title": "Influenza in human immunodeficiency virus-infected patients during the 1997-1998 influenza season",
            "authors": [
                {
                    "first": "H",
                    "middle": [
                        "M"
                    ],
                    "last": "Radwan",
                    "suffix": ""
                },
                {
                    "first": "S",
                    "middle": [
                        "H"
                    ],
                    "last": "Cheeseman",
                    "suffix": ""
                },
                {
                    "first": "K",
                    "middle": [
                        "K"
                    ],
                    "last": "Lai",
                    "suffix": ""
                },
                {
                    "first": "I",
                    "middle": [
                        "R"
                    ],
                    "last": "Ellison",
                    "suffix": ""
                }
            ],
            "year": 2000,
            "venue": "Clin Infect Dis",
            "volume": "31",
            "issn": "",
            "pages": "604--610",
            "other_ids": {}
        },
        "BIBREF6": {
            "ref_id": "b6",
            "title": "Influenza in patients with human immunodeficiency virus infection",
            "authors": [
                {
                    "first": "S",
                    "middle": [],
                    "last": "Safrin",
                    "suffix": ""
                },
                {
                    "first": "J",
                    "middle": [
                        "D"
                    ],
                    "last": "Rush",
                    "suffix": ""
                },
                {
                    "first": "J",
                    "middle": [],
                    "last": "Mills",
                    "suffix": ""
                }
            ],
            "year": 1990,
            "venue": "Chest",
            "volume": "98",
            "issn": "",
            "pages": "33--40",
            "other_ids": {}
        },
        "BIBREF7": {
            "ref_id": "b7",
            "title": "Influenza among hospitalized adults with leukemia",
            "authors": [
                {
                    "first": "H",
                    "middle": [
                        "M"
                    ],
                    "last": "Yousuf",
                    "suffix": ""
                },
                {
                    "first": "J",
                    "middle": [],
                    "last": "Englund",
                    "suffix": ""
                },
                {
                    "first": "R",
                    "middle": [],
                    "last": "Couch",
                    "suffix": ""
                }
            ],
            "year": 1997,
            "venue": "Clin Infect Dis",
            "volume": "24",
            "issn": "",
            "pages": "1095--1104",
            "other_ids": {}
        },
        "BIBREF8": {
            "ref_id": "b8",
            "title": "How I treat influenza in patients with hematologic malignancies",
            "authors": [
                {
                    "first": "C",
                    "middle": [],
                    "last": "Casper",
                    "suffix": ""
                },
                {
                    "first": "J",
                    "middle": [],
                    "last": "Englund",
                    "suffix": ""
                },
                {
                    "first": "M",
                    "middle": [],
                    "last": "Boeckh",
                    "suffix": ""
                }
            ],
            "year": 2010,
            "venue": "Blood",
            "volume": "115",
            "issn": "",
            "pages": "1331--1373",
            "other_ids": {}
        },
        "BIBREF9": {
            "ref_id": "b9",
            "title": "Influenza infections after hematopoietic stem cell transplantation: risk factors, mortality, and the effect of antiviral therapy",
            "authors": [
                {
                    "first": "W",
                    "middle": [
                        "G"
                    ],
                    "last": "Nichols",
                    "suffix": ""
                },
                {
                    "first": "K",
                    "middle": [
                        "A"
                    ],
                    "last": "Guthrie",
                    "suffix": ""
                },
                {
                    "first": "L",
                    "middle": [],
                    "last": "Corey",
                    "suffix": ""
                },
                {
                    "first": "M",
                    "middle": [],
                    "last": "Boeckh",
                    "suffix": ""
                }
            ],
            "year": 2004,
            "venue": "Clin Infect Dis",
            "volume": "39",
            "issn": "",
            "pages": "1300--1306",
            "other_ids": {}
        },
        "BIBREF10": {
            "ref_id": "b10",
            "title": "Respiratory viral infections in hematopoietic stem cell and solid organ transplant recipients",
            "authors": [
                {
                    "first": "S",
                    "middle": [
                        "S"
                    ],
                    "last": "Weigt",
                    "suffix": ""
                },
                {
                    "first": "A",
                    "middle": [
                        "L"
                    ],
                    "last": "Gregson",
                    "suffix": ""
                },
                {
                    "first": "J",
                    "middle": [
                        "C"
                    ],
                    "last": "Deng",
                    "suffix": ""
                },
                {
                    "first": "J",
                    "middle": [
                        "P"
                    ],
                    "last": "Lynch",
                    "suffix": ""
                },
                {
                    "first": "J",
                    "middle": [
                        "A"
                    ],
                    "last": "Belperio",
                    "suffix": ""
                }
            ],
            "year": 2011,
            "venue": "Semin Respir Crit Care Med",
            "volume": "32",
            "issn": "",
            "pages": "471--93",
            "other_ids": {}
        },
        "BIBREF11": {
            "ref_id": "b11",
            "title": "Nosocomial outbreak of influenza virus A (H3N2) infection in a solid organ transplant department",
            "authors": [
                {
                    "first": "S",
                    "middle": [],
                    "last": "Malavaud",
                    "suffix": ""
                },
                {
                    "first": "B",
                    "middle": [],
                    "last": "Malavaud",
                    "suffix": ""
                },
                {
                    "first": "K",
                    "middle": [],
                    "last": "Sandres",
                    "suffix": ""
                }
            ],
            "year": 2001,
            "venue": "Transplantation",
            "volume": "72",
            "issn": "",
            "pages": "535--542",
            "other_ids": {}
        },
        "BIBREF12": {
            "ref_id": "b12",
            "title": "Influenza A myocarditis developing in an adult liver transplant recipient despite vaccination: a case report and review of the literature",
            "authors": [
                {
                    "first": "R",
                    "middle": [
                        "A"
                    ],
                    "last": "Vilchez",
                    "suffix": ""
                },
                {
                    "first": "J",
                    "middle": [
                        "J"
                    ],
                    "last": "Fung",
                    "suffix": ""
                },
                {
                    "first": "S",
                    "middle": [],
                    "last": "Kusne",
                    "suffix": ""
                }
            ],
            "year": 2000,
            "venue": "Transplantation",
            "volume": "70",
            "issn": "",
            "pages": "543--548",
            "other_ids": {}
        },
        "BIBREF13": {
            "ref_id": "b13",
            "title": "Influenza A pneumonitis following treatment of acute cardiac allograft rejection with murine monoclonal anti-CD3 antibody (OKT3)",
            "authors": [
                {
                    "first": "R",
                    "middle": [
                        "P"
                    ],
                    "last": "Embrey",
                    "suffix": ""
                },
                {
                    "first": "L",
                    "middle": [
                        "J"
                    ],
                    "last": "Geist",
                    "suffix": ""
                }
            ],
            "year": 1995,
            "venue": "Chest",
            "volume": "108",
            "issn": "",
            "pages": "1456--1465",
            "other_ids": {}
        },
        "BIBREF14": {
            "ref_id": "b14",
            "title": "Outcomes from pandemic influenza A H1N1 infection in recipients of solid-organ transplants: a multicentre cohort study",
            "authors": [
                {
                    "first": "D",
                    "middle": [],
                    "last": "Kumar",
                    "suffix": ""
                },
                {
                    "first": "M",
                    "middle": [
                        "G"
                    ],
                    "last": "Michaels",
                    "suffix": ""
                },
                {
                    "first": "M",
                    "middle": [
                        "I"
                    ],
                    "last": "Morris",
                    "suffix": ""
                }
            ],
            "year": 2010,
            "venue": "Lancet Infect Dis",
            "volume": "10",
            "issn": "",
            "pages": "521--527",
            "other_ids": {}
        },
        "BIBREF15": {
            "ref_id": "b15",
            "title": "Community respiratory virus infections in immunocompromised patients: hematopoietic stem cell and solid organ transplant recipients, and individuals with human immunodeficiency virus infection",
            "authors": [
                {
                    "first": "Y",
                    "middle": [
                        "J"
                    ],
                    "last": "Kim",
                    "suffix": ""
                },
                {
                    "first": "M",
                    "middle": [],
                    "last": "Boeckh",
                    "suffix": ""
                },
                {
                    "first": "J",
                    "middle": [
                        "A"
                    ],
                    "last": "Englund",
                    "suffix": ""
                }
            ],
            "year": 2007,
            "venue": "Semin Respir Crit Care Med",
            "volume": "28",
            "issn": "",
            "pages": "222--264",
            "other_ids": {}
        },
        "BIBREF16": {
            "ref_id": "b16",
            "title": "Influenza pneumonia in lung transplant recipients: clinical features and association with bronchiolitis obliterans syndrome",
            "authors": [
                {
                    "first": "S",
                    "middle": [],
                    "last": "Garantziotis",
                    "suffix": ""
                },
                {
                    "first": "D",
                    "middle": [
                        "N"
                    ],
                    "last": "Howell",
                    "suffix": ""
                },
                {
                    "first": "H",
                    "middle": [
                        "P"
                    ],
                    "last": "Mcadams",
                    "suffix": ""
                },
                {
                    "first": "R",
                    "middle": [
                        "D"
                    ],
                    "last": "Davis",
                    "suffix": ""
                },
                {
                    "first": "N",
                    "middle": [
                        "G"
                    ],
                    "last": "Henshaw",
                    "suffix": ""
                },
                {
                    "first": "S",
                    "middle": [
                        "M"
                    ],
                    "last": "Palmer",
                    "suffix": ""
                }
            ],
            "year": 2001,
            "venue": "Chest",
            "volume": "119",
            "issn": "",
            "pages": "1277--80",
            "other_ids": {}
        },
        "BIBREF17": {
            "ref_id": "b17",
            "title": "Influenza pneumonia in a paediatric lung transplant recipient",
            "authors": [
                {
                    "first": "J",
                    "middle": [
                        "L"
                    ],
                    "last": "Faul",
                    "suffix": ""
                },
                {
                    "first": "O",
                    "middle": [
                        "A"
                    ],
                    "last": "Akindipe",
                    "suffix": ""
                },
                {
                    "first": "G",
                    "middle": [
                        "J"
                    ],
                    "last": "Berry",
                    "suffix": ""
                },
                {
                    "first": "J",
                    "middle": [],
                    "last": "Theodore",
                    "suffix": ""
                }
            ],
            "year": 2000,
            "venue": "Transpl Int",
            "volume": "13",
            "issn": "",
            "pages": "79--81",
            "other_ids": {}
        },
        "BIBREF18": {
            "ref_id": "b18",
            "title": "Oseltamivir-resistant 2009 H1N1 influenza pneumonia during therapy in a renal transplant recipient",
            "authors": [
                {
                    "first": "A",
                    "middle": [
                        "K"
                    ],
                    "last": "Shetty",
                    "suffix": ""
                },
                {
                    "first": "G",
                    "middle": [
                        "A"
                    ],
                    "last": "Ross",
                    "suffix": ""
                },
                {
                    "first": "T",
                    "middle": [],
                    "last": "Pranikoff",
                    "suffix": ""
                }
            ],
            "year": 2012,
            "venue": "Pediatr Transplant",
            "volume": "16",
            "issn": "",
            "pages": "153--160",
            "other_ids": {}
        },
        "BIBREF19": {
            "ref_id": "b19",
            "title": "Antigenic and genetic variation in influenza A (H1N1) virus isolates Flu in Immuno-and Nonimmunocompromised Hosts \u2022 CID 2014:58 (15 January) \u2022 223 recovered from a persistently infected immunodeficient child",
            "authors": [
                {
                    "first": "E",
                    "middle": [],
                    "last": "Rocha",
                    "suffix": ""
                },
                {
                    "first": "N",
                    "middle": [
                        "J"
                    ],
                    "last": "Cox",
                    "suffix": ""
                },
                {
                    "first": "R",
                    "middle": [
                        "A"
                    ],
                    "last": "Black",
                    "suffix": ""
                },
                {
                    "first": "M",
                    "middle": [
                        "W"
                    ],
                    "last": "Harmon",
                    "suffix": ""
                },
                {
                    "first": "C",
                    "middle": [
                        "J"
                    ],
                    "last": "Harrison",
                    "suffix": ""
                },
                {
                    "first": "A",
                    "middle": [
                        "P"
                    ],
                    "last": "Kendal",
                    "suffix": ""
                }
            ],
            "year": 1991,
            "venue": "J Virol",
            "volume": "65",
            "issn": "",
            "pages": "2340--50",
            "other_ids": {}
        },
        "BIBREF20": {
            "ref_id": "b20",
            "title": "Rapid selection of a transmissible multidrug-resistant influenza A/H3N2 virus in an immunocompromised host",
            "authors": [
                {
                    "first": "M",
                    "middle": [
                        "J"
                    ],
                    "last": "Memoli",
                    "suffix": ""
                },
                {
                    "first": "R",
                    "middle": [
                        "J"
                    ],
                    "last": "Hrabal",
                    "suffix": ""
                },
                {
                    "first": "A",
                    "middle": [],
                    "last": "Hassantoufighi",
                    "suffix": ""
                }
            ],
            "year": 2010,
            "venue": "J Infect Dis",
            "volume": "201",
            "issn": "",
            "pages": "1397--403",
            "other_ids": {}
        },
        "BIBREF21": {
            "ref_id": "b21",
            "title": "Rapid selection of oseltamivir-and peramivir-resistant pandemic H1N1 virus during therapy in 2 immunocompromised hosts",
            "authors": [
                {
                    "first": "M",
                    "middle": [
                        "J"
                    ],
                    "last": "Memoli",
                    "suffix": ""
                },
                {
                    "first": "R",
                    "middle": [
                        "J"
                    ],
                    "last": "Hrabal",
                    "suffix": ""
                },
                {
                    "first": "A",
                    "middle": [],
                    "last": "Hassantoufighi",
                    "suffix": ""
                },
                {
                    "first": "M",
                    "middle": [
                        "C"
                    ],
                    "last": "Eichelberger",
                    "suffix": ""
                },
                {
                    "first": "J",
                    "middle": [
                        "K"
                    ],
                    "last": "Taubenberger",
                    "suffix": ""
                }
            ],
            "year": 2010,
            "venue": "Clin Infect Dis",
            "volume": "50",
            "issn": "",
            "pages": "1252--1257",
            "other_ids": {}
        },
        "BIBREF22": {
            "ref_id": "b22",
            "title": "In vivo evaluation of pathogenicity and transmissibility of influenza A(H1N1)pdm09 hemagglutinin receptor binding domain 222 intrahost variants isolated from a single immunocompromised patient",
            "authors": [
                {
                    "first": "M",
                    "middle": [
                        "J"
                    ],
                    "last": "Memoli",
                    "suffix": ""
                },
                {
                    "first": "T",
                    "middle": [],
                    "last": "Bristol",
                    "suffix": ""
                },
                {
                    "first": "K",
                    "middle": [
                        "E"
                    ],
                    "last": "Proudfoot",
                    "suffix": ""
                },
                {
                    "first": "A",
                    "middle": [
                        "S"
                    ],
                    "last": "Davis",
                    "suffix": ""
                },
                {
                    "first": "E",
                    "middle": [
                        "J"
                    ],
                    "last": "Dunham",
                    "suffix": ""
                },
                {
                    "first": "J",
                    "middle": [
                        "K"
                    ],
                    "last": "Taubenberger",
                    "suffix": ""
                }
            ],
            "year": 2012,
            "venue": "Virology",
            "volume": "428",
            "issn": "",
            "pages": "21--30",
            "other_ids": {}
        },
        "BIBREF23": {
            "ref_id": "b23",
            "title": "Antigenic drift of influenza A (H3N2) virus in a persistently infected immunocompromised host is similar to that occurring in the community",
            "authors": [
                {
                    "first": "P",
                    "middle": [],
                    "last": "Mcminn",
                    "suffix": ""
                },
                {
                    "first": "A",
                    "middle": [],
                    "last": "Carrello",
                    "suffix": ""
                },
                {
                    "first": "C",
                    "middle": [],
                    "last": "Cole",
                    "suffix": ""
                },
                {
                    "first": "D",
                    "middle": [],
                    "last": "Baker",
                    "suffix": ""
                },
                {
                    "first": "A",
                    "middle": [],
                    "last": "Hampson",
                    "suffix": ""
                }
            ],
            "year": 1999,
            "venue": "Clin Infect Dis",
            "volume": "29",
            "issn": "",
            "pages": "456--464",
            "other_ids": {}
        },
        "BIBREF24": {
            "ref_id": "b24",
            "title": "Recovery of drug-resistant influenza virus from immunocompromised patients: a case series",
            "authors": [
                {
                    "first": "M",
                    "middle": [
                        "G"
                    ],
                    "last": "Ison",
                    "suffix": ""
                },
                {
                    "first": "L",
                    "middle": [
                        "V"
                    ],
                    "last": "Gubareva",
                    "suffix": ""
                },
                {
                    "first": "R",
                    "middle": [
                        "L"
                    ],
                    "last": "Atmar",
                    "suffix": ""
                },
                {
                    "first": "J",
                    "middle": [],
                    "last": "Treanor",
                    "suffix": ""
                },
                {
                    "first": "F",
                    "middle": [
                        "G"
                    ],
                    "last": "Hayden",
                    "suffix": ""
                }
            ],
            "year": 2006,
            "venue": "J Infect Dis",
            "volume": "193",
            "issn": "",
            "pages": "760--764",
            "other_ids": {}
        },
        "BIBREF25": {
            "ref_id": "b25",
            "title": "Characterization of multidrugresistant influenza A/H3N2 viruses shed during 1 year by an immunocompromised child",
            "authors": [
                {
                    "first": "M",
                    "middle": [],
                    "last": "Baz",
                    "suffix": ""
                },
                {
                    "first": "Y",
                    "middle": [],
                    "last": "Abed",
                    "suffix": ""
                },
                {
                    "first": "J",
                    "middle": [],
                    "last": "Mcdonald",
                    "suffix": ""
                },
                {
                    "first": "G",
                    "middle": [],
                    "last": "Boivin",
                    "suffix": ""
                }
            ],
            "year": 2006,
            "venue": "Clin Infect Dis",
            "volume": "43",
            "issn": "",
            "pages": "1555--61",
            "other_ids": {}
        },
        "BIBREF26": {
            "ref_id": "b26",
            "title": "Direct isolation of H1N2 recombinant virus from a throat swab of a patient simultaneously infected with H1N1 and H3N2 influenza A viruses",
            "authors": [
                {
                    "first": "F",
                    "middle": [],
                    "last": "Nishikawa",
                    "suffix": ""
                },
                {
                    "first": "T",
                    "middle": [],
                    "last": "Sugiyama",
                    "suffix": ""
                }
            ],
            "year": 1983,
            "venue": "J Clin Microbiol",
            "volume": "18",
            "issn": "",
            "pages": "425--432",
            "other_ids": {}
        },
        "BIBREF27": {
            "ref_id": "b27",
            "title": "Mediator release after nasal airway challenge with allergen",
            "authors": [
                {
                    "first": "R",
                    "middle": [
                        "M"
                    ],
                    "last": "Naclerio",
                    "suffix": ""
                },
                {
                    "first": "H",
                    "middle": [
                        "L"
                    ],
                    "last": "Meier",
                    "suffix": ""
                },
                {
                    "first": "A",
                    "middle": [],
                    "last": "Kagey-Sobotka",
                    "suffix": ""
                }
            ],
            "year": 1983,
            "venue": "Am Rev Respir Dis",
            "volume": "128",
            "issn": "",
            "pages": "597--602",
            "other_ids": {}
        },
        "BIBREF28": {
            "ref_id": "b28",
            "title": "Evaluation of PCR testing of ethanol-fixed nasal swab specimens as an augmented surveillance strategy for influenza virus and adenovirus identification",
            "authors": [
                {
                    "first": "A",
                    "middle": [
                        "E"
                    ],
                    "last": "Krafft",
                    "suffix": ""
                },
                {
                    "first": "K",
                    "middle": [
                        "L"
                    ],
                    "last": "Russell",
                    "suffix": ""
                },
                {
                    "first": "A",
                    "middle": [
                        "W"
                    ],
                    "last": "Hawksworth",
                    "suffix": ""
                }
            ],
            "year": 2005,
            "venue": "J Clin Microbiol",
            "volume": "43",
            "issn": "",
            "pages": "1768--75",
            "other_ids": {}
        },
        "BIBREF29": {
            "ref_id": "b29",
            "title": "Novel H1N1 Flu: Facts and Figures",
            "authors": [],
            "year": 2009,
            "venue": "",
            "volume": "",
            "issn": "",
            "pages": "",
            "other_ids": {}
        },
        "BIBREF30": {
            "ref_id": "b30",
            "title": "Cytokine markers as predictors of type of respiratory infection in patients during the influenza season",
            "authors": [
                {
                    "first": "J",
                    "middle": [
                        "P"
                    ],
                    "last": "Haran",
                    "suffix": ""
                },
                {
                    "first": "R",
                    "middle": [],
                    "last": "Buglione-Corbett",
                    "suffix": ""
                },
                {
                    "first": "S",
                    "middle": [],
                    "last": "Lu",
                    "suffix": ""
                }
            ],
            "year": 2013,
            "venue": "Am J Emerg Med",
            "volume": "31",
            "issn": "",
            "pages": "816--837",
            "other_ids": {}
        },
        "BIBREF31": {
            "ref_id": "b31",
            "title": "Early estimates of seasonal influenza vaccine effectiveness-United States",
            "authors": [],
            "year": 2013,
            "venue": "MMWR Morb Mortal Wkly Rep",
            "volume": "62",
            "issn": "",
            "pages": "32--37",
            "other_ids": {}
        }
    },
    "ref_entries": {
        "FIGREF0": {
            "text": "Length of viral shedding. Patients were sampled daily until they had a negative clinical diagnostic test. Significantly longer shedding was detected in the immunocompromised group. Each dot represents an individual patient's length of shedding. Solid lines represent the mean (immunocompromised 19.04 days vs nonimmunocompromised 6.38 days; P value .0466). Dotted lines represent the median (immunocompromised 8.0 days vs nonimmuncompromised 5.0 days; P value .0130).",
            "latex": null,
            "type": "figure"
        },
        "FIGREF1": {
            "text": "Cytokines levels detected in nasal wash. Seventeen cytokines were measured in nasal washes, and the 7 represented here were elevated when compared to a mean of 3 healthy controls. Error bars represent the standard error of the mean.",
            "latex": null,
            "type": "figure"
        },
        "FIGREF2": {
            "text": "Cytokines detected in serum. Seventeen cytokines were measured in serum, and the 7 represented here were elevated when compared to a mean of 3 healthy controls. Error bars represent the standard error of the mean.",
            "latex": null,
            "type": "figure"
        },
        "TABREF0": {
            "text": "Primers Used to Sequence Viral Isolates",
            "latex": null,
            "type": "table"
        },
        "TABREF1": {
            "text": "Patient Demographics",
            "latex": null,
            "type": "table"
        },
        "TABREF2": {
            "text": "Underlying Conditions in the Immunocompromised Group",
            "latex": null,
            "type": "table"
        },
        "TABREF3": {
            "text": "Clinical Symptoms",
            "latex": null,
            "type": "table"
        },
        "TABREF4": {
            "text": "Physical Exam Findings",
            "latex": null,
            "type": "table"
        },
        "TABREF5": {
            "text": "Characteristics of Viruses Identified",
            "latex": null,
            "type": "table"
        }
    },
    "back_matter": [
        {
            "text": "Acknowledgments. The authors would like to acknowledge Maryna Eichelberger, Division of Viral Products, Center for Biologics Evaluation and Research, Food and Drug Administration for her contribution to the preparation of this article.Financial support. This work was supported by the intramural research program of National Institute of Allergy and Infectious Diseases. Dr Memoli was the lead scientist for this work leading all aspects including the design, clinical protocol implementation, laboratory studies, and data analysis/manuscript preparation.Potential conflicts of interest. ",
            "cite_spans": [],
            "ref_spans": [],
            "section": "acknowledgement"
        }
    ]
}