{
    "paper_id": "PMC7091083",
    "metadata": {
        "title": "Infection control and anesthesia: Lessons learned from the Toronto SARS outbreak",
        "authors": [
            {
                "first": "Philip",
                "middle": [
                    "W.",
                    "H."
                ],
                "last": "Peng",
                "suffix": "",
                "email": "philip.peng@uhn.on.ca",
                "affiliation": {}
            },
            {
                "first": "David",
                "middle": [
                    "T."
                ],
                "last": "Wong",
                "suffix": "",
                "email": null,
                "affiliation": {}
            },
            {
                "first": "David",
                "middle": [],
                "last": "Bevan",
                "suffix": "",
                "email": null,
                "affiliation": {}
            },
            {
                "first": "Michael",
                "middle": [],
                "last": "Gardam",
                "suffix": "",
                "email": null,
                "affiliation": {}
            }
        ]
    },
    "body_text": [],
    "ref_entries": {},
    "back_matter": [],
    "bib_entries": {
        "BIBREF0": {
            "title": "Investigation of a nosocomial outbreak of severe acute respiratory syndrome (SARS) in Toronto, Canada",
            "authors": [
                {
                    "first": "M",
                    "middle": [],
                    "last": "Varia",
                    "suffix": ""
                },
                {
                    "first": "S",
                    "middle": [],
                    "last": "Wilson",
                    "suffix": ""
                },
                {
                    "first": "S",
                    "middle": [],
                    "last": "Sarwal",
                    "suffix": ""
                }
            ],
            "year": 2003,
            "venue": "CMAJ",
            "volume": "169",
            "issn": "",
            "pages": "285-92",
            "other_ids": {
                "DOI": []
            }
        },
        "BIBREF1": {
            "title": "A novel coronavirus associated with severe acute respiratory syndrome",
            "authors": [
                {
                    "first": "TG",
                    "middle": [],
                    "last": "Ksiazek",
                    "suffix": ""
                },
                {
                    "first": "D",
                    "middle": [],
                    "last": "Erdman",
                    "suffix": ""
                },
                {
                    "first": "CS",
                    "middle": [],
                    "last": "Goldsmith",
                    "suffix": ""
                }
            ],
            "year": 2003,
            "venue": "N Engl J Med",
            "volume": "348",
            "issn": "",
            "pages": "1953-66",
            "other_ids": {
                "DOI": [
                    "10.1056/NEJMoa030781"
                ]
            }
        },
        "BIBREF2": {
            "title": "Characterization of a novel coronovirus associated with severe acute respiratory syndrome",
            "authors": [
                {
                    "first": "PA",
                    "middle": [],
                    "last": "Rota",
                    "suffix": ""
                },
                {
                    "first": "MS",
                    "middle": [],
                    "last": "Oberste",
                    "suffix": ""
                },
                {
                    "first": "SS",
                    "middle": [],
                    "last": "Monroe",
                    "suffix": ""
                }
            ],
            "year": 2003,
            "venue": "Science",
            "volume": "300",
            "issn": "",
            "pages": "1394-9",
            "other_ids": {
                "DOI": [
                    "10.1126/science.1085952"
                ]
            }
        },
        "BIBREF3": {
            "title": "",
            "authors": [],
            "year": null,
            "venue": "",
            "volume": "",
            "issn": "",
            "pages": null,
            "other_ids": {
                "DOI": []
            }
        },
        "BIBREF4": {
            "title": "Faster \u2026 but fast enough? Responding to the epidemic of severe acute respiratory syndrome (Editorial)",
            "authors": [
                {
                    "first": "JL",
                    "middle": [],
                    "last": "Gerberding",
                    "suffix": ""
                }
            ],
            "year": 2003,
            "venue": "N Engl J Med",
            "volume": "348",
            "issn": "",
            "pages": "2030-1",
            "other_ids": {
                "DOI": [
                    "10.1056/NEJMe030067"
                ]
            }
        },
        "BIBREF5": {
            "title": "Severe acute respiratory syndrome \u2014 Taiwan, 2003",
            "authors": [],
            "year": 2003,
            "venue": "MMWR",
            "volume": "52",
            "issn": "",
            "pages": "461-6",
            "other_ids": {
                "DOI": []
            }
        },
        "BIBREF6": {
            "title": "Transmission dynamics of the etiological agent of SARS in Hong Kong: impact of public health intervention",
            "authors": [
                {
                    "first": "S",
                    "middle": [],
                    "last": "Riley",
                    "suffix": ""
                },
                {
                    "first": "C",
                    "middle": [],
                    "last": "Fraser",
                    "suffix": ""
                },
                {
                    "first": "CA",
                    "middle": [],
                    "last": "Donnelly",
                    "suffix": ""
                }
            ],
            "year": 2003,
            "venue": "Science",
            "volume": "300",
            "issn": "",
            "pages": "1961-6",
            "other_ids": {
                "DOI": [
                    "10.1126/science.1086478"
                ]
            }
        },
        "BIBREF7": {
            "title": "Transmission dynamics and control of severe acute respiratory syndrome",
            "authors": [
                {
                    "first": "M",
                    "middle": [],
                    "last": "Lipsitch",
                    "suffix": ""
                },
                {
                    "first": "T",
                    "middle": [],
                    "last": "Cohen",
                    "suffix": ""
                },
                {
                    "first": "B",
                    "middle": [],
                    "last": "Cooper",
                    "suffix": ""
                }
            ],
            "year": 2003,
            "venue": "Science",
            "volume": "300",
            "issn": "",
            "pages": "1966-70",
            "other_ids": {
                "DOI": [
                    "10.1126/science.1086616"
                ]
            }
        },
        "BIBREF8": {
            "title": "A population-dynamic model for evaluating the potential spread of drug-resistant influenza virus infections during community-based use of antivirals",
            "authors": [
                {
                    "first": "NM",
                    "middle": [],
                    "last": "Ferguson",
                    "suffix": ""
                },
                {
                    "first": "S",
                    "middle": [],
                    "last": "Mallett",
                    "suffix": ""
                },
                {
                    "first": "H",
                    "middle": [],
                    "last": "Jackson",
                    "suffix": ""
                },
                {
                    "first": "N",
                    "middle": [],
                    "last": "Roberts",
                    "suffix": ""
                },
                {
                    "first": "P",
                    "middle": [],
                    "last": "Ward",
                    "suffix": ""
                }
            ],
            "year": 2003,
            "venue": "J Antimicrob Chemother",
            "volume": "51",
            "issn": "",
            "pages": "977-90",
            "other_ids": {
                "DOI": [
                    "10.1093/jac/dkg136"
                ]
            }
        },
        "BIBREF9": {
            "title": "Severe acute respiratory syndrome \u2014 Singapore, 2003",
            "authors": [],
            "year": 2003,
            "venue": "MMWR",
            "volume": "52",
            "issn": "",
            "pages": "405-11",
            "other_ids": {
                "DOI": []
            }
        },
        "BIBREF10": {
            "title": "SARS virus identified, but the disease is still spreading",
            "authors": [
                {
                    "first": "J",
                    "middle": [],
                    "last": "Parry",
                    "suffix": ""
                }
            ],
            "year": 2003,
            "venue": "BMJ",
            "volume": "326",
            "issn": "",
            "pages": "897-897",
            "other_ids": {
                "DOI": [
                    "10.1136/bmj.326.7395.897"
                ]
            }
        },
        "BIBREF11": {
            "title": "Acute respiratory syndrome, China",
            "authors": [],
            "year": 2003,
            "venue": "Wkly Epidemiol Rec",
            "volume": "78",
            "issn": "",
            "pages": "41-41",
            "other_ids": {
                "DOI": []
            }
        },
        "BIBREF12": {
            "title": "A major outbreak of severe acute respiratory syndrome in Hong Kong",
            "authors": [
                {
                    "first": "N",
                    "middle": [],
                    "last": "Lee",
                    "suffix": ""
                },
                {
                    "first": "D",
                    "middle": [],
                    "last": "Hui",
                    "suffix": ""
                },
                {
                    "first": "A",
                    "middle": [],
                    "last": "Wu",
                    "suffix": ""
                }
            ],
            "year": 2003,
            "venue": "N Engl J Med",
            "volume": "348",
            "issn": "",
            "pages": "1986-94",
            "other_ids": {
                "DOI": [
                    "10.1056/NEJMoa030685"
                ]
            }
        },
        "BIBREF13": {
            "title": "",
            "authors": [],
            "year": null,
            "venue": "",
            "volume": "",
            "issn": "",
            "pages": null,
            "other_ids": {
                "DOI": []
            }
        },
        "BIBREF14": {
            "title": "",
            "authors": [],
            "year": null,
            "venue": "",
            "volume": "",
            "issn": "",
            "pages": null,
            "other_ids": {
                "DOI": []
            }
        },
        "BIBREF15": {
            "title": "Clinical course and management of SARS in health care workers in Toronto: a case series",
            "authors": [
                {
                    "first": "M",
                    "middle": [],
                    "last": "Avendano",
                    "suffix": ""
                },
                {
                    "first": "P",
                    "middle": [],
                    "last": "Derkach",
                    "suffix": ""
                },
                {
                    "first": "S",
                    "middle": [],
                    "last": "Swan",
                    "suffix": ""
                }
            ],
            "year": 2003,
            "venue": "CMAJ",
            "volume": "168",
            "issn": "",
            "pages": "1649-60",
            "other_ids": {
                "DOI": []
            }
        },
        "BIBREF16": {
            "title": "Effectiveness of precautions against droplets and contact in prevention of nosocomial transmission of severe acute respiratory syndrome (SARS)",
            "authors": [
                {
                    "first": "WH",
                    "middle": [],
                    "last": "Seto",
                    "suffix": ""
                },
                {
                    "first": "D",
                    "middle": [],
                    "last": "Tsang",
                    "suffix": ""
                },
                {
                    "first": "RW",
                    "middle": [],
                    "last": "Tung",
                    "suffix": ""
                }
            ],
            "year": 2003,
            "venue": "Lancet",
            "volume": "361",
            "issn": "",
            "pages": "1519-20",
            "other_ids": {
                "DOI": [
                    "10.1016/S0140-6736(03)13168-6"
                ]
            }
        },
        "BIBREF17": {
            "title": "",
            "authors": [],
            "year": null,
            "venue": "",
            "volume": "",
            "issn": "",
            "pages": null,
            "other_ids": {
                "DOI": []
            }
        },
        "BIBREF18": {
            "title": "",
            "authors": [],
            "year": null,
            "venue": "",
            "volume": "",
            "issn": "",
            "pages": null,
            "other_ids": {
                "DOI": []
            }
        },
        "BIBREF19": {
            "title": "",
            "authors": [],
            "year": null,
            "venue": "",
            "volume": "",
            "issn": "",
            "pages": null,
            "other_ids": {
                "DOI": []
            }
        },
        "BIBREF20": {
            "title": "",
            "authors": [],
            "year": null,
            "venue": "",
            "volume": "",
            "issn": "",
            "pages": null,
            "other_ids": {
                "DOI": []
            }
        },
        "BIBREF21": {
            "title": "",
            "authors": [],
            "year": null,
            "venue": "",
            "volume": "",
            "issn": "",
            "pages": null,
            "other_ids": {
                "DOI": []
            }
        },
        "BIBREF22": {
            "title": "Severe acute respiratory syndrome (SARS)",
            "authors": [],
            "year": 2003,
            "venue": "Wkly Epidemiol Rec",
            "volume": "78",
            "issn": "",
            "pages": "81-3",
            "other_ids": {
                "DOI": []
            }
        },
        "BIBREF23": {
            "title": "",
            "authors": [],
            "year": null,
            "venue": "",
            "volume": "",
            "issn": "",
            "pages": null,
            "other_ids": {
                "DOI": []
            }
        },
        "BIBREF24": {
            "title": "",
            "authors": [],
            "year": null,
            "venue": "",
            "volume": "",
            "issn": "",
            "pages": null,
            "other_ids": {
                "DOI": []
            }
        },
        "BIBREF25": {
            "title": "Identification of severe acute respiratory syndrome in Canada",
            "authors": [
                {
                    "first": "SM",
                    "middle": [],
                    "last": "Poutanen",
                    "suffix": ""
                },
                {
                    "first": "DE",
                    "middle": [],
                    "last": "Low",
                    "suffix": ""
                },
                {
                    "first": "B",
                    "middle": [],
                    "last": "Henry",
                    "suffix": ""
                }
            ],
            "year": 2003,
            "venue": "N Engl J Med",
            "volume": "348",
            "issn": "",
            "pages": "1995-2005",
            "other_ids": {
                "DOI": [
                    "10.1056/NEJMoa030634"
                ]
            }
        },
        "BIBREF26": {
            "title": "",
            "authors": [],
            "year": null,
            "venue": "",
            "volume": "",
            "issn": "",
            "pages": null,
            "other_ids": {
                "DOI": []
            }
        },
        "BIBREF27": {
            "title": "Toronto succumbs to SARS a second time",
            "authors": [
                {
                    "first": "D",
                    "middle": [],
                    "last": "Spurgeon",
                    "suffix": ""
                }
            ],
            "year": 2003,
            "venue": "BMJ",
            "volume": "326",
            "issn": "",
            "pages": "1162-1162",
            "other_ids": {
                "DOI": [
                    "10.1136/bmj.326.7400.1162-a"
                ]
            }
        },
        "BIBREF28": {
            "title": "Clinical features and short-term outcomes of 144 patients with SARS in the greater Toronto area",
            "authors": [
                {
                    "first": "CM",
                    "middle": [],
                    "last": "Booth",
                    "suffix": ""
                },
                {
                    "first": "LM",
                    "middle": [],
                    "last": "Matukas",
                    "suffix": ""
                },
                {
                    "first": "GA",
                    "middle": [],
                    "last": "Tomlinson",
                    "suffix": ""
                }
            ],
            "year": 2003,
            "venue": "JAMA",
            "volume": "289",
            "issn": "",
            "pages": "2801-9",
            "other_ids": {
                "DOI": [
                    "10.1001/jama.289.21.JOC30885"
                ]
            }
        },
        "BIBREF29": {
            "title": "Anaesthesia and SARS (Editorial)",
            "authors": [
                {
                    "first": "D",
                    "middle": [],
                    "last": "Kamming",
                    "suffix": ""
                },
                {
                    "first": "F",
                    "middle": [],
                    "last": "Chung",
                    "suffix": ""
                },
                {
                    "first": "M",
                    "middle": [],
                    "last": "Gardam",
                    "suffix": ""
                }
            ],
            "year": 2003,
            "venue": "Br J Anaesth",
            "volume": "90",
            "issn": "",
            "pages": "715-8",
            "other_ids": {
                "DOI": [
                    "10.1093/bja/aeg173"
                ]
            }
        }
    }
}