{
    "paper_id": "59dc2dc93fec2b1649d9d202a1ca26d6bd925e2b",
    "metadata": {
        "title": "Viral Agents in Marmoset Colitis",
        "authors": [
            {
                "first": "Robert",
                "middle": [],
                "last": "Russell",
                "suffix": "",
                "affiliation": {
                    "laboratory": "",
                    "institution": "University of Washington",
                    "location": {
                        "settlement": "Seattle"
                    }
                },
                "email": ""
            },
            {
                "first": "Dr",
                "middle": [],
                "last": "",
                "suffix": "",
                "affiliation": {
                    "laboratory": "",
                    "institution": "University of Tennessee",
                    "location": {
                        "settlement": "Knoxville"
                    }
                },
                "email": ""
            },
            {
                "first": "David",
                "middle": [],
                "last": "Brian",
                "suffix": "",
                "affiliation": {
                    "laboratory": "",
                    "institution": "University of Tennessee",
                    "location": {
                        "settlement": "Knoxville"
                    }
                },
                "email": ""
            }
        ]
    },
    "abstract": [],
    "body_text": [
        {
            "text": "sets (15) . Nonbacterial ulcerative colitis occurs in the gorilla (16) , orangutan (16) , gibbon (17) , and marmoset (18) . The finding of coronavirus in a high percentage of marmosets with colitis raises the possibility that the virus may play an etiological role. However, it is just as plausible that the agent is an opportunistic secondary invader of no primary pathogenic significance. However, in this event, the organism could serve to perpetuate inflammation initiated by another agent, or it could be completely innocuous. To define the role of coronavirus in marmoset colitis, prospective studies correlating the incidence of colitis with the occurrence of these viruses will be required, and immunofluorescent and/or nuclear probe techniques will have to be utilized to determine in vivo infectivity.",
            "cite_spans": [
                {
                    "start": 5,
                    "end": 9,
                    "text": "(15)",
                    "ref_id": "BIBREF15"
                },
                {
                    "start": 66,
                    "end": 70,
                    "text": "(16)",
                    "ref_id": "BIBREF16"
                },
                {
                    "start": 83,
                    "end": 87,
                    "text": "(16)",
                    "ref_id": "BIBREF16"
                },
                {
                    "start": 97,
                    "end": 101,
                    "text": "(17)",
                    "ref_id": "BIBREF17"
                },
                {
                    "start": 117,
                    "end": 121,
                    "text": "(18)",
                    "ref_id": "BIBREF18"
                }
            ],
            "ref_spans": [],
            "section": ""
        }
    ],
    "bib_entries": {
        "BIBREF0": {
            "ref_id": "b0",
            "title": "Failure to induce ulcerative colitis experimentally with filtrates of feces and rectal mucosa. A preliminary report",
            "authors": [
                {
                    "first": "R",
                    "middle": [
                        "G"
                    ],
                    "last": "Victor",
                    "suffix": ""
                },
                {
                    "first": "J",
                    "middle": [
                        "B"
                    ],
                    "last": "Kirsner",
                    "suffix": ""
                },
                {
                    "first": "W",
                    "middle": [
                        "L"
                    ],
                    "last": "Palmer",
                    "suffix": ""
                }
            ],
            "year": 1950,
            "venue": "Gastroenterology",
            "volume": "14",
            "issn": "",
            "pages": "398--400",
            "other_ids": {}
        },
        "BIBREF2": {
            "ref_id": "b2",
            "title": "Studies on the viral etiology of regional enteritis and ulcerative colitis: A negative report",
            "authors": [
                {
                    "first": "S",
                    "middle": [
                        "S"
                    ],
                    "last": "Schneierson",
                    "suffix": ""
                },
                {
                    "first": "J",
                    "middle": [
                        "H"
                    ],
                    "last": "Garlock",
                    "suffix": ""
                },
                {
                    "first": "B",
                    "middle": [],
                    "last": "Shore",
                    "suffix": ""
                },
                {
                    "first": "W",
                    "middle": [
                        "D"
                    ],
                    "last": "Stuart",
                    "suffix": ""
                },
                {
                    "first": "M",
                    "middle": [],
                    "last": "Steinglass",
                    "suffix": ""
                },
                {
                    "first": "B",
                    "middle": [],
                    "last": "Aronson",
                    "suffix": ""
                }
            ],
            "year": 1962,
            "venue": "Am J Dig Dis",
            "volume": "7",
            "issn": "",
            "pages": "839--843",
            "other_ids": {}
        },
        "BIBREF3": {
            "ref_id": "b3",
            "title": "Viral investigations in ulcerative colitis and regional enteritis",
            "authors": [
                {
                    "first": "G",
                    "middle": [
                        "W"
                    ],
                    "last": "Farmer",
                    "suffix": ""
                },
                {
                    "first": "M",
                    "middle": [
                        "M"
                    ],
                    "last": "Vincent",
                    "suffix": ""
                },
                {
                    "first": "D",
                    "middle": [
                        "A"
                    ],
                    "last": "Fuccillo",
                    "suffix": ""
                },
                {
                    "first": "L",
                    "middle": [],
                    "last": "Horta-Barbosa",
                    "suffix": ""
                },
                {
                    "first": "S",
                    "middle": [],
                    "last": "Ritman",
                    "suffix": ""
                },
                {
                    "first": "J",
                    "middle": [
                        "L"
                    ],
                    "last": "Sever",
                    "suffix": ""
                },
                {
                    "first": "G",
                    "middle": [
                        "L"
                    ],
                    "last": "Gitnick",
                    "suffix": ""
                }
            ],
            "year": 1973,
            "venue": "",
            "volume": "65",
            "issn": "",
            "pages": "8--18",
            "other_ids": {}
        },
        "BIBREF4": {
            "ref_id": "b4",
            "title": "Isolation and characterization of a viral agent from intestinal tissue of patients with Crohn's disease and other intestinal disorders",
            "authors": [
                {
                    "first": "M",
                    "middle": [
                        "D"
                    ],
                    "last": "Aronson",
                    "suffix": ""
                },
                {
                    "first": "C",
                    "middle": [
                        "A"
                    ],
                    "last": "Phillips",
                    "suffix": ""
                },
                {
                    "first": "W",
                    "middle": [
                        "L"
                    ],
                    "last": "Beeken",
                    "suffix": ""
                },
                {
                    "first": "B",
                    "middle": [
                        "R"
                    ],
                    "last": "Forsyth",
                    "suffix": ""
                }
            ],
            "year": 1975,
            "venue": "Prog Med Virol",
            "volume": "21",
            "issn": "",
            "pages": "165--176",
            "other_ids": {}
        },
        "BIBREF5": {
            "ref_id": "b5",
            "title": "Evidence for the isolation of a new virus from ulcerative colitis patients. Comparison with virus derived from Crohn's disease",
            "authors": [
                {
                    "first": "G",
                    "middle": [
                        "L"
                    ],
                    "last": "Gitnick",
                    "suffix": ""
                },
                {
                    "first": "V",
                    "middle": [
                        "J"
                    ],
                    "last": "Rosen",
                    "suffix": ""
                },
                {
                    "first": "M",
                    "middle": [
                        "H"
                    ],
                    "last": "Arthur",
                    "suffix": ""
                },
                {
                    "first": "S",
                    "middle": [
                        "A"
                    ],
                    "last": "Hertweck",
                    "suffix": ""
                }
            ],
            "year": 1979,
            "venue": "Dig Dis Sci",
            "volume": "24",
            "issn": "",
            "pages": "609--619",
            "other_ids": {}
        },
        "BIBREF6": {
            "ref_id": "b6",
            "title": "78S Digestive Diseases and Sciences",
            "authors": [],
            "year": 1985,
            "venue": "",
            "volume": "30",
            "issn": "",
            "pages": "",
            "other_ids": {}
        },
        "BIBREF7": {
            "ref_id": "b7",
            "title": "Isolation of infectious agents from patients with inflammatory bowel disease",
            "authors": [
                {
                    "first": "R",
                    "middle": [
                        "G"
                    ],
                    "last": "Strickland",
                    "suffix": ""
                },
                {
                    "first": "N",
                    "middle": [
                        "A"
                    ],
                    "last": "Volpicelli",
                    "suffix": ""
                },
                {
                    "first": "J",
                    "middle": [
                        "M"
                    ],
                    "last": "Robinson",
                    "suffix": ""
                },
                {
                    "first": "L",
                    "middle": [
                        "S"
                    ],
                    "last": "Greenlee",
                    "suffix": ""
                },
                {
                    "first": "L",
                    "middle": [
                        "C"
                    ],
                    "last": "Mclaren",
                    "suffix": ""
                }
            ],
            "year": 1979,
            "venue": "Clin Res",
            "volume": "27",
            "issn": "",
            "pages": "",
            "other_ids": {}
        },
        "BIBREF8": {
            "ref_id": "b8",
            "title": "Virus isolation studies in Crohn's disease: A negative report",
            "authors": [
                {
                    "first": "R",
                    "middle": [
                        "J"
                    ],
                    "last": "Phillpotts",
                    "suffix": ""
                },
                {
                    "first": "J",
                    "middle": [],
                    "last": "Hermon-Taylor",
                    "suffix": ""
                },
                {
                    "first": "B",
                    "middle": [
                        "N"
                    ],
                    "last": "Brooke",
                    "suffix": ""
                }
            ],
            "year": 1979,
            "venue": "Gut",
            "volume": "20",
            "issn": "",
            "pages": "1057--1062",
            "other_ids": {}
        },
        "BIBREF9": {
            "ref_id": "b9",
            "title": "Ulcerative colitis and Crohn's disease tissue cytotoxins",
            "authors": [
                {
                    "first": "L",
                    "middle": [
                        "C"
                    ],
                    "last": "Mclaren",
                    "suffix": ""
                },
                {
                    "first": "G",
                    "middle": [],
                    "last": "Gitnick",
                    "suffix": ""
                }
            ],
            "year": 1982,
            "venue": "Gastroenterology",
            "volume": "82",
            "issn": "",
            "pages": "1381--1388",
            "other_ids": {}
        },
        "BIBREF10": {
            "ref_id": "b10",
            "title": "Coronavirus-like particles and other agents in the faeces of children in Efate",
            "authors": [
                {
                    "first": "J",
                    "middle": [
                        "A"
                    ],
                    "last": "Marshall",
                    "suffix": ""
                },
                {
                    "first": "C",
                    "middle": [
                        "J"
                    ],
                    "last": "Birch",
                    "suffix": ""
                },
                {
                    "first": "H",
                    "middle": [
                        "G"
                    ],
                    "last": "Williamson",
                    "suffix": ""
                },
                {
                    "first": "D K",
                    "middle": [],
                    "last": "Bowden",
                    "suffix": ""
                },
                {
                    "first": "C",
                    "middle": [
                        "M"
                    ],
                    "last": "Boveington",
                    "suffix": ""
                },
                {
                    "first": "T",
                    "middle": [],
                    "last": "Kuberski",
                    "suffix": ""
                },
                {
                    "first": "P",
                    "middle": [
                        "H"
                    ],
                    "last": "Bennett",
                    "suffix": ""
                },
                {
                    "first": "I",
                    "middle": [
                        "D"
                    ],
                    "last": "Gust",
                    "suffix": ""
                }
            ],
            "year": 1982,
            "venue": "J Trop Med Hyg",
            "volume": "85",
            "issn": "",
            "pages": "213--215",
            "other_ids": {}
        },
        "BIBREF11": {
            "ref_id": "b11",
            "title": "The human enteric coronaviruses",
            "authors": [
                {
                    "first": "Skr",
                    "middle": [],
                    "last": "Clarke",
                    "suffix": ""
                },
                {
                    "first": "E",
                    "middle": [
                        "O"
                    ],
                    "last": "Caui",
                    "suffix": ""
                },
                {
                    "first": "S",
                    "middle": [
                        "I"
                    ],
                    "last": "Egglestone",
                    "suffix": ""
                }
            ],
            "year": 1979,
            "venue": "Postgrad Med J",
            "volume": "55",
            "issn": "",
            "pages": "135--142",
            "other_ids": {}
        },
        "BIBREF12": {
            "ref_id": "b12",
            "title": "Association of coronavirus infection with neonatal necrotizing enterocolitis",
            "authors": [
                {
                    "first": "C",
                    "middle": [],
                    "last": "Chany",
                    "suffix": ""
                },
                {
                    "first": "O",
                    "middle": [],
                    "last": "Moscovici",
                    "suffix": ""
                },
                {
                    "first": "P",
                    "middle": [],
                    "last": "Lebon",
                    "suffix": ""
                },
                {
                    "first": "S",
                    "middle": [],
                    "last": "Rousset",
                    "suffix": ""
                }
            ],
            "year": 1982,
            "venue": "Pediatrics",
            "volume": "69",
            "issn": "",
            "pages": "209--214",
            "other_ids": {}
        },
        "BIBREF13": {
            "ref_id": "b13",
            "title": "On enteropathogennic bovine coronavirus",
            "authors": [
                {
                    "first": "J",
                    "middle": [],
                    "last": "Storz",
                    "suffix": ""
                },
                {
                    "first": "G",
                    "middle": [],
                    "last": "Kaluza",
                    "suffix": ""
                },
                {
                    "first": "H",
                    "middle": [],
                    "last": "Niemann",
                    "suffix": ""
                },
                {
                    "first": "R",
                    "middle": [],
                    "last": "Rott",
                    "suffix": ""
                }
            ],
            "year": 1981,
            "venue": "Biochemistry and Biology of coronavirus",
            "volume": "142",
            "issn": "",
            "pages": "171--79",
            "other_ids": {}
        },
        "BIBREF14": {
            "ref_id": "b14",
            "title": "Biology of coronaviruses",
            "authors": [
                {
                    "first": "Daj",
                    "middle": [],
                    "last": "Tyrrell",
                    "suffix": ""
                }
            ],
            "year": 1981,
            "venue": "Biochemistry and Biology of coronaviruses",
            "volume": "142",
            "issn": "",
            "pages": "419--425",
            "other_ids": {}
        },
        "BIBREF15": {
            "ref_id": "b15",
            "title": "Coronavirus-like particles in nonhuman primate feces",
            "authors": [
                {
                    "first": "G",
                    "middle": [
                        "C"
                    ],
                    "last": "Smith",
                    "suffix": ""
                },
                {
                    "first": "T",
                    "middle": [
                        "L"
                    ],
                    "last": "Lester",
                    "suffix": ""
                },
                {
                    "first": "R",
                    "middle": [
                        "L"
                    ],
                    "last": "Heberling",
                    "suffix": ""
                },
                {
                    "first": "S",
                    "middle": [
                        "S"
                    ],
                    "last": "Kalter",
                    "suffix": ""
                }
            ],
            "year": 1982,
            "venue": "Arch Virol",
            "volume": "72",
            "issn": "",
            "pages": "105--111",
            "other_ids": {}
        },
        "BIBREF16": {
            "ref_id": "b16",
            "title": "Ulcerative colitis in apes: A comparison with the human disease",
            "authors": [
                {
                    "first": "Gbd",
                    "middle": [],
                    "last": "Scott",
                    "suffix": ""
                },
                {
                    "first": "I",
                    "middle": [
                        "F"
                    ],
                    "last": "Keymer",
                    "suffix": ""
                }
            ],
            "year": 1975,
            "venue": "J Pathol",
            "volume": "115",
            "issn": "",
            "pages": "241--244",
            "other_ids": {}
        },
        "BIBREF17": {
            "ref_id": "b17",
            "title": "Ulcerative colitis-like lesion in Siamang gibbons",
            "authors": [
                {
                    "first": "C",
                    "middle": [],
                    "last": "Stout",
                    "suffix": ""
                },
                {
                    "first": "R",
                    "middle": [
                        "L"
                    ],
                    "last": "Snyder",
                    "suffix": ""
                }
            ],
            "year": 1969,
            "venue": "Gastroenterology",
            "volume": "57",
            "issn": "",
            "pages": "256--261",
            "other_ids": {}
        },
        "BIBREF18": {
            "ref_id": "b18",
            "title": "Colonic adenocarcinoma associated with chronic colitis in cotton-top marmosets, Saguinus oedipus",
            "authors": [
                {
                    "first": "L",
                    "middle": [
                        "V"
                    ],
                    "last": "Chalifoux",
                    "suffix": ""
                },
                {
                    "first": "R",
                    "middle": [
                        "T"
                    ],
                    "last": "Bronson",
                    "suffix": ""
                }
            ],
            "year": null,
            "venue": "Gastroenterology",
            "volume": "80",
            "issn": "",
            "pages": "1--81",
            "other_ids": {}
        }
    },
    "ref_entries": {},
    "back_matter": []
}