{
    "paper_id": "PMC7120684",
    "metadata": {
        "title": "Two Critical Issues in Quantitative Modeling of Communicable Diseases: Inference of Unobservables and Dependent Happening",
        "authors": [
            {
                "first": "Gerardo",
                "middle": [],
                "last": "Chowell",
                "suffix": "",
                "email": "gchowell@asu.edu",
                "affiliation": {}
            },
            {
                "first": "James",
                "middle": [
                    "M."
                ],
                "last": "Hyman",
                "suffix": "",
                "email": "mac@t7.lanl.gov",
                "affiliation": {}
            },
            {
                "first": "Lu\u00eds",
                "middle": [
                    "M.",
                    "A."
                ],
                "last": "Bettencourt",
                "suffix": "",
                "email": "lmbett@lanl.gov",
                "affiliation": {}
            },
            {
                "first": "Carlos",
                "middle": [],
                "last": "Castillo-Chavez",
                "suffix": "",
                "email": "ccchavez@asu.edu",
                "affiliation": {}
            },
            {
                "first": "Hiroshi",
                "middle": [],
                "last": "Nishiura",
                "suffix": "",
                "email": "h.nishiura@uu.nl",
                "affiliation": {}
            },
            {
                "first": "Masayuki",
                "middle": [],
                "last": "Kakehashi",
                "suffix": "",
                "email": "kakehashi@hiroshimau.ac.jp",
                "affiliation": {}
            },
            {
                "first": "Hisashi",
                "middle": [],
                "last": "Inaba",
                "suffix": "",
                "email": null,
                "affiliation": {}
            }
        ]
    },
    "body_text": [],
    "ref_entries": {},
    "back_matter": [],
    "bib_entries": {
        "BIBREF0": {
            "title": "Populations and infectious diseases: Ecology or epidemiology?",
            "authors": [
                {
                    "first": "R.M.",
                    "middle": [],
                    "last": "Anderson",
                    "suffix": ""
                }
            ],
            "year": 1991,
            "venue": "J. Anim. Ecol.",
            "volume": "60",
            "issn": "",
            "pages": "1-50",
            "other_ids": {
                "DOI": [
                    "10.2307/5443"
                ]
            }
        },
        "BIBREF1": {
            "title": "Part 5: Data analysis: Estimation and prediction. Statistical challenges of epidemic data.",
            "authors": [
                {
                    "first": "N.",
                    "middle": [],
                    "last": "Becker",
                    "suffix": ""
                }
            ],
            "year": 1995,
            "venue": "Epidemic Models: Their Structure and Relation to Data",
            "volume": "",
            "issn": "",
            "pages": "339-349",
            "other_ids": {
                "DOI": []
            }
        },
        "BIBREF2": {
            "title": "Uses of the EM algorithm in the analysis of data on HIV/AIDS and other infectious diseases",
            "authors": [
                {
                    "first": "N.G.",
                    "middle": [],
                    "last": "Becker",
                    "suffix": ""
                }
            ],
            "year": 1997,
            "venue": "Stat. Methods. Med. Res.",
            "volume": "6",
            "issn": "",
            "pages": "24-37",
            "other_ids": {
                "DOI": [
                    "10.1191/096228097670368368"
                ]
            }
        },
        "BIBREF3": {
            "title": "Estimating vaccine effects on transmission of infection from household outbreak data",
            "authors": [
                {
                    "first": "N.G.",
                    "middle": [],
                    "last": "Becker",
                    "suffix": ""
                },
                {
                    "first": "T.",
                    "middle": [],
                    "last": "Britton",
                    "suffix": ""
                },
                {
                    "first": "P.D.",
                    "middle": [],
                    "last": "O\u2019Neill",
                    "suffix": ""
                }
            ],
            "year": 2003,
            "venue": "Biometrics.",
            "volume": "59",
            "issn": "",
            "pages": "467-475",
            "other_ids": {
                "DOI": [
                    "10.1111/1541-0420.00056"
                ]
            }
        },
        "BIBREF4": {
            "title": "Estimating vaccine effects from studies of outbreaks in household pairs",
            "authors": [
                {
                    "first": "N.G.",
                    "middle": [],
                    "last": "Becker",
                    "suffix": ""
                },
                {
                    "first": "T.",
                    "middle": [],
                    "last": "Britton",
                    "suffix": ""
                },
                {
                    "first": "P.D.",
                    "middle": [],
                    "last": "O\u2019Neill",
                    "suffix": ""
                }
            ],
            "year": 2006,
            "venue": "Stat. Med.",
            "volume": "25",
            "issn": "",
            "pages": "1079-1093",
            "other_ids": {
                "DOI": [
                    "10.1002/sim.2236"
                ]
            }
        },
        "BIBREF5": {
            "title": "A method of non-parametric back-projection and its application to AIDS data",
            "authors": [
                {
                    "first": "N.G.",
                    "middle": [],
                    "last": "Becker",
                    "suffix": ""
                },
                {
                    "first": "L.F.",
                    "middle": [],
                    "last": "Watson",
                    "suffix": ""
                },
                {
                    "first": "J.B.",
                    "middle": [],
                    "last": "Carlin",
                    "suffix": ""
                }
            ],
            "year": 1991,
            "venue": "Stat. Med.",
            "volume": "10",
            "issn": "",
            "pages": "1527-1542",
            "other_ids": {
                "DOI": [
                    "10.1002/sim.4780101005"
                ]
            }
        },
        "BIBREF6": {
            "title": "A clarification of transmission terms in host-microparasite models: Numbers, densities and areas",
            "authors": [
                {
                    "first": "M.",
                    "middle": [],
                    "last": "Begon",
                    "suffix": ""
                },
                {
                    "first": "M.",
                    "middle": [],
                    "last": "Bennett",
                    "suffix": ""
                },
                {
                    "first": "R.G.",
                    "middle": [],
                    "last": "Bowers",
                    "suffix": ""
                },
                {
                    "first": "N.P.",
                    "middle": [],
                    "last": "French",
                    "suffix": ""
                },
                {
                    "first": "S.M.",
                    "middle": [],
                    "last": "Hazel",
                    "suffix": ""
                },
                {
                    "first": "J.",
                    "middle": [],
                    "last": "Turner",
                    "suffix": ""
                }
            ],
            "year": 2002,
            "venue": "Epidemiol. Infect.",
            "volume": "129",
            "issn": "",
            "pages": "147-153",
            "other_ids": {
                "DOI": [
                    "10.1017/S0950268802007148"
                ]
            }
        },
        "BIBREF7": {
            "title": "Incubation period of infectious diseases.",
            "authors": [
                {
                    "first": "R.",
                    "middle": [],
                    "last": "Brookmeyer",
                    "suffix": ""
                }
            ],
            "year": 1998,
            "venue": "Encyclopedia of Biostatistics",
            "volume": "",
            "issn": "",
            "pages": "2011-2016",
            "other_ids": {
                "DOI": []
            }
        },
        "BIBREF8": {
            "title": "Minimum size of the acquired immunodeficiency syndrome (AIDS) epidemic in the United States",
            "authors": [
                {
                    "first": "R.",
                    "middle": [],
                    "last": "Brookmeyer",
                    "suffix": ""
                },
                {
                    "first": "M.H.",
                    "middle": [],
                    "last": "Gail",
                    "suffix": ""
                }
            ],
            "year": 1986,
            "venue": "Lancet",
            "volume": "2",
            "issn": "",
            "pages": "1320-1322",
            "other_ids": {
                "DOI": [
                    "10.1016/S0140-6736(86)91444-3"
                ]
            }
        },
        "BIBREF9": {
            "title": "A method for obtaining short-term projections and lower bounds on the size of the AIDS epidemic",
            "authors": [
                {
                    "first": "R.",
                    "middle": [],
                    "last": "Brookmeyer",
                    "suffix": ""
                },
                {
                    "first": "M.H.",
                    "middle": [],
                    "last": "Gail",
                    "suffix": ""
                }
            ],
            "year": 1988,
            "venue": "J. Am. Stat. Assoc.",
            "volume": "83",
            "issn": "",
            "pages": "301-308",
            "other_ids": {
                "DOI": [
                    "10.2307/2288844"
                ]
            }
        },
        "BIBREF10": {
            "title": "",
            "authors": [
                {
                    "first": "R.",
                    "middle": [],
                    "last": "Brookmeyer",
                    "suffix": ""
                },
                {
                    "first": "M.H.",
                    "middle": [],
                    "last": "Gail",
                    "suffix": ""
                }
            ],
            "year": 1994,
            "venue": "AIDS Epidemiology: A Quantitative Approach (Monographs in Epidemiology and Biostatistics)",
            "volume": "",
            "issn": "",
            "pages": null,
            "other_ids": {
                "DOI": []
            }
        },
        "BIBREF11": {
            "title": "Directly transmitted infectious diseases: Control by vaccination",
            "authors": [
                {
                    "first": "R.M.",
                    "middle": [],
                    "last": "Anderson",
                    "suffix": ""
                },
                {
                    "first": "R.M.",
                    "middle": [],
                    "last": "May",
                    "suffix": ""
                }
            ],
            "year": 1982,
            "venue": "Science",
            "volume": "215",
            "issn": "",
            "pages": "1053-1060",
            "other_ids": {
                "DOI": [
                    "10.1126/science.7063839"
                ]
            }
        },
        "BIBREF12": {
            "title": "A hypothesis test for the end of a common source outbreak",
            "authors": [
                {
                    "first": "R.",
                    "middle": [],
                    "last": "Brookmeyer",
                    "suffix": ""
                },
                {
                    "first": "X.",
                    "middle": [],
                    "last": "You",
                    "suffix": ""
                }
            ],
            "year": 2006,
            "venue": "Biometrics",
            "volume": "62",
            "issn": "",
            "pages": "61-65",
            "other_ids": {
                "DOI": [
                    "10.1111/j.1541-0420.2005.00421.x"
                ]
            }
        },
        "BIBREF13": {
            "title": "",
            "authors": [
                {
                    "first": "C.V.",
                    "middle": [],
                    "last": "Chapin",
                    "suffix": ""
                }
            ],
            "year": 1912,
            "venue": "The Sources and Modes of Infection",
            "volume": "",
            "issn": "",
            "pages": null,
            "other_ids": {
                "DOI": []
            }
        },
        "BIBREF14": {
            "title": "Risk behavior-based model of the cubic growth of acquired immunodeficiency syndrome in the United States",
            "authors": [
                {
                    "first": "S.A.",
                    "middle": [],
                    "last": "Colgate",
                    "suffix": ""
                },
                {
                    "first": "E.A.",
                    "middle": [],
                    "last": "Stanley",
                    "suffix": ""
                },
                {
                    "first": "J.M.",
                    "middle": [],
                    "last": "Hyman",
                    "suffix": ""
                },
                {
                    "first": "S.P.",
                    "middle": [],
                    "last": "Layne",
                    "suffix": ""
                },
                {
                    "first": "C.",
                    "middle": [],
                    "last": "Qualls",
                    "suffix": ""
                }
            ],
            "year": 1989,
            "venue": "Proc. Natl. Acad. Sci. USA",
            "volume": "86",
            "issn": "",
            "pages": "4793-4797",
            "other_ids": {
                "DOI": [
                    "10.1073/pnas.86.12.4793"
                ]
            }
        },
        "BIBREF15": {
            "title": "",
            "authors": [],
            "year": null,
            "venue": "",
            "volume": "",
            "issn": "",
            "pages": null,
            "other_ids": {
                "DOI": []
            }
        },
        "BIBREF16": {
            "title": "Predicting the CJD epidemic in humans",
            "authors": [
                {
                    "first": "S.N.",
                    "middle": [],
                    "last": "Cousens",
                    "suffix": ""
                },
                {
                    "first": "E.",
                    "middle": [],
                    "last": "Vynnycky",
                    "suffix": ""
                },
                {
                    "first": "M.",
                    "middle": [],
                    "last": "Zeidler",
                    "suffix": ""
                },
                {
                    "first": "R.G.",
                    "middle": [],
                    "last": "Will",
                    "suffix": ""
                },
                {
                    "first": "P.G.",
                    "middle": [],
                    "last": "Smith",
                    "suffix": ""
                }
            ],
            "year": 1997,
            "venue": "Nature",
            "volume": "385",
            "issn": "",
            "pages": "197-198",
            "other_ids": {
                "DOI": [
                    "10.1038/385197a0"
                ]
            }
        },
        "BIBREF17": {
            "title": "",
            "authors": [
                {
                    "first": "D.R.",
                    "middle": [],
                    "last": "Cox",
                    "suffix": ""
                }
            ],
            "year": 1958,
            "venue": "Planning of Experiments",
            "volume": "",
            "issn": "",
            "pages": null,
            "other_ids": {
                "DOI": []
            }
        },
        "BIBREF18": {
            "title": "Predictions of the AIDS epidemic in the U.K.: The use of the back projection method",
            "authors": [
                {
                    "first": "N.E.",
                    "middle": [],
                    "last": "Day",
                    "suffix": ""
                },
                {
                    "first": "S.M.",
                    "middle": [],
                    "last": "Gore",
                    "suffix": ""
                },
                {
                    "first": "M.A.",
                    "middle": [],
                    "last": "McGee",
                    "suffix": ""
                },
                {
                    "first": "M.",
                    "middle": [],
                    "last": "South",
                    "suffix": ""
                }
            ],
            "year": 1989,
            "venue": "Philos. Trans. R. Soc. Lond. Ser. B.",
            "volume": "325",
            "issn": "",
            "pages": "123-134",
            "other_ids": {
                "DOI": [
                    "10.1098/rstb.1989.0077"
                ]
            }
        },
        "BIBREF19": {
            "title": "How does transmission of infection depend on population size?",
            "authors": [
                {
                    "first": "M.C.M.",
                    "middle": [],
                    "last": "de Jong",
                    "suffix": ""
                },
                {
                    "first": "O.",
                    "middle": [],
                    "last": "Diekmann",
                    "suffix": ""
                },
                {
                    "first": "J.A.P.",
                    "middle": [],
                    "last": "Heesterbeek",
                    "suffix": ""
                }
            ],
            "year": 1995,
            "venue": "Epidemic Models: Their Structure and Relation to Data",
            "volume": "",
            "issn": "",
            "pages": "84-94",
            "other_ids": {
                "DOI": []
            }
        },
        "BIBREF20": {
            "title": "",
            "authors": [
                {
                    "first": "O.",
                    "middle": [],
                    "last": "Diekmann",
                    "suffix": ""
                },
                {
                    "first": "J.A.P",
                    "middle": [],
                    "last": "Heesterbeek",
                    "suffix": ""
                }
            ],
            "year": 2000,
            "venue": "Mathematical Epidemiology of Infectious Diseases: Model Building, Analysis and Interpretation",
            "volume": "",
            "issn": "",
            "pages": null,
            "other_ids": {
                "DOI": []
            }
        },
        "BIBREF21": {
            "title": "On the definition and the computation of the basic reproduction ratio $R_0$ in models for infectious diseases in heterogeneous populations",
            "authors": [
                {
                    "first": "O.",
                    "middle": [],
                    "last": "Diekmann",
                    "suffix": ""
                },
                {
                    "first": "J.A.",
                    "middle": [],
                    "last": "Heesterbeek",
                    "suffix": ""
                },
                {
                    "first": "J.A.",
                    "middle": [],
                    "last": "Metz",
                    "suffix": ""
                }
            ],
            "year": 1990,
            "venue": "J. Math. Biol.",
            "volume": "28",
            "issn": "",
            "pages": "365-382",
            "other_ids": {
                "DOI": [
                    "10.1007/BF00178324"
                ]
            }
        },
        "BIBREF22": {
            "title": "Vaccination and herd immunity to infectious diseases",
            "authors": [
                {
                    "first": "R.M.",
                    "middle": [],
                    "last": "Anderson",
                    "suffix": ""
                },
                {
                    "first": "R.M.",
                    "middle": [],
                    "last": "May",
                    "suffix": ""
                }
            ],
            "year": 1985,
            "venue": "Nature",
            "volume": "318",
            "issn": "",
            "pages": "323-329",
            "other_ids": {
                "DOI": [
                    "10.1038/318323a0"
                ]
            }
        },
        "BIBREF23": {
            "title": "The estimation of the basic reproduction number for infectious diseases",
            "authors": [
                {
                    "first": "K.",
                    "middle": [],
                    "last": "Dietz",
                    "suffix": ""
                }
            ],
            "year": 1993,
            "venue": "Stat. Methods. Med. Res.",
            "volume": "2",
            "issn": "",
            "pages": "23-41",
            "other_ids": {
                "DOI": [
                    "10.1177/096228029300200103"
                ]
            }
        },
        "BIBREF24": {
            "title": "Extending backcalculation to analyse BSE data",
            "authors": [
                {
                    "first": "C.A.",
                    "middle": [],
                    "last": "Donnelly",
                    "suffix": ""
                },
                {
                    "first": "N.M.",
                    "middle": [],
                    "last": "Ferguson",
                    "suffix": ""
                },
                {
                    "first": "A.C.",
                    "middle": [],
                    "last": "Ghani",
                    "suffix": ""
                },
                {
                    "first": "R.M.",
                    "middle": [],
                    "last": "Anderson",
                    "suffix": ""
                }
            ],
            "year": 2003,
            "venue": "Stat. Methods. Med. Res.",
            "volume": "12",
            "issn": "",
            "pages": "177-190",
            "other_ids": {
                "DOI": [
                    "10.1191/0962280203sm337ra"
                ]
            }
        },
        "BIBREF25": {
            "title": "Studies on the virus content of mouth washings in the acute phase of smallpox",
            "authors": [
                {
                    "first": "A.W.",
                    "middle": [],
                    "last": "Downie",
                    "suffix": ""
                },
                {
                    "first": "L.",
                    "middle": [],
                    "last": "St Vincent",
                    "suffix": ""
                },
                {
                    "first": "G.",
                    "middle": [],
                    "last": "Meiklejohn",
                    "suffix": ""
                },
                {
                    "first": "N.R.",
                    "middle": [],
                    "last": "Ratnakannan",
                    "suffix": ""
                },
                {
                    "first": "A.R.",
                    "middle": [],
                    "last": "Rao",
                    "suffix": ""
                },
                {
                    "first": "G.N.",
                    "middle": [],
                    "last": "Krishnan",
                    "suffix": ""
                },
                {
                    "first": "C.H.",
                    "middle": [],
                    "last": "Kempe",
                    "suffix": ""
                }
            ],
            "year": 1961,
            "venue": "Bull. World Health Organ.",
            "volume": "25",
            "issn": "",
            "pages": "49-53",
            "other_ids": {
                "DOI": []
            }
        },
        "BIBREF26": {
            "title": "On the true rate of natural increase",
            "authors": [
                {
                    "first": "L.I.",
                    "middle": [],
                    "last": "Dublin",
                    "suffix": ""
                },
                {
                    "first": "A.J.",
                    "middle": [],
                    "last": "Lotka",
                    "suffix": ""
                }
            ],
            "year": 1925,
            "venue": "J. Am. Stat. Assoc.",
            "volume": "151",
            "issn": "",
            "pages": "305-339",
            "other_ids": {
                "DOI": [
                    "10.2307/2965517"
                ]
            }
        },
        "BIBREF27": {
            "title": "Case isolation and contact tracing can prevent the spread of smallpox",
            "authors": [
                {
                    "first": "M.",
                    "middle": [],
                    "last": "Eichner",
                    "suffix": ""
                }
            ],
            "year": 2003,
            "venue": "Am. J. Epidemiol.",
            "volume": "158",
            "issn": "",
            "pages": "118-128",
            "other_ids": {
                "DOI": [
                    "10.1093/aje/kwg104"
                ]
            }
        },
        "BIBREF28": {
            "title": "Transmission potential of smallpox: Estimates based on detailed data from an outbreak",
            "authors": [
                {
                    "first": "M.",
                    "middle": [],
                    "last": "Eichner",
                    "suffix": ""
                },
                {
                    "first": "K.",
                    "middle": [],
                    "last": "Dietz",
                    "suffix": ""
                }
            ],
            "year": 2003,
            "venue": "Am. J. Epidemiol.",
            "volume": "158",
            "issn": "",
            "pages": "110-117",
            "other_ids": {
                "DOI": [
                    "10.1093/aje/kwg103"
                ]
            }
        },
        "BIBREF29": {
            "title": "SARS incubation and quarantine times: When is an exposed individual known to be disease free?",
            "authors": [
                {
                    "first": "V.T.",
                    "middle": [],
                    "last": "Farewell",
                    "suffix": ""
                },
                {
                    "first": "A.M.",
                    "middle": [],
                    "last": "Herzberg",
                    "suffix": ""
                },
                {
                    "first": "K.W.",
                    "middle": [],
                    "last": "James",
                    "suffix": ""
                },
                {
                    "first": "L.M.",
                    "middle": [],
                    "last": "Ho",
                    "suffix": ""
                },
                {
                    "first": "G.M.",
                    "middle": [],
                    "last": "Leung",
                    "suffix": ""
                }
            ],
            "year": 2005,
            "venue": "Stat. Med.",
            "volume": "24",
            "issn": "",
            "pages": "3431-3445",
            "other_ids": {
                "DOI": [
                    "10.1002/sim.2206"
                ]
            }
        },
        "BIBREF30": {
            "title": "On vaccine efficacy and reproduction numbers",
            "authors": [
                {
                    "first": "C.P.",
                    "middle": [],
                    "last": "Farrington",
                    "suffix": ""
                }
            ],
            "year": 2003,
            "venue": "Math. Biosci.",
            "volume": "185",
            "issn": "",
            "pages": "89-109",
            "other_ids": {
                "DOI": [
                    "10.1016/S0025-5564(03)00061-0"
                ]
            }
        },
        "BIBREF31": {
            "title": "The pathogenesis of the acute exanthems. An interpretation based upon experimental investigation with mouse-pox (infectious ectromelia of mice)",
            "authors": [
                {
                    "first": "F.",
                    "middle": [],
                    "last": "Fenner",
                    "suffix": ""
                }
            ],
            "year": 1948,
            "venue": "Lancet",
            "volume": "ii",
            "issn": "",
            "pages": "915-920",
            "other_ids": {
                "DOI": [
                    "10.1016/S0140-6736(48)91599-2"
                ]
            }
        },
        "BIBREF32": {
            "title": "The epidemiology of BSE in cattle herds in Great Britain. II. Model construction and analysis of transmission dynamics",
            "authors": [
                {
                    "first": "N.M.",
                    "middle": [],
                    "last": "Ferguson",
                    "suffix": ""
                },
                {
                    "first": "C.A.",
                    "middle": [],
                    "last": "Donnelly",
                    "suffix": ""
                },
                {
                    "first": "M.E.",
                    "middle": [],
                    "last": "Woolhouse",
                    "suffix": ""
                },
                {
                    "first": "R.M.",
                    "middle": [],
                    "last": "Anderson",
                    "suffix": ""
                }
            ],
            "year": 1997,
            "venue": "Phil. Trans. R. Soc. Lond. Ser. B.",
            "volume": "352",
            "issn": "",
            "pages": "803-838",
            "other_ids": {
                "DOI": [
                    "10.1098/rstb.1997.0063"
                ]
            }
        },
        "BIBREF33": {
            "title": "Immunisation and herd immunity",
            "authors": [
                {
                    "first": "R.M.",
                    "middle": [],
                    "last": "Anderson",
                    "suffix": ""
                },
                {
                    "first": "R.M.",
                    "middle": [],
                    "last": "May",
                    "suffix": ""
                }
            ],
            "year": 1990,
            "venue": "Lancet",
            "volume": "335",
            "issn": "",
            "pages": "641-645",
            "other_ids": {
                "DOI": [
                    "10.1016/0140-6736(90)90420-A"
                ]
            }
        },
        "BIBREF34": {
            "title": "Herd immunity: history, theory, practice",
            "authors": [
                {
                    "first": "P.E.",
                    "middle": [],
                    "last": "Fine",
                    "suffix": ""
                }
            ],
            "year": 1993,
            "venue": "Epidemiol. Rev.",
            "volume": "15",
            "issn": "",
            "pages": "265-302",
            "other_ids": {
                "DOI": []
            }
        },
        "BIBREF35": {
            "title": "The interval between successive cases of an infectious disease",
            "authors": [
                {
                    "first": "P.E.",
                    "middle": [],
                    "last": "Fine",
                    "suffix": ""
                }
            ],
            "year": 2003,
            "venue": "Am. J. Epidemiol.",
            "volume": "158",
            "issn": "",
            "pages": "1039-1047",
            "other_ids": {
                "DOI": [
                    "10.1093/aje/kwg251"
                ]
            }
        },
        "BIBREF36": {
            "title": "Factors that make an infectious disease outbreak controllable",
            "authors": [
                {
                    "first": "C.",
                    "middle": [],
                    "last": "Fraser",
                    "suffix": ""
                },
                {
                    "first": "S.",
                    "middle": [],
                    "last": "Riley",
                    "suffix": ""
                },
                {
                    "first": "R.M.",
                    "middle": [],
                    "last": "Anderson",
                    "suffix": ""
                },
                {
                    "first": "N.M.",
                    "middle": [],
                    "last": "Ferguson",
                    "suffix": ""
                }
            ],
            "year": 2004,
            "venue": "Proc. Natl. Acad. Sci. USA",
            "volume": "101",
            "issn": "",
            "pages": "6146-6151",
            "other_ids": {
                "DOI": [
                    "10.1073/pnas.0307506101"
                ]
            }
        },
        "BIBREF37": {
            "title": "Methods for projecting course of acquired immunodeficiency syndrome epidemic",
            "authors": [
                {
                    "first": "M.H.",
                    "middle": [],
                    "last": "Gail",
                    "suffix": ""
                },
                {
                    "first": "R.",
                    "middle": [],
                    "last": "Brookmeyer",
                    "suffix": ""
                }
            ],
            "year": 1988,
            "venue": "J. Natl. Cancer. Inst.",
            "volume": "80",
            "issn": "",
            "pages": "900-911",
            "other_ids": {
                "DOI": [
                    "10.1093/jnci/80.12.900"
                ]
            }
        },
        "BIBREF38": {
            "title": "An overview of relations among causal modelling methods",
            "authors": [
                {
                    "first": "S.",
                    "middle": [],
                    "last": "Greenland",
                    "suffix": ""
                },
                {
                    "first": "B.",
                    "middle": [],
                    "last": "Brumback",
                    "suffix": ""
                }
            ],
            "year": 2002,
            "venue": "Int. J. Epidemiol.",
            "volume": "31",
            "issn": "",
            "pages": "1030-1037",
            "other_ids": {
                "DOI": [
                    "10.1093/ije/31.5.1030"
                ]
            }
        },
        "BIBREF39": {
            "title": "The statistics of anti-typhoid and anti-cholera inoculations, and the interpretation of such statistics in general",
            "authors": [
                {
                    "first": "M.",
                    "middle": [],
                    "last": "Greenwood",
                    "suffix": ""
                },
                {
                    "first": "G.U.",
                    "middle": [],
                    "last": "Yule",
                    "suffix": ""
                }
            ],
            "year": 1915,
            "venue": "Proc. R. Soc. Med.",
            "volume": "8",
            "issn": "",
            "pages": "113-190",
            "other_ids": {
                "DOI": []
            }
        },
        "BIBREF40": {
            "title": "Estimation of the direct and indirect effects of vaccination",
            "authors": [
                {
                    "first": "M.",
                    "middle": [],
                    "last": "Haber",
                    "suffix": ""
                }
            ],
            "year": 1999,
            "venue": "Stat. Med.",
            "volume": "18",
            "issn": "",
            "pages": "2101-2109",
            "other_ids": {
                "DOI": [
                    "10.1002/(SICI)1097-0258(19990830)18:16<2101::AID-SIM178>3.0.CO;2-6"
                ]
            }
        },
        "BIBREF41": {
            "title": "Measures of the effects of vaccination in a randomly mixing population",
            "authors": [
                {
                    "first": "M.",
                    "middle": [],
                    "last": "Haber",
                    "suffix": ""
                },
                {
                    "first": "I.M.",
                    "middle": [],
                    "last": "Longini",
                    "suffix": ""
                },
                {
                    "first": "M.E.",
                    "middle": [],
                    "last": "Halloran",
                    "suffix": ""
                }
            ],
            "year": 1991,
            "venue": "Int. J. Epidemiol.",
            "volume": "20",
            "issn": "",
            "pages": "300-310",
            "other_ids": {
                "DOI": [
                    "10.1093/ije/20.1.300"
                ]
            }
        },
        "BIBREF42": {
            "title": "Concepts of infectious disease epidemiology.",
            "authors": [
                {
                    "first": "M.E.",
                    "middle": [],
                    "last": "Halloran",
                    "suffix": ""
                }
            ],
            "year": 1988,
            "venue": "Modern Epidemiology",
            "volume": "",
            "issn": "",
            "pages": "529-554",
            "other_ids": {
                "DOI": []
            }
        },
        "BIBREF43": {
            "title": "Secondary attack rate.",
            "authors": [
                {
                    "first": "M.E.",
                    "middle": [],
                    "last": "Halloran",
                    "suffix": ""
                }
            ],
            "year": 1988,
            "venue": "Encyclopedia of Biostatistics",
            "volume": "",
            "issn": "",
            "pages": "4025-4029",
            "other_ids": {
                "DOI": []
            }
        },
        "BIBREF44": {
            "title": "",
            "authors": [
                {
                    "first": "R.M.",
                    "middle": [],
                    "last": "Anderson",
                    "suffix": ""
                },
                {
                    "first": "R.M.",
                    "middle": [],
                    "last": "May",
                    "suffix": ""
                }
            ],
            "year": 1991,
            "venue": "Infectious Diseases of Humans: Dynamics and Control",
            "volume": "",
            "issn": "",
            "pages": null,
            "other_ids": {
                "DOI": []
            }
        },
        "BIBREF45": {
            "title": "Overview of study design.",
            "authors": [
                {
                    "first": "M.E.",
                    "middle": [],
                    "last": "Halloran",
                    "suffix": ""
                }
            ],
            "year": 2001,
            "venue": "Epidemiologic Methods for the Study of Infectious Diseases",
            "volume": "",
            "issn": "",
            "pages": "86-115",
            "other_ids": {
                "DOI": []
            }
        },
        "BIBREF46": {
            "title": "Direct and indirect effects in vaccine field efficacy and effectiveness",
            "authors": [
                {
                    "first": "M.E.",
                    "middle": [],
                    "last": "Halloran",
                    "suffix": ""
                },
                {
                    "first": "M.J.",
                    "middle": [],
                    "last": "Haber",
                    "suffix": ""
                },
                {
                    "first": "I.M.",
                    "middle": [],
                    "last": "Longini",
                    "suffix": ""
                },
                {
                    "first": "C.J.",
                    "middle": [],
                    "last": "Struchiner",
                    "suffix": ""
                }
            ],
            "year": 1991,
            "venue": "Am. J. Epidemiol.",
            "volume": "133",
            "issn": "",
            "pages": "323-331",
            "other_ids": {
                "DOI": []
            }
        },
        "BIBREF47": {
            "title": "Antiviral effects on influenza viral transmission and pathogenicity: Observations from household-based trials",
            "authors": [
                {
                    "first": "M.E.",
                    "middle": [],
                    "last": "Halloran",
                    "suffix": ""
                },
                {
                    "first": "F.G.",
                    "middle": [],
                    "last": "Hayden",
                    "suffix": ""
                },
                {
                    "first": "Y.",
                    "middle": [],
                    "last": "Yang",
                    "suffix": ""
                },
                {
                    "first": "I.M.",
                    "middle": [],
                    "last": "Longini",
                    "suffix": ""
                },
                {
                    "first": "A.S.",
                    "middle": [],
                    "last": "Monto",
                    "suffix": ""
                }
            ],
            "year": 2007,
            "venue": "Am. J. Epidemiol.",
            "volume": "165",
            "issn": "",
            "pages": "212-221",
            "other_ids": {
                "DOI": [
                    "10.1093/aje/kwj362"
                ]
            }
        },
        "BIBREF48": {
            "title": "Study designs for dependent happenings",
            "authors": [
                {
                    "first": "M.E.",
                    "middle": [],
                    "last": "Halloran",
                    "suffix": ""
                },
                {
                    "first": "C.J.",
                    "middle": [],
                    "last": "Struchiner",
                    "suffix": ""
                }
            ],
            "year": 1991,
            "venue": "Epidemiology",
            "volume": "2",
            "issn": "",
            "pages": "331-338",
            "other_ids": {
                "DOI": [
                    "10.1097/00001648-199109000-00004"
                ]
            }
        },
        "BIBREF49": {
            "title": "Causal inference in infectious diseases",
            "authors": [
                {
                    "first": "M.E.",
                    "middle": [],
                    "last": "Halloran",
                    "suffix": ""
                },
                {
                    "first": "C.J.",
                    "middle": [],
                    "last": "Struchiner",
                    "suffix": ""
                }
            ],
            "year": 1995,
            "venue": "Epidemiology",
            "volume": "6",
            "issn": "",
            "pages": "142-151",
            "other_ids": {
                "DOI": [
                    "10.1097/00001648-199503000-00010"
                ]
            }
        },
        "BIBREF50": {
            "title": "Study designs for evaluating different efficacy and effectiveness aspects of vaccines",
            "authors": [
                {
                    "first": "M.E.",
                    "middle": [],
                    "last": "Halloran",
                    "suffix": ""
                },
                {
                    "first": "C.J.",
                    "middle": [],
                    "last": "Struchiner",
                    "suffix": ""
                },
                {
                    "first": "I.M.",
                    "middle": [],
                    "last": "Longini",
                    "suffix": ""
                }
            ],
            "year": 1997,
            "venue": "Am. J. Epidemiol.",
            "volume": "146",
            "issn": "",
            "pages": "789-803",
            "other_ids": {
                "DOI": []
            }
        },
        "BIBREF51": {
            "title": "The construction and analysis of epidemic trees with reference to the 2001 UK foot-and-mouth outbreak",
            "authors": [
                {
                    "first": "D.T.",
                    "middle": [],
                    "last": "Haydon",
                    "suffix": ""
                },
                {
                    "first": "M.",
                    "middle": [],
                    "last": "Chase-Topping",
                    "suffix": ""
                },
                {
                    "first": "D.J.",
                    "middle": [],
                    "last": "Shaw",
                    "suffix": ""
                },
                {
                    "first": "L.",
                    "middle": [],
                    "last": "Matthews",
                    "suffix": ""
                },
                {
                    "first": "J.K.",
                    "middle": [],
                    "last": "Friar",
                    "suffix": ""
                },
                {
                    "first": "J.",
                    "middle": [],
                    "last": "Wilesmith",
                    "suffix": ""
                },
                {
                    "first": "M.E.",
                    "middle": [],
                    "last": "Woolhouse",
                    "suffix": ""
                }
            ],
            "year": 2003,
            "venue": "Proc. R. Soc. Lond. Ser. B.",
            "volume": "270",
            "issn": "",
            "pages": "121-127",
            "other_ids": {
                "DOI": [
                    "10.1098/rspb.2002.2191"
                ]
            }
        },
        "BIBREF52": {
            "title": "Instruments for causal inference: An epidemiologist\u2019s dream?",
            "authors": [
                {
                    "first": "M.A.",
                    "middle": [],
                    "last": "Hernan",
                    "suffix": ""
                },
                {
                    "first": "J.M.",
                    "middle": [],
                    "last": "Robins",
                    "suffix": ""
                }
            ],
            "year": 2006,
            "venue": "Epidemiology",
            "volume": "17",
            "issn": "",
            "pages": "360-372",
            "other_ids": {
                "DOI": [
                    "10.1097/01.ede.0000222409.00878.37"
                ]
            }
        },
        "BIBREF53": {
            "title": "The three-parameter lognormal distribution and Bayesian analysis of a point-source epidemic",
            "authors": [
                {
                    "first": "B.M.",
                    "middle": [],
                    "last": "Hill",
                    "suffix": ""
                }
            ],
            "year": 1963,
            "venue": "J. Am. Stat. Assoc.",
            "volume": "58",
            "issn": "",
            "pages": "72-84",
            "other_ids": {
                "DOI": [
                    "10.2307/2282955"
                ]
            }
        },
        "BIBREF54": {
            "title": "The period of transmission in certain epidemic diseases: An observational method for its discovery",
            "authors": [
                {
                    "first": "R.E.",
                    "middle": [],
                    "last": "Hope Simpson",
                    "suffix": ""
                }
            ],
            "year": 1948,
            "venue": "Lancet.",
            "volume": "2",
            "issn": "",
            "pages": "755-760",
            "other_ids": {
                "DOI": [
                    "10.1016/S0140-6736(48)91328-2"
                ]
            }
        },
        "BIBREF55": {
            "title": "A preliminary study of the transmission dynamics of the human immunodeficiency virus (HIV), the causative agent of AIDS",
            "authors": [
                {
                    "first": "R.M.",
                    "middle": [],
                    "last": "Anderson",
                    "suffix": ""
                },
                {
                    "first": "G.F.",
                    "middle": [],
                    "last": "Medley",
                    "suffix": ""
                },
                {
                    "first": "R.M.",
                    "middle": [],
                    "last": "May",
                    "suffix": ""
                },
                {
                    "first": "A.M.",
                    "middle": [],
                    "last": "Johnson",
                    "suffix": ""
                }
            ],
            "year": 1986,
            "venue": "IMA J. Math. Appl. Med. Biol.",
            "volume": "3",
            "issn": "",
            "pages": "229-263",
            "other_ids": {
                "DOI": [
                    "10.1093/imammb/3.4.229"
                ]
            }
        },
        "BIBREF56": {
            "title": "The state-reproduction number for a multistate class age structured epidemic system and its application to the asymptomatic transmission model",
            "authors": [
                {
                    "first": "H.",
                    "middle": [],
                    "last": "Inaba",
                    "suffix": ""
                },
                {
                    "first": "H.",
                    "middle": [],
                    "last": "Nishiura",
                    "suffix": ""
                }
            ],
            "year": 2008,
            "venue": "Math. Biosci.",
            "volume": "216",
            "issn": "",
            "pages": "77-89",
            "other_ids": {
                "DOI": [
                    "10.1016/j.mbs.2008.08.005"
                ]
            }
        },
        "BIBREF57": {
            "title": "",
            "authors": [
                {
                    "first": "N.P.",
                    "middle": [],
                    "last": "Jewell",
                    "suffix": ""
                },
                {
                    "first": "K.",
                    "middle": [],
                    "last": "Dietz",
                    "suffix": ""
                },
                {
                    "first": "V.T.",
                    "middle": [],
                    "last": "Farewell",
                    "suffix": ""
                }
            ],
            "year": 1992,
            "venue": "AIDS Epidemiology: Methodological Issues",
            "volume": "",
            "issn": "",
            "pages": null,
            "other_ids": {
                "DOI": []
            }
        },
        "BIBREF58": {
            "title": "Herd immunity and herd effect: New insights and definitions",
            "authors": [
                {
                    "first": "T.J.",
                    "middle": [],
                    "last": "John",
                    "suffix": ""
                },
                {
                    "first": "R.",
                    "middle": [],
                    "last": "Samuel",
                    "suffix": ""
                }
            ],
            "year": 2000,
            "venue": "Eur. J. Epidemiol.",
            "volume": "16",
            "issn": "",
            "pages": "601-606",
            "other_ids": {
                "DOI": [
                    "10.1023/A:1007626510002"
                ]
            }
        },
        "BIBREF59": {
            "title": "The ecological effects of individual exposures and nonlinear disease dynamics in populations",
            "authors": [
                {
                    "first": "J.S.",
                    "middle": [],
                    "last": "Koopman",
                    "suffix": ""
                },
                {
                    "first": "I.M.",
                    "middle": [],
                    "last": "Longini",
                    "suffix": ""
                }
            ],
            "year": 1994,
            "venue": "Am. J. Public. Health.",
            "volume": "84",
            "issn": "",
            "pages": "836-842",
            "other_ids": {
                "DOI": [
                    "10.2105/AJPH.84.5.836"
                ]
            }
        },
        "BIBREF60": {
            "title": "Assessing risk factors for transmission of infection",
            "authors": [
                {
                    "first": "J.S.",
                    "middle": [],
                    "last": "Koopman",
                    "suffix": ""
                },
                {
                    "first": "I.M.",
                    "middle": [],
                    "last": "Longini",
                    "suffix": ""
                },
                {
                    "first": "J.A.",
                    "middle": [],
                    "last": "Jacquez",
                    "suffix": ""
                },
                {
                    "first": "C.P.",
                    "middle": [],
                    "last": "Simon",
                    "suffix": ""
                },
                {
                    "first": "D.G.",
                    "middle": [],
                    "last": "Ostrow",
                    "suffix": ""
                },
                {
                    "first": "W.R.",
                    "middle": [],
                    "last": "Martin",
                    "suffix": ""
                },
                {
                    "first": "D.M.",
                    "middle": [],
                    "last": "Woodcock",
                    "suffix": ""
                }
            ],
            "year": 1991,
            "venue": "Am. J. Epidemiol.",
            "volume": "133",
            "issn": "",
            "pages": "1199-1209",
            "other_ids": {
                "DOI": []
            }
        },
        "BIBREF61": {
            "title": "Transmission dynamics and control of severe acute respiratory syndrome",
            "authors": [
                {
                    "first": "M.",
                    "middle": [],
                    "last": "Lipsitch",
                    "suffix": ""
                },
                {
                    "first": "T.",
                    "middle": [],
                    "last": "Cohen",
                    "suffix": ""
                },
                {
                    "first": "B.",
                    "middle": [],
                    "last": "Cooper",
                    "suffix": ""
                },
                {
                    "first": "J.M.",
                    "middle": [],
                    "last": "Robins",
                    "suffix": ""
                },
                {
                    "first": "S.",
                    "middle": [],
                    "last": "Ma",
                    "suffix": ""
                },
                {
                    "first": "L.",
                    "middle": [],
                    "last": "James",
                    "suffix": ""
                },
                {
                    "first": "G.",
                    "middle": [],
                    "last": "Gopalakrishna",
                    "suffix": ""
                },
                {
                    "first": "S.K.",
                    "middle": [],
                    "last": "Chew",
                    "suffix": ""
                },
                {
                    "first": "C.C.",
                    "middle": [],
                    "last": "Tan",
                    "suffix": ""
                },
                {
                    "first": "M.H.",
                    "middle": [],
                    "last": "Samore",
                    "suffix": ""
                },
                {
                    "first": "D.",
                    "middle": [],
                    "last": "Fisman",
                    "suffix": ""
                },
                {
                    "first": "M.",
                    "middle": [],
                    "last": "Murray",
                    "suffix": ""
                }
            ],
            "year": 2003,
            "venue": "Science.",
            "volume": "300",
            "issn": "",
            "pages": "1966-1970",
            "other_ids": {
                "DOI": [
                    "10.1126/science.1086616"
                ]
            }
        },
        "BIBREF62": {
            "title": "Superspreading and the effect of individual variation on disease emergence",
            "authors": [
                {
                    "first": "J.O.",
                    "middle": [],
                    "last": "Lloyd-Smith",
                    "suffix": ""
                },
                {
                    "first": "S.J.",
                    "middle": [],
                    "last": "Schreiber",
                    "suffix": ""
                },
                {
                    "first": "P.E.",
                    "middle": [],
                    "last": "Kopp",
                    "suffix": ""
                },
                {
                    "first": "W.M.",
                    "middle": [],
                    "last": "Getz",
                    "suffix": ""
                }
            ],
            "year": 2005,
            "venue": "Nature",
            "volume": "438",
            "issn": "",
            "pages": "355-359",
            "other_ids": {
                "DOI": [
                    "10.1038/nature04153"
                ]
            }
        },
        "BIBREF63": {
            "title": "Measuring vaccine efficacy for both susceptibility to infection and reduction in infectiousness for prophylactic HIV-1 vaccines",
            "authors": [
                {
                    "first": "I.M.",
                    "middle": [],
                    "last": "Longini",
                    "suffix": ""
                },
                {
                    "first": "S.",
                    "middle": [],
                    "last": "Datta",
                    "suffix": ""
                },
                {
                    "first": "M.E.",
                    "middle": [],
                    "last": "Halloran",
                    "suffix": ""
                }
            ],
            "year": 1996,
            "venue": "J. Acquir. Immune. Defic. Syndr. Hum. Retrovirol.",
            "volume": "13",
            "issn": "",
            "pages": "440-407",
            "other_ids": {
                "DOI": []
            }
        },
        "BIBREF64": {
            "title": "Optimal vaccine trial design when estimating vaccine efficacy for susceptibility and infectiousness from multiple populations",
            "authors": [
                {
                    "first": "I.M.",
                    "middle": [],
                    "last": "Longini",
                    "suffix": ""
                },
                {
                    "first": "K.",
                    "middle": [],
                    "last": "Sagatelian",
                    "suffix": ""
                },
                {
                    "first": "W.N.",
                    "middle": [],
                    "last": "Rida",
                    "suffix": ""
                },
                {
                    "first": "M.E.",
                    "middle": [],
                    "last": "Halloran",
                    "suffix": ""
                }
            ],
            "year": 1998,
            "venue": "Stat. Med.",
            "volume": "17",
            "issn": "",
            "pages": "1121-1136",
            "other_ids": {
                "DOI": [
                    "10.1002/(SICI)1097-0258(19980530)17:10<1121::AID-SIM824>3.0.CO;2-E"
                ]
            }
        },
        "BIBREF65": {
            "title": "Infection dynamics on scale-free networks",
            "authors": [
                {
                    "first": "R.M.",
                    "middle": [],
                    "last": "May",
                    "suffix": ""
                },
                {
                    "first": "A.L.",
                    "middle": [],
                    "last": "Lloyd",
                    "suffix": ""
                }
            ],
            "year": 2001,
            "venue": "Phys. Rev. E. Stat. Nonlin. Soft. Matter. Phys.",
            "volume": "64",
            "issn": "",
            "pages": null,
            "other_ids": {
                "DOI": []
            }
        },
        "BIBREF66": {
            "title": "",
            "authors": [
                {
                    "first": "N.T.J.",
                    "middle": [],
                    "last": "Bailey",
                    "suffix": ""
                }
            ],
            "year": 1975,
            "venue": "The Mathematical Theory of Infectious Diseases and Its Applications",
            "volume": "",
            "issn": "",
            "pages": null,
            "other_ids": {
                "DOI": []
            }
        },
        "BIBREF67": {
            "title": "How should pathogen transmission be modelled?",
            "authors": [
                {
                    "first": "H.",
                    "middle": [],
                    "last": "McCallum",
                    "suffix": ""
                },
                {
                    "first": "N.",
                    "middle": [],
                    "last": "Barlow",
                    "suffix": ""
                },
                {
                    "first": "J.",
                    "middle": [],
                    "last": "Hone",
                    "suffix": ""
                }
            ],
            "year": 2001,
            "venue": "Trends. Ecol. Evol.",
            "volume": "16",
            "issn": "",
            "pages": "295-300",
            "other_ids": {
                "DOI": [
                    "10.1016/S0169-5347(01)02144-9"
                ]
            }
        },
        "BIBREF68": {
            "title": "The growth of micro-organisms in vivo with particular reference to the relation between dose and latent period",
            "authors": [
                {
                    "first": "G.G.",
                    "middle": [],
                    "last": "Meynell",
                    "suffix": ""
                },
                {
                    "first": "E.W.",
                    "middle": [],
                    "last": "Meynell",
                    "suffix": ""
                }
            ],
            "year": 1958,
            "venue": "J. Hyg. (Lond)",
            "volume": "56",
            "issn": "",
            "pages": "323-346",
            "other_ids": {
                "DOI": []
            }
        },
        "BIBREF69": {
            "title": "Circulating cytokines as mediators of fever",
            "authors": [
                {
                    "first": "M.G.",
                    "middle": [],
                    "last": "Netea",
                    "suffix": ""
                },
                {
                    "first": "B.J.",
                    "middle": [],
                    "last": "Kullberg",
                    "suffix": ""
                },
                {
                    "first": "J.W.",
                    "middle": [],
                    "last": "Van der Meer",
                    "suffix": ""
                }
            ],
            "year": 2000,
            "venue": "Clin. Infect. Dis.",
            "volume": "31",
            "issn": "",
            "pages": "S178-S184",
            "other_ids": {
                "DOI": [
                    "10.1086/317513"
                ]
            }
        },
        "BIBREF70": {
            "title": "Early efforts in modeling the incubation period of infectious diseases with an acute course of illness",
            "authors": [
                {
                    "first": "H.",
                    "middle": [],
                    "last": "Nishiura",
                    "suffix": ""
                }
            ],
            "year": 2007,
            "venue": "Emerg. Themes. Epidemiol.",
            "volume": "4",
            "issn": "",
            "pages": null,
            "other_ids": {
                "DOI": [
                    "10.1186/1742-7622-4-2"
                ]
            }
        },
        "BIBREF71": {
            "title": "Incubation period as a clinical predictor of botulism: analysis of previous izushi-borne outbreaks in Hokkaido, Japan, from 1951 to 1965",
            "authors": [
                {
                    "first": "H.",
                    "middle": [],
                    "last": "Nishiura",
                    "suffix": ""
                }
            ],
            "year": 2006,
            "venue": "Epidemiol. Infect.",
            "volume": "135",
            "issn": "",
            "pages": "126-130",
            "other_ids": {
                "DOI": [
                    "10.1017/S0950268806006169"
                ]
            }
        },
        "BIBREF72": {
            "title": "Lessons from previous predictions of HIV/AIDS in the United States and Japan: epidemiologic models and policy formulation",
            "authors": [
                {
                    "first": "H.",
                    "middle": [],
                    "last": "Nishiura",
                    "suffix": ""
                }
            ],
            "year": 2007,
            "venue": "Epidemiol. Perspect. Innov.",
            "volume": "4",
            "issn": "",
            "pages": null,
            "other_ids": {
                "DOI": [
                    "10.1186/1742-5573-4-3"
                ]
            }
        },
        "BIBREF73": {
            "title": "Extracting key information from historical data to quantify the transmission dynamics of smallpox",
            "authors": [
                {
                    "first": "H.",
                    "middle": [],
                    "last": "Nishiura",
                    "suffix": ""
                },
                {
                    "first": "S.O.",
                    "middle": [],
                    "last": "Brockmann",
                    "suffix": ""
                },
                {
                    "first": "M.",
                    "middle": [],
                    "last": "Eichner",
                    "suffix": ""
                }
            ],
            "year": 2008,
            "venue": "Theor. Biol. Med. Model.",
            "volume": "5",
            "issn": "",
            "pages": null,
            "other_ids": {
                "DOI": [
                    "10.1186/1742-4682-5-20"
                ]
            }
        },
        "BIBREF74": {
            "title": "The earliest notes on the reproduction number in relation to herd immunity: Theophil Lotz and smallpox vaccination",
            "authors": [
                {
                    "first": "H.",
                    "middle": [],
                    "last": "Nishiura",
                    "suffix": ""
                },
                {
                    "first": "K.",
                    "middle": [],
                    "last": "Dietz",
                    "suffix": ""
                },
                {
                    "first": "M.",
                    "middle": [],
                    "last": "Eichner",
                    "suffix": ""
                }
            ],
            "year": 2006,
            "venue": "J. Theor. Biol.",
            "volume": "241",
            "issn": "",
            "pages": "964-967",
            "other_ids": {
                "DOI": []
            }
        },
        "BIBREF75": {
            "title": "Infectiousness of smallpox relative to disease age: estimates based on transmission network and incubation period",
            "authors": [
                {
                    "first": "H.",
                    "middle": [],
                    "last": "Nishiura",
                    "suffix": ""
                },
                {
                    "first": "M.",
                    "middle": [],
                    "last": "Eichner",
                    "suffix": ""
                }
            ],
            "year": 2007,
            "venue": "Epidemiol. Infect.",
            "volume": "135",
            "issn": "",
            "pages": "1145-1150",
            "other_ids": {
                "DOI": []
            }
        },
        "BIBREF76": {
            "title": "Estimates of short and long incubation periods of Plasmodium vivax malaria in the Republic of Korea",
            "authors": [
                {
                    "first": "H.",
                    "middle": [],
                    "last": "Nishiura",
                    "suffix": ""
                },
                {
                    "first": "H.W.",
                    "middle": [],
                    "last": "Lee",
                    "suffix": ""
                },
                {
                    "first": "S.H.",
                    "middle": [],
                    "last": "Cho",
                    "suffix": ""
                },
                {
                    "first": "W.G.",
                    "middle": [],
                    "last": "Lee",
                    "suffix": ""
                },
                {
                    "first": "T.S.",
                    "middle": [],
                    "last": "In",
                    "suffix": ""
                },
                {
                    "first": "S.U.",
                    "middle": [],
                    "last": "Moon",
                    "suffix": ""
                },
                {
                    "first": "G.T.",
                    "middle": [],
                    "last": "Chung",
                    "suffix": ""
                },
                {
                    "first": "T.S.",
                    "middle": [],
                    "last": "Kim",
                    "suffix": ""
                }
            ],
            "year": 2007,
            "venue": "Trans. R. Soc. Trop. Med. Hyg.",
            "volume": "101",
            "issn": "",
            "pages": "338-343",
            "other_ids": {
                "DOI": [
                    "10.1016/j.trstmh.2006.11.002"
                ]
            }
        },
        "BIBREF77": {
            "title": "Optimal vaccination schemes for epidemics among a population of households, with application to variola minor in Brazil",
            "authors": [
                {
                    "first": "F.",
                    "middle": [],
                    "last": "Ball",
                    "suffix": ""
                },
                {
                    "first": "O.",
                    "middle": [],
                    "last": "Lyne",
                    "suffix": ""
                }
            ],
            "year": 2006,
            "venue": "Stat. Methods. Med. Res.",
            "volume": "15",
            "issn": "",
            "pages": "481-497",
            "other_ids": {
                "DOI": []
            }
        },
        "BIBREF78": {
            "title": "Transmission potential of primary pneumonic plague: time inhomogeneous evaluation based on historical documents of the transmission network",
            "authors": [
                {
                    "first": "H.",
                    "middle": [],
                    "last": "Nishiura",
                    "suffix": ""
                },
                {
                    "first": "M.",
                    "middle": [],
                    "last": "Schwehm",
                    "suffix": ""
                },
                {
                    "first": "M.",
                    "middle": [],
                    "last": "Kakehashi",
                    "suffix": ""
                },
                {
                    "first": "M.",
                    "middle": [],
                    "last": "Eichner",
                    "suffix": ""
                }
            ],
            "year": 2006,
            "venue": "J. Epidemiol. Community. Health.",
            "volume": "60",
            "issn": "",
            "pages": "640-645",
            "other_ids": {
                "DOI": [
                    "10.1136/jech.2005.042424"
                ]
            }
        },
        "BIBREF79": {
            "title": "The use of mathematical models in the epidemiological study of infectious diseases and in the design of mass immunization programmes",
            "authors": [
                {
                    "first": "D.J.",
                    "middle": [],
                    "last": "Nokes",
                    "suffix": ""
                },
                {
                    "first": "R.M.",
                    "middle": [],
                    "last": "Anderson",
                    "suffix": ""
                }
            ],
            "year": 1988,
            "venue": "Epidemiol. Infect.",
            "volume": "101",
            "issn": "",
            "pages": "1-20",
            "other_ids": {
                "DOI": [
                    "10.1017/S0950268800029186"
                ]
            }
        },
        "BIBREF80": {
            "title": "",
            "authors": [
                {
                    "first": "M.",
                    "middle": [],
                    "last": "Nowak",
                    "suffix": ""
                },
                {
                    "first": "R.M.",
                    "middle": [],
                    "last": "May",
                    "suffix": ""
                }
            ],
            "year": 2000,
            "venue": "Virus Dynamics: Mathematical Principles of Immunology and Virology",
            "volume": "",
            "issn": "",
            "pages": null,
            "other_ids": {
                "DOI": []
            }
        },
        "BIBREF81": {
            "title": "Assessing vaccine efficacy in the field. Further observations",
            "authors": [
                {
                    "first": "W.A.",
                    "middle": [],
                    "last": "Orenstein",
                    "suffix": ""
                },
                {
                    "first": "R.H.",
                    "middle": [],
                    "last": "Bernier",
                    "suffix": ""
                },
                {
                    "first": "A.R.",
                    "middle": [],
                    "last": "Hinman",
                    "suffix": ""
                }
            ],
            "year": 1988,
            "venue": "Epidemiol. Rev.",
            "volume": "10",
            "issn": "",
            "pages": "212-241",
            "other_ids": {
                "DOI": []
            }
        },
        "BIBREF82": {
            "title": "",
            "authors": [
                {
                    "first": "W.",
                    "middle": [],
                    "last": "Pickles",
                    "suffix": ""
                }
            ],
            "year": 1939,
            "venue": "Epidemiology in Country Practice",
            "volume": "",
            "issn": "",
            "pages": null,
            "other_ids": {
                "DOI": []
            }
        },
        "BIBREF83": {
            "title": "Epidemiological studies in smallpox. A study of intrafamilial transmission in a series of 254 infected families",
            "authors": [
                {
                    "first": "A.R.",
                    "middle": [],
                    "last": "Rao",
                    "suffix": ""
                },
                {
                    "first": "E.S.",
                    "middle": [],
                    "last": "Jacob",
                    "suffix": ""
                },
                {
                    "first": "S.",
                    "middle": [],
                    "last": "Kamalakshi",
                    "suffix": ""
                },
                {
                    "first": "S.",
                    "middle": [],
                    "last": "Appaswamy",
                    "suffix": ""
                },
                {
                    "first": "",
                    "middle": [],
                    "last": "Bradbury",
                    "suffix": ""
                }
            ],
            "year": 1968,
            "venue": "Indian. J. Med. Res.",
            "volume": "56",
            "issn": "",
            "pages": "1826-1854",
            "other_ids": {
                "DOI": []
            }
        },
        "BIBREF84": {
            "title": "Model-consistent estimation of the basic reproduction number from the incidence of an emerging infection",
            "authors": [
                {
                    "first": "M.G.",
                    "middle": [],
                    "last": "Roberts",
                    "suffix": ""
                },
                {
                    "first": "J.A.",
                    "middle": [],
                    "last": "Heesterbeek",
                    "suffix": ""
                }
            ],
            "year": 2007,
            "venue": "J. Math. Biol.",
            "volume": "55",
            "issn": "",
            "pages": "803-816",
            "other_ids": {
                "DOI": [
                    "10.1007/s00285-007-0112-8"
                ]
            }
        },
        "BIBREF85": {
            "title": "Uncertainty in estimates of HIV prevalence derived by backcalculation",
            "authors": [
                {
                    "first": "P.S.",
                    "middle": [],
                    "last": "Rosenberg",
                    "suffix": ""
                },
                {
                    "first": "M.H.",
                    "middle": [],
                    "last": "Gail",
                    "suffix": ""
                }
            ],
            "year": 1990,
            "venue": "Ann. Epidemiol.",
            "volume": "1",
            "issn": "",
            "pages": "105-115",
            "other_ids": {
                "DOI": [
                    "10.1016/1047-2797(90)90002-A"
                ]
            }
        },
        "BIBREF86": {
            "title": "Comment: Neyman (1923) and causal inference in experiments and observational studies",
            "authors": [
                {
                    "first": "D.B.",
                    "middle": [],
                    "last": "Rubin",
                    "suffix": ""
                }
            ],
            "year": 1990,
            "venue": "Stat. Sci.",
            "volume": "5",
            "issn": "",
            "pages": "472-480",
            "other_ids": {
                "DOI": []
            }
        },
        "BIBREF87": {
            "title": "Virus excretion in smallpox. 1. Excretion in the throat, urine, and conjunctiva of patients",
            "authors": [
                {
                    "first": "J.K.",
                    "middle": [],
                    "last": "Sakar",
                    "suffix": ""
                },
                {
                    "first": "A.C.",
                    "middle": [],
                    "last": "Mitra",
                    "suffix": ""
                },
                {
                    "first": "M.K.",
                    "middle": [],
                    "last": "Mukherjee",
                    "suffix": ""
                },
                {
                    "first": "S.K.",
                    "middle": [],
                    "last": "De",
                    "suffix": ""
                },
                {
                    "first": "D.G.",
                    "middle": [],
                    "last": "Mazumdar",
                    "suffix": ""
                }
            ],
            "year": 1973,
            "venue": "Bull. World Health Organ.",
            "volume": "48",
            "issn": "",
            "pages": "517-522",
            "other_ids": {
                "DOI": []
            }
        },
        "BIBREF88": {
            "title": "Epidemics with two levels of mixing",
            "authors": [
                {
                    "first": "F.",
                    "middle": [],
                    "last": "Ball",
                    "suffix": ""
                },
                {
                    "first": "D.",
                    "middle": [],
                    "last": "Mollison",
                    "suffix": ""
                },
                {
                    "first": "G.",
                    "middle": [],
                    "last": "Scalia-Tomba",
                    "suffix": ""
                }
            ],
            "year": 1997,
            "venue": "Ann. Appl. Prob.",
            "volume": "7",
            "issn": "",
            "pages": "46-89",
            "other_ids": {
                "DOI": [
                    "10.1214/aoap/1034625252"
                ]
            }
        },
        "BIBREF89": {
            "title": "The distribution of incubation periods of infectious diseases",
            "authors": [
                {
                    "first": "P.E.",
                    "middle": [],
                    "last": "Sartwell",
                    "suffix": ""
                }
            ],
            "year": 1950,
            "venue": "Am. J. Hyg.",
            "volume": "51",
            "issn": "",
            "pages": "310-318",
            "other_ids": {
                "DOI": []
            }
        },
        "BIBREF90": {
            "title": "Evidence of the partial effects of inactivated Japanese encephalitis vaccination: analysis of previous outbreaks in Japan from 1953 to 1960",
            "authors": [
                {
                    "first": "K.",
                    "middle": [],
                    "last": "Satou",
                    "suffix": ""
                },
                {
                    "first": "H.",
                    "middle": [],
                    "last": "Nishiura",
                    "suffix": ""
                }
            ],
            "year": 2007,
            "venue": "Ann. Epidemiol.",
            "volume": "17",
            "issn": "",
            "pages": "271-277",
            "other_ids": {
                "DOI": [
                    "10.1016/j.annepidem.2006.10.003"
                ]
            }
        },
        "BIBREF91": {
            "title": "Infection transmission dynamics and vaccination program effectiveness as a function of vaccine effects in individuals.",
            "authors": [
                {
                    "first": "C.P.",
                    "middle": [],
                    "last": "Simon",
                    "suffix": ""
                },
                {
                    "first": "J.S.",
                    "middle": [],
                    "last": "Koopman",
                    "suffix": ""
                }
            ],
            "year": 2001,
            "venue": "Mathematical Approaches for Emerging and Reemerging Infectious Diseases : Models, Methods and Theory",
            "volume": "",
            "issn": "",
            "pages": "143-155",
            "other_ids": {
                "DOI": []
            }
        },
        "BIBREF92": {
            "title": "Factors in the transmission of virus infections from animal to man",
            "authors": [
                {
                    "first": "C.E.",
                    "middle": [],
                    "last": "Smith",
                    "suffix": ""
                }
            ],
            "year": 1964,
            "venue": "Sci. Basis. Med. Annu. Rev.",
            "volume": "i",
            "issn": "",
            "pages": "125-150",
            "other_ids": {
                "DOI": []
            }
        },
        "BIBREF93": {
            "title": "A note on generation time in epidemic models",
            "authors": [
                {
                    "first": "A.",
                    "middle": [],
                    "last": "Svensson",
                    "suffix": ""
                }
            ],
            "year": 2007,
            "venue": "Math. Biosci.",
            "volume": "208",
            "issn": "",
            "pages": "300-311",
            "other_ids": {
                "DOI": [
                    "10.1016/j.mbs.2006.10.010"
                ]
            }
        },
        "BIBREF94": {
            "title": "Maximum likelihood estimation of date of infection in an outbreak of diarrhea due to contaminated foods assuming lognormal distribution for the incubation period",
            "authors": [
                {
                    "first": "T.",
                    "middle": [],
                    "last": "Tango",
                    "suffix": ""
                }
            ],
            "year": 1998,
            "venue": "Jpn. J. Public. Health.",
            "volume": "45",
            "issn": "",
            "pages": "129-141",
            "other_ids": {
                "DOI": []
            }
        },
        "BIBREF95": {
            "title": "How generation intervals shape the relationship between growth rates and reproductive numbers",
            "authors": [
                {
                    "first": "J.",
                    "middle": [],
                    "last": "Wallinga",
                    "suffix": ""
                },
                {
                    "first": "M.",
                    "middle": [],
                    "last": "Lipsitch",
                    "suffix": ""
                }
            ],
            "year": 2007,
            "venue": "Proc. R. Soc. Lond. Ser. B.",
            "volume": "274",
            "issn": "",
            "pages": "599-604",
            "other_ids": {
                "DOI": [
                    "10.1098/rspb.2006.3754"
                ]
            }
        },
        "BIBREF96": {
            "title": "Different epidemic curves for severe acute respiratory syndrome reveal similar impacts of control measures",
            "authors": [
                {
                    "first": "J.",
                    "middle": [],
                    "last": "Wallinga",
                    "suffix": ""
                },
                {
                    "first": "P.",
                    "middle": [],
                    "last": "Teunis",
                    "suffix": ""
                }
            ],
            "year": 2004,
            "venue": "Am. J. Epidemiol.",
            "volume": "160",
            "issn": "",
            "pages": "509-516",
            "other_ids": {
                "DOI": [
                    "10.1093/aje/kwh255"
                ]
            }
        }
    }
}