{
    "paper_id": "PMC7087263",
    "metadata": {
        "title": "Studies on avian infectious bronchitis virus (IBV)",
        "authors": [
            {
                "first": "K.",
                "middle": [],
                "last": "Otsuki",
                "suffix": "",
                "email": null,
                "affiliation": {}
            },
            {
                "first": "H.",
                "middle": [],
                "last": "Yamamoto",
                "suffix": "",
                "email": null,
                "affiliation": {}
            },
            {
                "first": "M.",
                "middle": [],
                "last": "Tsubokura",
                "suffix": "",
                "email": null,
                "affiliation": {}
            }
        ]
    },
    "body_text": [],
    "ref_entries": {},
    "back_matter": [],
    "bib_entries": {
        "BIBREF0": {
            "title": "Susceptibility of viruses to ethyl ether",
            "authors": [
                {
                    "first": "C.",
                    "middle": [
                        "H."
                    ],
                    "last": "Andrews",
                    "suffix": ""
                },
                {
                    "first": "D.",
                    "middle": [
                        "M."
                    ],
                    "last": "Horstmann",
                    "suffix": ""
                }
            ],
            "year": 1949,
            "venue": "J. gen. Microbiol.",
            "volume": "3",
            "issn": "",
            "pages": "290-297",
            "other_ids": {
                "DOI": []
            }
        },
        "BIBREF1": {
            "title": "Sensitivity of various viruses to chloroform",
            "authors": [
                {
                    "first": "H.",
                    "middle": [
                        "A."
                    ],
                    "last": "Feldman",
                    "suffix": ""
                },
                {
                    "first": "S.",
                    "middle": [
                        "S."
                    ],
                    "last": "Wang",
                    "suffix": ""
                }
            ],
            "year": 1961,
            "venue": "Proc. Soc. exp. Biol.",
            "volume": "106",
            "issn": "",
            "pages": "736-738",
            "other_ids": {
                "DOI": []
            }
        },
        "BIBREF2": {
            "title": "A new virus isolated from the human respiratory tract",
            "authors": [
                {
                    "first": "D.",
                    "middle": [],
                    "last": "Hamre",
                    "suffix": ""
                },
                {
                    "first": "J.",
                    "middle": [
                        "J."
                    ],
                    "last": "Procknow",
                    "suffix": ""
                }
            ],
            "year": 1966,
            "venue": "Proc. Soc. exp. Biol.",
            "volume": "121",
            "issn": "",
            "pages": "190-193",
            "other_ids": {
                "DOI": []
            }
        },
        "BIBREF3": {
            "title": "Isolation and characteristics of avian nephrosis-inducing infectious bronchitis virus (coronavirus)",
            "authors": [
                {
                    "first": "K.",
                    "middle": [],
                    "last": "Hirai",
                    "suffix": ""
                },
                {
                    "first": "S.",
                    "middle": [],
                    "last": "Shimakura",
                    "suffix": ""
                }
            ],
            "year": 1971,
            "venue": "Jap. J. vet. Sci.",
            "volume": "33",
            "issn": "",
            "pages": "209-216",
            "other_ids": {
                "DOI": []
            }
        },
        "BIBREF4": {
            "title": "Stability of avian infectious bronchitis virus at 56\u00b0 C",
            "authors": [
                {
                    "first": "M.",
                    "middle": [
                        "S."
                    ],
                    "last": "Hofstad",
                    "suffix": ""
                }
            ],
            "year": 1956,
            "venue": "Cornell Vet.",
            "volume": "46",
            "issn": "",
            "pages": "122-128",
            "other_ids": {
                "DOI": []
            }
        },
        "BIBREF5": {
            "title": "Development and ether sensitivity of infectious bronchitis virus of chickens in cell cultures",
            "authors": [
                {
                    "first": "S.",
                    "middle": [
                        "B."
                    ],
                    "last": "Mohanty",
                    "suffix": ""
                },
                {
                    "first": "S.",
                    "middle": [
                        "C."
                    ],
                    "last": "Chang",
                    "suffix": ""
                }
            ],
            "year": 1963,
            "venue": "Amer. J. vet. Res.",
            "volume": "24",
            "issn": "",
            "pages": "822-826",
            "other_ids": {
                "DOI": []
            }
        },
        "BIBREF6": {
            "title": "Detection of neutralizing antibodies using several serological types of avian infectious bronchitis virus in a poultry farming area",
            "authors": [
                {
                    "first": "K.",
                    "middle": [],
                    "last": "Otsuki",
                    "suffix": ""
                },
                {
                    "first": "K.",
                    "middle": [],
                    "last": "Takahashi",
                    "suffix": ""
                },
                {
                    "first": "M.",
                    "middle": [],
                    "last": "Tsubokura",
                    "suffix": ""
                },
                {
                    "first": "K.",
                    "middle": [],
                    "last": "Itagaki",
                    "suffix": ""
                },
                {
                    "first": "S.",
                    "middle": [],
                    "last": "Nishio",
                    "suffix": ""
                }
            ],
            "year": 1976,
            "venue": "Japan. Poult. Sci.",
            "volume": "13",
            "issn": "",
            "pages": "20-25",
            "other_ids": {
                "DOI": []
            }
        },
        "BIBREF7": {
            "title": "Some properties of avian adenoviruses isolated from chickens with inclusion body hepatitis in Japan",
            "authors": [
                {
                    "first": "K.",
                    "middle": [],
                    "last": "Otsuki",
                    "suffix": ""
                },
                {
                    "first": "M.",
                    "middle": [],
                    "last": "Tsubokura",
                    "suffix": ""
                },
                {
                    "first": "H.",
                    "middle": [],
                    "last": "Yamamoto",
                    "suffix": ""
                },
                {
                    "first": "M.",
                    "middle": [],
                    "last": "Imamura",
                    "suffix": ""
                },
                {
                    "first": "Y.",
                    "middle": [],
                    "last": "Sakagami",
                    "suffix": ""
                },
                {
                    "first": "H.",
                    "middle": [],
                    "last": "Saio",
                    "suffix": ""
                },
                {
                    "first": "D.",
                    "middle": [],
                    "last": "Hosokawa",
                    "suffix": ""
                }
            ],
            "year": 1976,
            "venue": "Avian Dis.",
            "volume": "20",
            "issn": "",
            "pages": "694-705",
            "other_ids": {
                "DOI": []
            }
        },
        "BIBREF8": {
            "title": "The neutralization test for infectious bronchitis virus",
            "authors": [
                {
                    "first": "C.",
                    "middle": [
                        "A."
                    ],
                    "last": "Page",
                    "suffix": ""
                },
                {
                    "first": "C.",
                    "middle": [
                        "H."
                    ],
                    "last": "Cunningham",
                    "suffix": ""
                }
            ],
            "year": 1962,
            "venue": "Amer. J. vet. Res.",
            "volume": "23",
            "issn": "",
            "pages": "1065-1071",
            "other_ids": {
                "DOI": []
            }
        },
        "BIBREF9": {
            "title": "Physical-chemical treatment of inocula as a means of separating and identifying avian viruses",
            "authors": [
                {
                    "first": "C.",
                    "middle": [
                        "A."
                    ],
                    "last": "Quiroz",
                    "suffix": ""
                },
                {
                    "first": "R.",
                    "middle": [
                        "P."
                    ],
                    "last": "Hanson",
                    "suffix": ""
                }
            ],
            "year": 1958,
            "venue": "Avian Dis.",
            "volume": "2",
            "issn": "",
            "pages": "94-98",
            "other_ids": {
                "DOI": []
            }
        },
        "BIBREF10": {
            "title": "Simple method of estimating fifty percent endpoints",
            "authors": [
                {
                    "first": "L.",
                    "middle": [
                        "J."
                    ],
                    "last": "Reed",
                    "suffix": ""
                },
                {
                    "first": "H.",
                    "middle": [
                        "A."
                    ],
                    "last": "Muench",
                    "suffix": ""
                }
            ],
            "year": 1938,
            "venue": "Amer. J. Hyg.",
            "volume": "27",
            "issn": "",
            "pages": "493-497",
            "other_ids": {
                "DOI": []
            }
        },
        "BIBREF11": {
            "title": "A chemical basis for the classification of animal viruses",
            "authors": [
                {
                    "first": "P.",
                    "middle": [
                        "D."
                    ],
                    "last": "Cooper",
                    "suffix": ""
                }
            ],
            "year": 1961,
            "venue": "Nature",
            "volume": "190",
            "issn": "",
            "pages": "302-305",
            "other_ids": {
                "DOI": []
            }
        },
        "BIBREF12": {
            "title": "Physical and chemical characteristics of a local strain of infectious bronchitis virus IBV of poultry",
            "authors": [
                {
                    "first": "V.",
                    "middle": [
                        "P."
                    ],
                    "last": "Singh",
                    "suffix": ""
                },
                {
                    "first": "B.",
                    "middle": [
                        "S."
                    ],
                    "last": "Malik",
                    "suffix": ""
                },
                {
                    "first": "K.",
                    "middle": [
                        "C."
                    ],
                    "last": "Verma",
                    "suffix": ""
                }
            ],
            "year": 1974,
            "venue": "Indian J. Poult. Sci.",
            "volume": "9",
            "issn": "",
            "pages": "168-171",
            "other_ids": {
                "DOI": []
            }
        },
        "BIBREF13": {
            "title": "Direct and indirect complement-fixation tests for infectious bronchitis virus",
            "authors": [
                {
                    "first": "F.",
                    "middle": [
                        "M."
                    ],
                    "last": "Steele",
                    "suffix": ""
                },
                {
                    "first": "R.",
                    "middle": [
                        "E."
                    ],
                    "last": "Luginbuhl",
                    "suffix": ""
                }
            ],
            "year": 1964,
            "venue": "Amer. J. vet. Res.",
            "volume": "25",
            "issn": "",
            "pages": "1249-1255",
            "other_ids": {
                "DOI": []
            }
        },
        "BIBREF14": {
            "title": "Infekti\u00f6se Bronchitis der H\u00fchner IV. Charakterisierung eines neuen Feldstammes des IB-Virus (IBV-10)",
            "authors": [
                {
                    "first": "V.",
                    "middle": [],
                    "last": "von B\u00fclow",
                    "suffix": ""
                }
            ],
            "year": 1967,
            "venue": "Zbl. Vet.-Med.",
            "volume": "14",
            "issn": "",
            "pages": "151-162",
            "other_ids": {
                "DOI": []
            }
        },
        "BIBREF15": {
            "title": "Characteristics of an isolate of infectious bronchitis virus from chickens in Florida",
            "authors": [
                {
                    "first": "R.",
                    "middle": [
                        "W."
                    ],
                    "last": "Winterfield",
                    "suffix": ""
                },
                {
                    "first": "A.",
                    "middle": [
                        "M."
                    ],
                    "last": "Fadly",
                    "suffix": ""
                },
                {
                    "first": "J.",
                    "middle": [
                        "E."
                    ],
                    "last": "Hanley",
                    "suffix": ""
                }
            ],
            "year": 1971,
            "venue": "Avian Dis.",
            "volume": "15",
            "issn": "",
            "pages": "305-311",
            "other_ids": {
                "DOI": []
            }
        },
        "BIBREF16": {
            "title": "pH stability studies with avian infectious bronchitis virus (coronavirus) strains",
            "authors": [
                {
                    "first": "B.",
                    "middle": [
                        "S."
                    ],
                    "last": "Cowen",
                    "suffix": ""
                },
                {
                    "first": "S.",
                    "middle": [
                        "B."
                    ],
                    "last": "Hitchner",
                    "suffix": ""
                }
            ],
            "year": 1975,
            "venue": "J. Virol.",
            "volume": "15",
            "issn": "",
            "pages": "430-432",
            "other_ids": {
                "DOI": []
            }
        },
        "BIBREF17": {
            "title": "Characterization of a new infectious bronchitis virus isolate II. Some chemical and physical properties of Clark 333",
            "authors": [
                {
                    "first": "B.",
                    "middle": [
                        "S."
                    ],
                    "last": "Cowen",
                    "suffix": ""
                },
                {
                    "first": "S.",
                    "middle": [
                        "B."
                    ],
                    "last": "Hitchner",
                    "suffix": ""
                },
                {
                    "first": "T.",
                    "middle": [],
                    "last": "Ubertini",
                    "suffix": ""
                }
            ],
            "year": 1971,
            "venue": "Avian Dis.",
            "volume": "15",
            "issn": "",
            "pages": "527-532",
            "other_ids": {
                "DOI": []
            }
        },
        "BIBREF18": {
            "title": "Avian infectious bronchitis",
            "authors": [
                {
                    "first": "C.",
                    "middle": [
                        "H."
                    ],
                    "last": "Cunningham",
                    "suffix": ""
                }
            ],
            "year": 1970,
            "venue": "Advances in veterinary science and comparative medicine, Vol. 14",
            "volume": "",
            "issn": "",
            "pages": "105-148",
            "other_ids": {
                "DOI": []
            }
        },
        "BIBREF19": {
            "title": "Some studies of infectious bronchitis virus in cell culture",
            "authors": [
                {
                    "first": "C.",
                    "middle": [
                        "H."
                    ],
                    "last": "Cunningham",
                    "suffix": ""
                },
                {
                    "first": "M.",
                    "middle": [
                        "P."
                    ],
                    "last": "Spring",
                    "suffix": ""
                }
            ],
            "year": 1965,
            "venue": "Avian Dis.",
            "volume": "9",
            "issn": "",
            "pages": "182-193",
            "other_ids": {
                "DOI": []
            }
        },
        "BIBREF20": {
            "title": "The pH stability of the virus of infectious bronchitis of chickens",
            "authors": [
                {
                    "first": "C.",
                    "middle": [
                        "H."
                    ],
                    "last": "Cunningham",
                    "suffix": ""
                },
                {
                    "first": "H.",
                    "middle": [
                        "O."
                    ],
                    "last": "Stuart",
                    "suffix": ""
                }
            ],
            "year": 1947,
            "venue": "Cornell Vet.",
            "volume": "37",
            "issn": "",
            "pages": "99-103",
            "other_ids": {
                "DOI": []
            }
        },
        "BIBREF21": {
            "title": "Differentiation of quail bronchitis virus and infectious bronchitis virus by heat stability",
            "authors": [
                {
                    "first": "R.",
                    "middle": [
                        "T."
                    ],
                    "last": "DuBose",
                    "suffix": ""
                },
                {
                    "first": "L.",
                    "middle": [
                        "C."
                    ],
                    "last": "Grumbles",
                    "suffix": ""
                },
                {
                    "first": "A.",
                    "middle": [
                        "I."
                    ],
                    "last": "Flowers",
                    "suffix": ""
                }
            ],
            "year": 1960,
            "venue": "Amer. J. vet. Res.",
            "volume": "21",
            "issn": "",
            "pages": "740-743",
            "other_ids": {
                "DOI": []
            }
        },
        "BIBREF22": {
            "title": "Studies on the infectious bronchitis virus of chickens isolated in Finland",
            "authors": [
                {
                    "first": "T.",
                    "middle": [],
                    "last": "Estola",
                    "suffix": ""
                }
            ],
            "year": 1966,
            "venue": "Acta vet. Scand.",
            "volume": "18",
            "issn": "supplement",
            "pages": "1-111",
            "other_ids": {
                "DOI": []
            }
        }
    }
}