{
    "paper_id": "0435e76b6c0f0c7adc362a7df0667721beb14af0",
    "metadata": {
        "title": "Chapter 1 Vaccines and Vaccination for Veterinary Viral Diseases: A General Overview 1 Viral Diseases of Animals and the Need for Vaccination",
        "authors": [
            {
                "first": "Alejandro",
                "middle": [],
                "last": "Brun",
                "suffix": "",
                "affiliation": {},
                "email": ""
            }
        ]
    },
    "abstract": [
        {
            "text": "A high number of infectious diseases affecting livestock and companion animals are caused by pathogens of viral etiology. Ensuring the maximum standards of quality and welfare in animal production requires developing effective tools to halt and prevent the spread of those infectious diseases affecting animal husbandry. To date, one of the best strategies is to implement vaccination policies whenever possible. However many of the currently manufactured vaccines relies in classical vaccine technologies (killed or attenuated vaccines) which, under some circumstances, may not be optimal in terms of safety or adequate for widespread application in disease-free countries at risk of disease introduction. One step ahead is needed to improve and adapt vaccine manufacturing to the use of new generation vaccine technologies already tested in experimental settings. Here we present in the context of animal viral diseases of veterinary interest, an overview of some current vaccine technologies that can be approached for virus pathogens with a brief insight in the type of immunity elicited.",
            "cite_spans": [],
            "ref_spans": [],
            "section": "Abstract"
        }
    ],
    "body_text": [
        {
            "text": "One of the biggest transformations in history occurred when mankind shifted from a hunter-gatherer to an agricultural lifestyle. During millenniums livestock and companion species (ruminants, swine, poultry, cats and dogs) were domesticated and raised fi rst for survival (in this sense the word \"livestock\" is meaningful) then for profi t and commerce. Since then, animal husbandry evolved as one of the most important activities for civilization and development. The importance of such activity is obvious since a proper management of land use and animal resources is always required to avoid malnutrition and famine in developing countries or in countries where intensive farming is essential for subsistence. The explosive growth rate of the world's human population complicates this picture (particularly in developing countries) so other sources of dietary consumption, such as farmed fi sh, will be more demanded in the near future. Inevitably, the intensive farming of animal species leads to the onset of diseases mainly caused by propagation of infectious pathogens, affecting animal welfare, reducing productivity, and in the worst cases, seriously undermining the economy of nations. In some cases, livestock or animal pathogens can also cause disease in humans, so means to control and eradicate them have to be implemented.",
            "cite_spans": [],
            "ref_spans": [],
            "section": "Viral Diseases of Animals and the Need for Vaccination"
        },
        {
            "text": "Among the plethora of infectious diseases in animals, those of viral etiology account for a high burden of cases and are among the most relevant from a veterinary perspective. In fact, approximately half of the most important animal diseases are caused by viruses, according to the OIE's classifi cation for terrestrial and aquatic notifi able animal diseases ( see Table 1 ). The listed viral diseases comprise virus from 22 different viral families and four families of virus (herpesvirus, rhabdovirus, poxvirus and paramyxovirus) concentrate a high number of diseases ( Fig. 1 ) . Several of the listed animal virus diseases can be also transmitted to humans (zoonotic diseases) either by direct contact with infected animals, infected animal tissues and fl uids or by means of arthropod vectors, impacting both public health and food security. Thus, preventing transmission of infectious diseases at the animal-human interface is important for protecting the world population from both epizootics and pandemics, constituting the basis for the \"One Health\" concept [ 1 , 2 ] . Prevention by vaccination remains as one of the most cost-effective intervention strategies against infectious diseases. For most of the listed diseases there are \"licensed\" or available vaccines, eventually obtained by \"classical\" production methodologies. An important exception is that of diseases caused by retroviruses, for which classical vaccine technologies have not been successful, and that of aquatic diseases, for which only vaccines for fi sh have been so far developed. In some cases the effi cacy of vaccination against viral diseases of animals has been very successful, as it can be illustrated by the eradication of rinderpest [ 3 ] (probably the most deadly disease of cattle and ruminants, caused by a morbillivirus) by the use of an attenuated/avirulent strain of the causative virus. Recent evidences advice to support efforts to control emerging viral pathogens where they primarily occur, in order to avoid uncontrolled spread of deadly viruses [ 4 ] . Within this perspective, some technologies for vaccine design may constitute powerful platforms to rapidly generate new experimental vaccines based on previous knowledge about the immune responses generated in the host. ",
            "cite_spans": [
                {
                    "start": 1068,
                    "end": 1077,
                    "text": "[ 1 , 2 ]",
                    "ref_id": null
                },
                {
                    "start": 1725,
                    "end": 1730,
                    "text": "[ 3 ]",
                    "ref_id": "BIBREF2"
                },
                {
                    "start": 2049,
                    "end": 2054,
                    "text": "[ 4 ]",
                    "ref_id": "BIBREF3"
                }
            ],
            "ref_spans": [
                {
                    "start": 366,
                    "end": 373,
                    "text": "Table 1",
                    "ref_id": "TABREF0"
                },
                {
                    "start": 573,
                    "end": 581,
                    "text": "Fig. 1 )",
                    "ref_id": "FIGREF0"
                }
            ],
            "section": "Viral Diseases of Animals and the Need for Vaccination"
        },
        {
            "text": "The objective of vaccination is to achieve a specifi c stimulation of the immune system enabling the host to mount an effi cient (and desirably long-lived) memory immune response that can recognize the pathogen and eventually eliminate it once is present in the organism upon infection. This can be achieved providing the appropriate antigenic stimulus (the vaccine) to activate cellular mechanisms involved in recognition of the nonself. Thus, an efficient vaccine needs to be recognized as a nonself entity and, ideally, be able to stimulate innate immune responses that further \"instruct\" subsequent adaptive and memory responses. The fi rst step is carried out either by infected or by specialized phagocytic cells (antigen presenting cells or APCs, including macrophages and dendritic cells) able to present antigenic determinants to n\u00e4ive (B and T) lymphocytes (Fig. 2 ) . Though the innate immune response is broadly reactive and unspecifi c it strongly conditions the magnitude and the composition of the specifi c (adaptive or acquired) immune responses. Cellular pathogen recognition receptors (cPRRs) either membrane bound (Toll-like-, C-type lectin-and scavenger receptors) or cytosolic (NOD-like and RIG-like receptors) of phagocytes eventually bind to pathogen associated molecular patterns (PAMPs) carried on infecting microbes [ 5 ] . In particular, encountering of pathogenic virus ligands (such as single or double stranded RNA) to intracellular PRRs activates the phagocytic cells from a normal quiescent state by inducing NF\u03baB-mediated gene transcription of a number of co-stimulatory molecules, proinfl ammatory cytokines and chemokines as well as IRF-mediated transcription of type I-interferons (IFNs) and other cytokines such as IL-1\u03b2 and TNF-\u03b1 [ 6 ] . Other immune cell types such as the natural killer (NK) cells express functional TLRs specifi cally for detecting viral PAMPs and can be also activated by type-I interferons [ 7 ] . NK cells can eliminate cells in which expression of MHC molecules is reduced upon viral infection. NK cells secrete IFN-\u03b3 which in turn can enhance the phagocytic activity of macrophages and antigen presentation by mature dendritic cells (DCs), a key player in the bridging of innate and adaptive immunity. DCs signaling to na\u00efve lymphocytes will determine whether these cells should be eventually involved in fi ghting against the viral infection. This fact is exploited by those vaccines based in attenuated viruses or in replicating live virus vectors where the initiation of innate immune responses greatly aug-",
            "cite_spans": [
                {
                    "start": 1343,
                    "end": 1348,
                    "text": "[ 5 ]",
                    "ref_id": "BIBREF4"
                },
                {
                    "start": 1769,
                    "end": 1774,
                    "text": "[ 6 ]",
                    "ref_id": "BIBREF5"
                },
                {
                    "start": 1951,
                    "end": 1956,
                    "text": "[ 7 ]",
                    "ref_id": null
                }
            ],
            "ref_spans": [
                {
                    "start": 867,
                    "end": 876,
                    "text": "(Fig. 2 )",
                    "ref_id": null
                }
            ],
            "section": "Immunology Matters"
        },
        {
            "text": "MHC antigen processing and presentation PAMP-PRR interaction & co-stimularory signalling Fig. 2 The cellular cooperation in the immune response. After vaccination, specialized phagocytes present the processed antigens to n\u00e4ive B or T-cells that may become activated only if proper co-stimulatory signals are produced (derived from the interaction of PAMPs with cellular PRRs). Activation drives lymphocytes to secrete soluble mediators and antibodies initiating infl ammatory responses (adapted from [ 33 ] ) ments the quality and magnitude of the adaptive response in contrast to that elicited by vaccines based on inert antigens (inactivated virus or subunit vaccines). Recently, the central role of dendritic cells or APCs in regulating the immune response has made antigen targeting to these cells a major subject for specifi c immune stimulation aimed to improve vaccine effi cacy as well as other forms of immunotherapy [ 8 , 9 ] .",
            "cite_spans": [
                {
                    "start": 500,
                    "end": 506,
                    "text": "[ 33 ]",
                    "ref_id": null
                },
                {
                    "start": 926,
                    "end": 935,
                    "text": "[ 8 , 9 ]",
                    "ref_id": null
                }
            ],
            "ref_spans": [
                {
                    "start": 89,
                    "end": 95,
                    "text": "Fig. 2",
                    "ref_id": null
                }
            ],
            "section": "Phagocytes (dendritic cells & macrophages)"
        },
        {
            "text": "Upon n\u00e4ive lymphocyte activation by interaction with DCs the specifi city of the immune response is granted and clonal expansion of B and T-cells capable of recognizing the specifi c antigen will take place. A pool of specifi c lymphocytes containing memory and effector cells will be expanded as a primary response to the vaccine stimulus. Upon infection and virus antigen encounter the secondary response will be greatly increased, potentially leading to protection and long-lived immunity by specifi c effector and memory cells (Fig. 3 ) . Therefore, the two main principles to be exploited by vaccines are necessarily specifi city and memory. When designing vaccines the issue of specifi city is crucial for the success of a vaccine and can be approached by an adequate selection of the antigen fraction, whole antigen or antigens of choice, being able to recall the memory lymphocyte pools produced in the primary responses after vaccination. Previous identifi cation of the correlates of protective immunity upon infection is one of the logical approaches for vaccine design, for example including relevant epitopes that induce neutralizing antibodies made upon infection and/or the key T-cell epitopes responsible for helper or cytotoxic functions [ 10 ] . Ideally, this knowledge should be derived from the pathogenesis of viral infection in the target species to which the vaccine is intended for but unfortunately these type of studies are often more diffi cult to perform than in laboratory animals (mainly due to genetic diversity of the outbred species, the lack of reagents and markers for cell phenotype characterization, and the limitation in the number of animals used for experimentation). Nonetheless, in some cases the pathogenesis of other animal models of disease (mainly rodents), correlates well enough with that of the target species and valuable information can be obtained about the immune mechanisms of protection. After the knowledge gathered in the past decades of virus research it becomes evident that, in a general sense, for virus with less complex pathogenesis a successful immunoprophylaxis could be obtained by the generation of an immune response against surface antigens displayed on virions and/or virus infected cells. For other virus (for example poxvirus, herpesvirus, asfi virus, respiratory viruses, and lentivirus) that have developed more complex pathogenesis (i.e., induction of persistence, replication in immune privileged tissues, using immune evasion strategies, induction of harmful host immune responses) the effective vaccine should elicit, in addition to neutralizing antibodies, specifi c T-cell responses [ 11 ] .",
            "cite_spans": [
                {
                    "start": 1255,
                    "end": 1261,
                    "text": "[ 10 ]",
                    "ref_id": "BIBREF9"
                },
                {
                    "start": 2663,
                    "end": 2669,
                    "text": "[ 11 ]",
                    "ref_id": "BIBREF10"
                }
            ],
            "ref_spans": [
                {
                    "start": 531,
                    "end": 540,
                    "text": "(Fig. 3 )",
                    "ref_id": "FIGREF1"
                }
            ],
            "section": "Phagocytes (dendritic cells & macrophages)"
        },
        {
            "text": "A fi rst classifi cation of vaccines has been outlined above with respect to the level of immunogenicity elicited (inactivated/killed non-infectious versus live attenuated vaccines). Therefore two broad categories of antiviral vaccines can be considered with respect to the nature of the virus used (live or death) or the relevant antigen (whole or fractionated); in fact all licensed vaccines against viral diseases available to date (both for the medical and veterinary use) could fall in either one of these categories. This dichotomy helps to categorize vaccines into four general types (Table 2 ).",
            "cite_spans": [],
            "ref_spans": [
                {
                    "start": 591,
                    "end": 599,
                    "text": "(Table 2",
                    "ref_id": "TABREF1"
                }
            ],
            "section": "Vaccine Technologies"
        },
        {
            "text": "In this categorization type I vaccines include those produced by means of inactivating methodologies while type II vaccines include all attenuated virus used as vaccines, including those generated by reverse genetics. Type III and IV vaccines include those in which only components or a fraction of the pathogen is used as the vaccine antigen. Thus, type III vaccines would include subunit vaccines, including carrier micro/nanoparticle and virus-like particles (VLPs) vaccines produced by recombinant technologies in both prokaryotic and eukaryotic cells and inactivated recombinant vectors expressing heterologous vaccine antigens. In this category, both nucleic acid vaccines as well as peptide based vaccines could be also included. Finally, the type IV vaccines are those delivered by a live viral vector that codes and expresses particular (selected) heterologous vaccine antigens. Obviously, from all these categories further classifi cations can be made, depending on the formulation of the vaccine (for example, inactivated vaccines can be subdivided into those composed of whole inactivated infected cultures or purifi ed virus fractions), and the type of adjuvant used to augment the immune responses. Attenuated vaccines could include those natural virus isolates with reduced virulence, or attenuated virus generated by serial passages, or virus rescued by means of a reverse genetics approach. Nucleic acid vaccines can be based on DNA plasmids or self-replicating RNA molecules launched by a DNA plasmid encoding a viral replicon. For each technology several methodologies for production or antigen expression can be used and further modifi cations and formulations applied, therefore the potential combinations that can be tested experimentally are many. The choice of one or another may depend on the experimental (preclinical) data obtained in models of infection if available. Further classifi cation of vaccine technologies could be done on the basis of the main type of immunity provided (mucosal, systemic, humoral or cellular), preferred delivery method (oral, parenteral) or prime-boost combination ( see Table 3 ).",
            "cite_spans": [],
            "ref_spans": [
                {
                    "start": 2129,
                    "end": 2136,
                    "text": "Table 3",
                    "ref_id": "TABREF2"
                }
            ],
            "section": "Vaccine Technologies"
        },
        {
            "text": "Inactivated (killed) antiviral vaccines have being used for long and are based on the disruption of the ability of a virus to replicate by generally chemical or physical methods. Among chemical methods used, formaldehyde and organic compounds such as cyclic esters (\u03b2-propiolactone) or binary ethylenimine (BEI) have been most widely used. Other cross-linking agents such as glutaraldehyde can be an option for the inactivation but its use has not been as wide as formaldehyde. Two main caveats of the use of cross-linking agents for vaccine preparation can be cited; the fi rst one is the potential for aggregation leading to disruption or modifi cation of antigenic epitopes possibly accounting for the reduced immunogenicity of these vaccines, usually requiring two or three booster doses to maintain adequate and lasting levels of protective immunity. Another problem is the risk for incomplete inactivation leading to exacerbation of disease if the partially (or suboptimal) induced immunity cooperates with infectivity by mechanisms such as antibody dependent enhancement (ADE). In this case, monocytes or macrophages (Fc-receptors bearing cells) can be infected by virus complexed to non-neutralizing antibodies, a process described in dengue virus infections [ 12 ] . Finally, another issue with inactivated vaccines is overcoming the differentiation of infected and vaccinated animals not to interfere with the surveillance diagnostics. While formaldehyde reacts primarily with proteins, \u03b2-propiolactone (BPL) and binary ethylenimine (BEI) modify mainly DNA or RNA so BPL is expected to maintain a high immunogenicity during the inactivation of viruses. However it has been reported that BPL may also and react to some amino acids including cysteine, methionine, and histidine so certain modifi cation of proteins may also affect the immunogenicity of BPL vaccines. Similarly BEI has been also shown to react with proteins [ 13 ] . This compound is used widely for the inactivation of foot and mouth disease virus (FMDV) in the preparation of vaccines. Nonetheless, inactivated vaccines remain as a leading methodology for vaccine production (both for human and veterinary use) in part due to the effectiveness of adjuvants (mainly aluminum salts) in the vaccine formulations overcoming the main issue of limited immunity. In fact, this technology may benefi t from other inactivation approaches such as the use of hydrogen peroxide or protonating compounds, such as diethylpyrocarbonate (DEPC). Hydrogen peroxide could inactivate both DNA and RNA viruses (vaccinia virus, LCMV, WNV and YFV) with little damage to the antigenic structure, thus minimizing the effect on immunogenicity. More interestingly, this inactivation approach rendered vaccines able to induce both humoral (neutralizing antibodies) and cellular immune responses including WNV and LCMV specifi c CD8+ cytotoxic T-cells [ 14 , 15 ] . Using a histidine-protonating agent such as DEPC it was reported the abolishment of vesicular stomatitis virus (VSV) infectivity and pathogenicity in mice. These animals survived a further lethal challenge and this protection was associated to the induction of neutralizing antibodies [ 16 ] although no further reports have arose since the fi rst description. In spite of the advances made in different technologies for stimulating the immune responses the classic inactivation methodology is still broadly used to manufacture many vaccines for veterinary use, in part since manufacturers need to balance carefully the investment needed to adapt their traditional manufacturing processes to the new technologies and the expected profi tability. Other classical inactivation techniques by physical methods have been exposure to several types of radiation: thermal, electromagnetic or ionizing. UV radiation has been one of the most used in human vaccine manufacturing.",
            "cite_spans": [
                {
                    "start": 1267,
                    "end": 1273,
                    "text": "[ 12 ]",
                    "ref_id": "BIBREF11"
                },
                {
                    "start": 1932,
                    "end": 1938,
                    "text": "[ 13 ]",
                    "ref_id": "BIBREF12"
                },
                {
                    "start": 2899,
                    "end": 2910,
                    "text": "[ 14 , 15 ]",
                    "ref_id": null
                },
                {
                    "start": 3198,
                    "end": 3204,
                    "text": "[ 16 ]",
                    "ref_id": null
                }
            ],
            "ref_spans": [],
            "section": "Type I Vaccine Technologies"
        },
        {
            "text": "Live attenuated virus vaccines are among the most successful forms of vaccines particularly with regards to immunogenic character. The ability to replicate makes these vaccines stronger inducers of innate responses, a feature that critically may infl uence the outcome of the acquired immune responses as discussed above. Several veterinary and companion animal vaccines are based on attenuated viruses and these types of vaccines are used in the human side as well. The common feature shared by attenuated virus vaccines is the lost of virulence factors while the immunogenicity is maintained. Traditional methods for development of attenuated vaccines were the serial passage or propagation of the virus in heterologous cell cultures or in brain tissue from rodents, suckling mice, rabbits or goats, in particular for veterinary use. Propagation in different tissue usually ends up with a change of tropism. For example, hepatotropic viruses passaged in brain tissues were unable to replicate in liver though acquired neurovirulence. A different approach is to induce mutations with mutagenic compounds such us nucleoside analogous. Temperature sensitive mutants grown at lower temperatures were then unable to replicate at normal temperatures in the hosts. The main advantages of attenuated vaccines over inactivated or killed vaccines or subunit vaccines can be related with a wider presentation of epitopes since, obviously, more proteins will be expressed as a consequence of virus replication into the infected host cell (in the infected cell protein fragments will be presented through MHC-I), and also with the possibility of administration by similar or natural routes of infection (i.e., nasal/mucosal route for infl uenza vaccines). The immune responses elicited are also similar to that of infections, including triggering of innate immune responses, as well as humoral and/or cellular responses. Importantly, the costs of generation and manufacturing these types of vaccines are usually affordable for the veterinary vaccine markets. On the other side, possible disadvantages of attenuated virus vaccines are the genetic instability, allowing reversion to virulence or lost of replicating phenotype, problems related with immunosuppressed individuals, or deleterious effects of some attenuated vaccines when used in gestating animals. This usually accounts for those vaccines obtained by methods in which the inactivation process is not fully controllable or understood (i.e., serial propagation in tissue culture). Table 4 summarizes advantages and disadvantages between killed and attenuated vaccines. For diseases affecting several species a vaccine that is safe for a specifi c ruminant host might not be safe for swine. In general terms it is generally accepted that inactivated vaccines offer less safety problems than attenuated vaccines. Advances in the knowledge of pathogen biology, immunology and molecular biology allowed to carry out more rational vaccine designs so novel alternatives to the attenuated type of vaccines have been developed. Particularly for RNA viruses, the generation of reverse genetic systems (i.e., the ability to rescue fully infectious virus from cloned viral genomes and transcripts) [ 17 ] has allowed to develop novel attenuated vaccines with enhanced safety features. For DNA viruses defi ning virulence and/or immunomodulatory genes allowed its deletion by homologous recombination techniques [ 18 ] In most of the cases the modifi cation of these genomes allowed the introduction to these vaccines of an important characteristic for veterinary vaccines: the possibility of differentiate infected from [ 19 ] . This is particularly important when surveillance diagnostic is implemented for example to maintain the condition of a disease-free country.",
            "cite_spans": [
                {
                    "start": 3236,
                    "end": 3242,
                    "text": "[ 17 ]",
                    "ref_id": "BIBREF16"
                },
                {
                    "start": 3449,
                    "end": 3455,
                    "text": "[ 18 ]",
                    "ref_id": "BIBREF17"
                },
                {
                    "start": 3658,
                    "end": 3664,
                    "text": "[ 19 ]",
                    "ref_id": "BIBREF18"
                }
            ],
            "ref_spans": [
                {
                    "start": 2530,
                    "end": 2537,
                    "text": "Table 4",
                    "ref_id": "TABREF3"
                }
            ],
            "section": "Type II Vaccine Technologies"
        },
        {
            "text": "Once identifi ed, protective antigen fractions or components from whole pathogens can be isolated and/or produced by cloning and expression in heterologous systems (bacterial, yeast, plant, eukaryotic cell). We include in this category both subunit particulate and nucleic acid vaccines. With this approach the specifi city of the immune response generated is maximized but the magnitude of the immune response tends to be lower than that of attenuated vaccines. Thus, immune adjuvants, targeting strategies or prime boost regimens might be considered to enhance the immune responses.",
            "cite_spans": [],
            "ref_spans": [],
            "section": "Type III Vaccine Technologies"
        },
        {
            "text": "Subunit vaccines have several advantages over conventional attenuated vaccines in particular regarding safety and production. Most used systems to produces subunit vaccines are based on bacteria, yeast, insect or mammalian cells. More recently other systems based on non-fermentative approaches such as live organisms have been developed, particularly plants or insects. In plants two main alternatives have been developed, either genetically modifi ed or expressing transiently antigens encoded by plant virus or bacterial vectors. In live insects (Lepidoptera) recombinant baculoviruses can be used to infect insect larvae and transgenic silkworms can be also generated (reviewed in [ 20 ] ). A particular feature of subunit vaccines is the possibility of generation of virus like particles (VLPs) by co-expression of capsid proteins constituent of virions, but devoid of ribonucleoproteins. Like the viral capsids, the VLPs are composed of a geometrically arranged array of proteins, forming repetitive structures against which soluble antibodies and/or B-cell receptors can interact with high avidity. These structures are thus good inductors of T-cell independent responses. In addition the VLPs can be also internalized and processed by APCs to induce both Th and CTL responses, therefore having the potential to stimulating broader immune responses than monomeric forms of protein subunits. Another advantage of VLPs is that they can be produced in a variety of expression systems (baculovirus, poxvirus, alphavirus replicons, plants, Salmonella, E. coli, yeasts, and so on) and can be engineered in order to even express foreign epitopes or immune-stimulatory molecules in the form of chimeric-VLPs, or by covalent linking of immunomodulators (either linear or cyclic peptides, haptens, glycans). VLPs can be obtained from enveloped viruses by budding from cells expressing the VLP components (such in the case of infl uenza virus). A more specialized technique is the reconstitution of viral envelopes in unilamelar liposomes, termed virosomes. These synthetic structures can be also complemented with immune-stimulatory conjugates or even heterologous molecules such as DNA, siRNA, antibody fragments (reviewed in [ 20 ] ). Perhaps from the veterinary vaccine perspective, the generation of VLP subunit vaccines and derivatives is being hampered by the higher costs for production precluding a more generalized use as a vaccine production technology.",
            "cite_spans": [
                {
                    "start": 685,
                    "end": 691,
                    "text": "[ 20 ]",
                    "ref_id": "BIBREF19"
                },
                {
                    "start": 2224,
                    "end": 2230,
                    "text": "[ 20 ]",
                    "ref_id": "BIBREF19"
                }
            ],
            "ref_spans": [],
            "section": "Type III Vaccine Technologies"
        },
        {
            "text": "Instead of using whole proteins as antigens, immunogenic epitopes previously identifi ed allows to design synthetic peptides to direct more specifi cally the immune response. Known B and T-cell peptides and combinations can be included in a peptide vaccine design [ 21 ] . One of the advantages of peptides over subunit protein vaccines is the simple production, storage and distribution, as well as the fl exibility to introduce modifi cations or mutations (for those highly changing viruses). In spite of these advantages, peptide vaccination is not yet a generalized approach since it needs a deeper knowledge of the protective immune responses in the host species and the intrinsic lower immunogenicity of peptides over whole proteins. However immunogenicity can be enhanced by multimerization strategies [ 22 ] or by the use of micro/nano particulate delivery of covalently attached peptides including or not targeting signals to facilitate interaction with immune cell receptors.",
            "cite_spans": [
                {
                    "start": 264,
                    "end": 270,
                    "text": "[ 21 ]",
                    "ref_id": "BIBREF20"
                },
                {
                    "start": 809,
                    "end": 815,
                    "text": "[ 22 ]",
                    "ref_id": "BIBREF21"
                }
            ],
            "ref_spans": [],
            "section": "Type III Vaccine Technologies"
        },
        {
            "text": "Genetic vaccines were discovered upon gene therapy experiments by Wolff and Felgner when intended to deliver DNA into muscle cells by using cationic lipids containing DNA [ 23 ] . In fact DNA uptake was produced even in the absence of lipids and expressed the encoded protein. Thus transcriptional units encoding HA antigens were placed under control of a viral promoter (CMV) so a DNA vaccine against infl uenza was fi rst described in 1993 [ 24 ] . Usually DNA vaccines are delivered by intramuscular or intradermal injections. In the fi rst case muscle cells can be directly transfected and express the protein. Dendritic cells present in the interstitial spaces could uptake the soluble antigen, or take up cells killed by the vaccine, or even being transfected directly. On the other hand, the cytosolic expression of the protein enables its MHC-I processing in either muscle or dendritic cells. MHC upregulation is one of the consequences of innate immunity stimulation by unmethylated CpG motifs upon TLR-9 receptor engagement. The main advantages of DNA vaccines are the ease to design and produce, allows differentiation of vaccinated and infected animals (DIVA), antigen is processed naturally, mimicking the immune response induced by virus replication thus stimulating the development of both cellular and humoral immune response. Finally, as with other vaccine strategies, DNA allows combining several antigens, targeting signals, or immunostimulatory molecules (cytokines and chemokines) to improve the immune response elicited. DNA vaccination has been so far successful in mice models of disease. The only DNA vaccines licensed to date have been against WNV in horses and VHS in salmonids [ 20 ] . However, experimental DNA vaccination in large animals against livestock viral diseases still needs further optimization in order to achieve stronger immune responses (the amount of plasmid needed for immunization may represent a serious disadvantage). This handicap could be addressed by the use of stronger promoters, replicon based plasmids (Alphavirus), increasing plasmid uptake effi ciency or by co-delivery of immune-stimulatory molecules. Nonetheless, it remains a very attractive way for a rationale design of vaccines, combining the simplicity of production and the potential use in combined vaccine approaches such as prime boost.",
            "cite_spans": [
                {
                    "start": 171,
                    "end": 177,
                    "text": "[ 23 ]",
                    "ref_id": "BIBREF22"
                },
                {
                    "start": 442,
                    "end": 448,
                    "text": "[ 24 ]",
                    "ref_id": "BIBREF23"
                },
                {
                    "start": 1705,
                    "end": 1711,
                    "text": "[ 20 ]",
                    "ref_id": "BIBREF19"
                }
            ],
            "ref_spans": [],
            "section": "Type III Vaccine Technologies"
        },
        {
            "text": "Recombinant viral vectors constitute a very important platform for vaccine design and experimental vaccination approaches. Virtually any infectious, non-pathogenic, virus can be used to express foreign genes, provided a system for recombinant incorporation and expression has been developed. This has been achieved for different RNA viruses that were previously attenuated by using reverse genetics systems or in DNA virus by means of homologous recombination techniques. Among the DNA viruses used to deliver vaccine antigens Poxvirus (from both orthopoxvirus and parapoxvirus genus), Herpesvirus, Adenovirus and Baculovirus have been the most widely used in experimental vaccine trials. The main advantage of DNA viruses over RNA viruses is related with the higher stability of DNA genomes, greater insertional sites and availability of BAC-DNA clones available making engineering and rescuing of recombinant virus a conventional laboratory task. Additional features include the cytoplasmic replication (with the exception of herpesviruses) and the induction of long lived humoral and cellular immune responses, with emphasis on the strong CD8-T-cell activation that is mediated by attenuated poxvirus and adenovirus infections. On the RNA virus side, several viruses from different families have been used as foreign gene carriers: Alphavirus, Bunyavirus, Coronavirus, Flavivirus, Paramyxovirus, Retroviruses, Rhabdovirus [ 25 ] . This has been possible by the establishment of reverse genetics technologies allowing the rescue of infectious virus from a copy of its genome. Paramyxoviruses are very potent inducers of humoral and cellular immune responses conferring complete long-life protection when used as attenuated vaccines. They allow interchange of nucleoproteins or envelope glycoproteins between related family members giving rise to chimeric viruses for use as bivalent marker attenuated vaccines. In addition they can accommodate additional genetic information for expression of foreign antigens maintaining stability during propagation in cell culture, therefore they can be used also to immunize against pathogenic paramyxovirus and other infectious agents [ 25 ] . Attenuated rhabdoviruses (generated by manipulation of the viral glycoprotein and phosphoprotein and/or genome order rearrangement) offer similar characteristics for use as a vector for delivery of foreign genes, including the induction of innate and adaptive immune responses. One additional advantage of this type of vectors is the absence of seropositivity in both human and animal populations [ 25 ] . Replication defi cient alphavirus have been also modifi ed to express foreign antigens for use as vaccines, and in cancer and gene therapy studies. An interesting characteristic of alphaviruses is the induction of mucosal protective immune responses [ 26 , 27 ] . For some bunyavirus the identifi cation of virulence genes nonessential for growth in vitro allowed replacement for reporter genes or other viral antigens [ 28 , 29 ] . As attenuated viruses they are capable of sustain limited replication in the host's enabling the initiation of innate immune responses against the transgene. All this examples outline the number of strategies than can be selected when designing attenuated vector vaccines as well as the possibility to design marker vaccines to elicit protection against several virus pathogens simultaneously (multivalent vaccines).",
            "cite_spans": [
                {
                    "start": 1425,
                    "end": 1431,
                    "text": "[ 25 ]",
                    "ref_id": "BIBREF24"
                },
                {
                    "start": 2175,
                    "end": 2181,
                    "text": "[ 25 ]",
                    "ref_id": "BIBREF24"
                },
                {
                    "start": 2581,
                    "end": 2587,
                    "text": "[ 25 ]",
                    "ref_id": "BIBREF24"
                },
                {
                    "start": 2840,
                    "end": 2851,
                    "text": "[ 26 , 27 ]",
                    "ref_id": null
                },
                {
                    "start": 3009,
                    "end": 3020,
                    "text": "[ 28 , 29 ]",
                    "ref_id": null
                }
            ],
            "ref_spans": [],
            "section": "Type IV Vaccine Technologies"
        },
        {
            "text": "The conventional approaches for vaccine design are often not suffi cient to provide immunity against highly variable pathogens or when T-cell immunity is crucial for protection. Tools from molecular biology integrating systems biology (genomics, proteomics, structural biology) approaches allow researchers to identify ways to improve the quality of vaccines or identify repertories of potentially protective antigens. For example, high throughput sequencing can identify the presence of adventitious viral pathogens in commercial vaccines, or defective genomes in cell culture lines used for vaccine production. Structural modeling of the interaction of neutralizing antibodies and/or antibody fragments with antigen can uncover the molecular signatures defi ning protective epitopes (cryptic (hidden) epitopes or involving quaternary structures) being another approach for vaccine antigen (or antiviral compounds) design. Additionally, novel fl ow and mass cytometry technologies [ 30 ] may help to gain deeper knowledge of specifi c cell types involved in protective immune responses for each viral disease. Finally, integrating data of vaccine trials, including vaccine antigens, adjuvant usage or in silico epitope prediction algorithms, may allow development of platforms for experimental vaccine antigen candidates [ 31 ] . Though these approaches are far from being generalized they hold promise on the future of rationale vaccine design for some relevant viral diseases [ 32 ] .",
            "cite_spans": [
                {
                    "start": 982,
                    "end": 988,
                    "text": "[ 30 ]",
                    "ref_id": "BIBREF29"
                },
                {
                    "start": 1322,
                    "end": 1328,
                    "text": "[ 31 ]",
                    "ref_id": "BIBREF30"
                },
                {
                    "start": 1479,
                    "end": 1485,
                    "text": "[ 32 ]",
                    "ref_id": "BIBREF31"
                }
            ],
            "ref_spans": [],
            "section": "New Approaches for Vaccine Design"
        },
        {
            "text": "Transition of successful experimental vaccines to industrial production and manufacturing may become a bottle neck in vaccinology since veterinary vaccines need to fulfi ll several important requisites, among them environmental and safety issues, manufacturing costs and marketability prospects. Considering that most novel vaccine technologies (other than killed or attenuated vaccines) need to adapt the current production processes, many vaccines will never develop further enough to reach market. Nonetheless, animal vaccine research is a very attractive research fi eld with many advantages and complexity over human vaccine fi eld. Firstly, due the larger number of target animal species or segments (ruminant livestock, poultry, porcine, equine, companion animals, aquaculture, and other animal vaccines), secondly, the lack of deep knowledge in the immune mechanisms and lack of reagents adds more difficulties if immune response characterization is needed. The possibility to test the effi cacy of the vaccine prototypes in the target species and study the immune response evoked is one important difference that can speed the process of vaccine development over that of human vaccines. Another important advantage is the possibility of testing more innovative approaches that can be further tested for human vaccine development.",
            "cite_spans": [],
            "ref_spans": [],
            "section": "Concluding Remarks"
        },
        {
            "text": "The following chapters illustrate a number of different techniques to provide antigen delivery in order to develop vaccines against viral diseases. Though the number of techniques is not exhaustive, the ones showed can be considered most currently used by laboratory researchers in the fi eld of animal health. The reader will fi nd useful examples for application to a particular viral disease since most of the techniques can be virtually applied to any virus pathogen. Among them, representative protocols for each of the broad categories for vaccine technologies discussed above. More discursive chapters are also included related to different techniques and protocols for analyses of the immune responses, the use of adjuvants as an essential part of vaccines based on nonlive organisms, and experiences on the use of DNA vaccination in large animals.",
            "cite_spans": [],
            "ref_spans": [],
            "section": "Concluding Remarks"
        }
    ],
    "bib_entries": {
        "BIBREF0": {
            "ref_id": "b0",
            "title": "New vaccines needed for pathogens infecting animals and humans: one Health",
            "authors": [
                {
                    "first": "A",
                    "middle": [
                        "H"
                    ],
                    "last": "Gutierrez",
                    "suffix": ""
                },
                {
                    "first": "D",
                    "middle": [
                        "M"
                    ],
                    "last": "Spero",
                    "suffix": ""
                },
                {
                    "first": "C",
                    "middle": [],
                    "last": "Gay",
                    "suffix": ""
                },
                {
                    "first": "M",
                    "middle": [],
                    "last": "Zimic",
                    "suffix": ""
                },
                {
                    "first": "De",
                    "middle": [],
                    "last": "Groot",
                    "suffix": ""
                },
                {
                    "first": "A",
                    "middle": [
                        "S"
                    ],
                    "last": "",
                    "suffix": ""
                }
            ],
            "year": 2012,
            "venue": "Hum Vaccin Immunother",
            "volume": "8",
            "issn": "7",
            "pages": "",
            "other_ids": {
                "DOI": [
                    "10.4161/hv.20202"
                ]
            }
        },
        "BIBREF1": {
            "ref_id": "b1",
            "title": "Vaccines against diseases transmitted from animals to humans: a one health paradigm",
            "authors": [
                {
                    "first": "T",
                    "middle": [
                        "P"
                    ],
                    "last": "Monath",
                    "suffix": ""
                }
            ],
            "year": 2013,
            "venue": "Vaccine",
            "volume": "31",
            "issn": "13",
            "pages": "",
            "other_ids": {
                "DOI": [
                    "10.1016/j.vaccine.2013.09.029"
                ]
            }
        },
        "BIBREF2": {
            "ref_id": "b2",
            "title": "The long journey: a brief review of the eradication of rinderpest",
            "authors": [
                {
                    "first": "F",
                    "middle": [],
                    "last": "Njeumi",
                    "suffix": ""
                },
                {
                    "first": "W",
                    "middle": [],
                    "last": "Taylor",
                    "suffix": ""
                },
                {
                    "first": "A",
                    "middle": [],
                    "last": "Diallo",
                    "suffix": ""
                },
                {
                    "first": "K",
                    "middle": [],
                    "last": "Miyagishima",
                    "suffix": ""
                },
                {
                    "first": "P",
                    "middle": [
                        "P"
                    ],
                    "last": "Pastoret",
                    "suffix": ""
                },
                {
                    "first": "B",
                    "middle": [],
                    "last": "Vallat",
                    "suffix": ""
                },
                {
                    "first": "M",
                    "middle": [],
                    "last": "Traore",
                    "suffix": ""
                }
            ],
            "year": 2012,
            "venue": "Rev Sci Tech",
            "volume": "31",
            "issn": "3",
            "pages": "729--746",
            "other_ids": {}
        },
        "BIBREF3": {
            "ref_id": "b3",
            "title": "Ebola: learn from the past",
            "authors": [
                {
                    "first": "D",
                    "middle": [
                        "L"
                    ],
                    "last": "Heymann",
                    "suffix": ""
                }
            ],
            "year": 2014,
            "venue": "Nature",
            "volume": "514",
            "issn": "",
            "pages": "299--300",
            "other_ids": {}
        },
        "BIBREF4": {
            "ref_id": "b4",
            "title": "Pattern recognition receptors: sentinels in innate immunity and targets of new vaccine adjuvants",
            "authors": [
                {
                    "first": "C",
                    "middle": [],
                    "last": "Olive",
                    "suffix": ""
                }
            ],
            "year": 2012,
            "venue": "Expert Rev Vaccines",
            "volume": "11",
            "issn": "2",
            "pages": "237--256",
            "other_ids": {
                "DOI": [
                    "10.1586/erv.11.189"
                ]
            }
        },
        "BIBREF5": {
            "ref_id": "b5",
            "title": "Pattern recognition receptors and the innate immune response to viral infection",
            "authors": [
                {
                    "first": "M",
                    "middle": [
                        "R"
                    ],
                    "last": "Thompson",
                    "suffix": ""
                },
                {
                    "first": "J",
                    "middle": [
                        "J"
                    ],
                    "last": "Kaminski",
                    "suffix": ""
                },
                {
                    "first": "Kurt-Jones",
                    "middle": [],
                    "last": "",
                    "suffix": ""
                },
                {
                    "first": "E",
                    "middle": [
                        "A"
                    ],
                    "last": "Fitzgerald",
                    "suffix": ""
                },
                {
                    "first": "K",
                    "middle": [
                        "A"
                    ],
                    "last": "",
                    "suffix": ""
                }
            ],
            "year": 2011,
            "venue": "Viruses",
            "volume": "3",
            "issn": "6",
            "pages": "920--940",
            "other_ids": {
                "DOI": [
                    "10.3390/v3060920"
                ]
            }
        },
        "BIBREF6": {
            "ref_id": "b6",
            "title": "TLRmediated activation of NK cells and their role in bacterial/viral immune responses in mammals",
            "authors": [
                {
                    "first": "M",
                    "middle": [],
                    "last": "Adib-Conquy",
                    "suffix": ""
                },
                {
                    "first": "D",
                    "middle": [],
                    "last": "Scott-Algara",
                    "suffix": ""
                },
                {
                    "first": "J",
                    "middle": [
                        "M"
                    ],
                    "last": "Cavaillon",
                    "suffix": ""
                },
                {
                    "first": "F",
                    "middle": [],
                    "last": "Souza-Fonseca-Guimaraes",
                    "suffix": ""
                }
            ],
            "year": 2014,
            "venue": "Immunol Cell Biol",
            "volume": "92",
            "issn": "3",
            "pages": "",
            "other_ids": {
                "DOI": [
                    "10.1038/icb.2013.99"
                ]
            }
        },
        "BIBREF7": {
            "ref_id": "b7",
            "title": "Antigen targeting to APC: from mice to veterinary species",
            "authors": [
                {
                    "first": "B",
                    "middle": [],
                    "last": "Alvarez",
                    "suffix": ""
                },
                {
                    "first": "T",
                    "middle": [],
                    "last": "Poderoso",
                    "suffix": ""
                },
                {
                    "first": "F",
                    "middle": [],
                    "last": "Alonso",
                    "suffix": ""
                },
                {
                    "first": "A",
                    "middle": [],
                    "last": "Ezquerra",
                    "suffix": ""
                },
                {
                    "first": "J",
                    "middle": [],
                    "last": "Dominguez",
                    "suffix": ""
                },
                {
                    "first": "C",
                    "middle": [],
                    "last": "Revilla",
                    "suffix": ""
                }
            ],
            "year": 2013,
            "venue": "Dev Comp Immunol",
            "volume": "41",
            "issn": "2",
            "pages": "125--125",
            "other_ids": {
                "DOI": [
                    "10.1016/j.dci.2013.04.021"
                ]
            }
        },
        "BIBREF8": {
            "ref_id": "b8",
            "title": "Targeting antigens to dendritic cell receptors for vaccine development",
            "authors": [
                {
                    "first": "V",
                    "middle": [],
                    "last": "Apostolopoulos",
                    "suffix": ""
                },
                {
                    "first": "T",
                    "middle": [],
                    "last": "Thalhammer",
                    "suffix": ""
                },
                {
                    "first": "A",
                    "middle": [
                        "G"
                    ],
                    "last": "Tzakos",
                    "suffix": ""
                },
                {
                    "first": "L",
                    "middle": [],
                    "last": "Stojanovska",
                    "suffix": ""
                }
            ],
            "year": 2013,
            "venue": "J Drug Deliv",
            "volume": "",
            "issn": "",
            "pages": "",
            "other_ids": {
                "DOI": [
                    "10.1155/2013/869718"
                ]
            }
        },
        "BIBREF9": {
            "ref_id": "b9",
            "title": "Correlates of protection induced by vaccination",
            "authors": [
                {
                    "first": "S",
                    "middle": [
                        "A"
                    ],
                    "last": "Plotkin",
                    "suffix": ""
                }
            ],
            "year": 2010,
            "venue": "Clin Vaccine Immunol",
            "volume": "17",
            "issn": "7",
            "pages": "1055--1065",
            "other_ids": {
                "DOI": [
                    "10.1128/CVI.00131-10"
                ]
            }
        },
        "BIBREF10": {
            "ref_id": "b10",
            "title": "Immunization against viral diseases",
            "authors": [
                {
                    "first": "B",
                    "middle": [
                        "S"
                    ],
                    "last": "Graham",
                    "suffix": ""
                },
                {
                    "first": "J",
                    "middle": [
                        "E"
                    ],
                    "last": "Crowe",
                    "suffix": ""
                },
                {
                    "first": "J",
                    "middle": [
                        "E"
                    ],
                    "last": "Ledgerwood",
                    "suffix": ""
                }
            ],
            "year": 2013,
            "venue": "",
            "volume": "1",
            "issn": "",
            "pages": "",
            "other_ids": {}
        },
        "BIBREF11": {
            "ref_id": "b11",
            "title": "Vaccine-mediated immunity against dengue and the potential for long-term protection against disease",
            "authors": [
                {
                    "first": "M",
                    "middle": [
                        "K"
                    ],
                    "last": "Slifka",
                    "suffix": ""
                }
            ],
            "year": 2014,
            "venue": "Front Immunol",
            "volume": "5",
            "issn": "",
            "pages": "",
            "other_ids": {
                "DOI": [
                    "10.3389/fimmu.2014.00195"
                ]
            }
        },
        "BIBREF12": {
            "ref_id": "b12",
            "title": "Reactions of beta-propiolactone with nucleobase analogues, nucleosides, and peptides: implications for the inactivation of viruses",
            "authors": [
                {
                    "first": "J",
                    "middle": [
                        "P"
                    ],
                    "last": "Uittenbogaard",
                    "suffix": ""
                },
                {
                    "first": "B",
                    "middle": [],
                    "last": "Zomer",
                    "suffix": ""
                },
                {
                    "first": "P",
                    "middle": [],
                    "last": "Hoogerhout",
                    "suffix": ""
                },
                {
                    "first": "B",
                    "middle": [],
                    "last": "Metz",
                    "suffix": ""
                }
            ],
            "year": 2011,
            "venue": "J Biol Chem",
            "volume": "286",
            "issn": "42",
            "pages": "36198--36214",
            "other_ids": {
                "DOI": [
                    "10.1074/jbc.M111.279232"
                ]
            }
        },
        "BIBREF13": {
            "ref_id": "b13",
            "title": "Development of a new hydrogen peroxidebased vaccine platform",
            "authors": [
                {
                    "first": "I",
                    "middle": [
                        "J"
                    ],
                    "last": "Amanna",
                    "suffix": ""
                },
                {
                    "first": "H",
                    "middle": [
                        "P"
                    ],
                    "last": "Raue",
                    "suffix": ""
                },
                {
                    "first": "M",
                    "middle": [
                        "K"
                    ],
                    "last": "Slifka",
                    "suffix": ""
                }
            ],
            "year": 2012,
            "venue": "Nat Med",
            "volume": "18",
            "issn": "6",
            "pages": "",
            "other_ids": {
                "DOI": [
                    "10.1038/nm.2763"
                ]
            }
        },
        "BIBREF14": {
            "ref_id": "b14",
            "title": "A hydrogen peroxide-inactivated virus vaccine elicits humoral and cellular immunity and protects against lethal West Nile virus infection in aged mice",
            "authors": [
                {
                    "first": "A",
                    "middle": [
                        "K"
                    ],
                    "last": "Pinto",
                    "suffix": ""
                },
                {
                    "first": "J",
                    "middle": [
                        "M"
                    ],
                    "last": "Richner",
                    "suffix": ""
                },
                {
                    "first": "E",
                    "middle": [
                        "A"
                    ],
                    "last": "Poore",
                    "suffix": ""
                },
                {
                    "first": "P",
                    "middle": [
                        "P"
                    ],
                    "last": "Patil",
                    "suffix": ""
                },
                {
                    "first": "I",
                    "middle": [
                        "J"
                    ],
                    "last": "Amanna",
                    "suffix": ""
                },
                {
                    "first": "M",
                    "middle": [
                        "K"
                    ],
                    "last": "Slifka",
                    "suffix": ""
                },
                {
                    "first": "M",
                    "middle": [
                        "S"
                    ],
                    "last": "Diamond",
                    "suffix": ""
                }
            ],
            "year": 2013,
            "venue": "J Virol",
            "volume": "87",
            "issn": "4",
            "pages": "2903--2915",
            "other_ids": {
                "DOI": [
                    "10.1128/JVI.02903-12"
                ]
            }
        },
        "BIBREF15": {
            "ref_id": "b15",
            "title": "Inactivation of vesicular stomatitis virus through inhibition of membrane fusion by chemical modifi cation of the viral glycoprotein",
            "authors": [
                {
                    "first": "F",
                    "middle": [],
                    "last": "Stauffer",
                    "suffix": ""
                },
                {
                    "first": "De",
                    "middle": [],
                    "last": "Miranda",
                    "suffix": ""
                },
                {
                    "first": "J",
                    "middle": [],
                    "last": "Schechter",
                    "suffix": ""
                },
                {
                    "first": "M",
                    "middle": [
                        "C"
                    ],
                    "last": "Carneiro",
                    "suffix": ""
                },
                {
                    "first": "F",
                    "middle": [
                        "A"
                    ],
                    "last": "Salgado",
                    "suffix": ""
                },
                {
                    "first": "L",
                    "middle": [
                        "T"
                    ],
                    "last": "Machado",
                    "suffix": ""
                },
                {
                    "first": "G",
                    "middle": [
                        "F"
                    ],
                    "last": "Da Poian",
                    "suffix": ""
                },
                {
                    "first": "A",
                    "middle": [
                        "T"
                    ],
                    "last": "",
                    "suffix": ""
                }
            ],
            "year": 2007,
            "venue": "Antiviral Res",
            "volume": "73",
            "issn": "1",
            "pages": "206--209",
            "other_ids": {
                "DOI": [
                    "10.1016/j.antiviral.2006.07.007"
                ]
            }
        },
        "BIBREF16": {
            "ref_id": "b16",
            "title": "A decade after the generation of a negative-sense RNA virus from cloned cDNA: what have we learned?",
            "authors": [
                {
                    "first": "G",
                    "middle": [],
                    "last": "Neumann",
                    "suffix": ""
                },
                {
                    "first": "M",
                    "middle": [
                        "A"
                    ],
                    "last": "Whitt",
                    "suffix": ""
                },
                {
                    "first": "Y",
                    "middle": [],
                    "last": "Kawaoka",
                    "suffix": ""
                }
            ],
            "year": 2002,
            "venue": "J Gen Virol",
            "volume": "83",
            "issn": "",
            "pages": "2635--2662",
            "other_ids": {}
        },
        "BIBREF17": {
            "ref_id": "b17",
            "title": "Genetically engineered vaccines for control of Aujeszky's disease (pseudorabies)",
            "authors": [
                {
                    "first": "S",
                    "middle": [],
                    "last": "Kit",
                    "suffix": ""
                }
            ],
            "year": 1990,
            "venue": "Vaccine",
            "volume": "8",
            "issn": "5",
            "pages": "420--424",
            "other_ids": {}
        },
        "BIBREF18": {
            "ref_id": "b18",
            "title": "Diva vaccines that reduce virus transmission",
            "authors": [
                {
                    "first": "J",
                    "middle": [
                        "T"
                    ],
                    "last": "Van Oirschot",
                    "suffix": ""
                }
            ],
            "year": 1999,
            "venue": "J Biotechnol",
            "volume": "73",
            "issn": "2-3",
            "pages": "195--205",
            "other_ids": {}
        },
        "BIBREF19": {
            "ref_id": "b19",
            "title": "Current strategies for subunit and genetic viral veterinary vaccine development",
            "authors": [
                {
                    "first": "A",
                    "middle": [],
                    "last": "Brun",
                    "suffix": ""
                },
                {
                    "first": "J",
                    "middle": [],
                    "last": "Barcena",
                    "suffix": ""
                },
                {
                    "first": "E",
                    "middle": [],
                    "last": "Blanco",
                    "suffix": ""
                },
                {
                    "first": "B",
                    "middle": [],
                    "last": "Borrego",
                    "suffix": ""
                },
                {
                    "first": "D",
                    "middle": [],
                    "last": "Dory",
                    "suffix": ""
                },
                {
                    "first": "J",
                    "middle": [
                        "M"
                    ],
                    "last": "Escribano",
                    "suffix": ""
                },
                {
                    "first": "Le",
                    "middle": [],
                    "last": "Gall-Recule",
                    "suffix": ""
                },
                {
                    "first": "G",
                    "middle": [],
                    "last": "Ortego",
                    "suffix": ""
                },
                {
                    "first": "J",
                    "middle": [],
                    "last": "Dixon",
                    "suffix": ""
                },
                {
                    "first": "L",
                    "middle": [
                        "K"
                    ],
                    "last": "",
                    "suffix": ""
                }
            ],
            "year": 2011,
            "venue": "Virus Res",
            "volume": "157",
            "issn": "1",
            "pages": "1--12",
            "other_ids": {}
        },
        "BIBREF20": {
            "ref_id": "b20",
            "title": "Enhanced mucosal immunoglobulin A response and solid protection against foot-and-mouth disease virus challenge induced by a novel dendrimeric peptide",
            "authors": [
                {
                    "first": "C",
                    "middle": [],
                    "last": "Cubillos",
                    "suffix": ""
                },
                {
                    "first": "B",
                    "middle": [
                        "G"
                    ],
                    "last": "De La Torre",
                    "suffix": ""
                },
                {
                    "first": "A",
                    "middle": [],
                    "last": "Jakab",
                    "suffix": ""
                },
                {
                    "first": "G",
                    "middle": [],
                    "last": "Clementi",
                    "suffix": ""
                },
                {
                    "first": "E",
                    "middle": [],
                    "last": "Borras",
                    "suffix": ""
                },
                {
                    "first": "J",
                    "middle": [],
                    "last": "Barcena",
                    "suffix": ""
                },
                {
                    "first": "D",
                    "middle": [],
                    "last": "Andreu",
                    "suffix": ""
                },
                {
                    "first": "F",
                    "middle": [],
                    "last": "Sobrino",
                    "suffix": ""
                },
                {
                    "first": "E",
                    "middle": [],
                    "last": "Blanco",
                    "suffix": ""
                }
            ],
            "year": 2008,
            "venue": "J Virol",
            "volume": "82",
            "issn": "14",
            "pages": "7223--7230",
            "other_ids": {
                "DOI": [
                    "10.1128/JVI.00401-08"
                ]
            }
        },
        "BIBREF21": {
            "ref_id": "b21",
            "title": "Designing dendrimers for biological applications",
            "authors": [
                {
                    "first": "C",
                    "middle": [
                        "C"
                    ],
                    "last": "Lee",
                    "suffix": ""
                },
                {
                    "first": "J",
                    "middle": [
                        "A"
                    ],
                    "last": "Mackay",
                    "suffix": ""
                },
                {
                    "first": "J",
                    "middle": [
                        "M"
                    ],
                    "last": "Frechet",
                    "suffix": ""
                },
                {
                    "first": "F",
                    "middle": [
                        "C"
                    ],
                    "last": "Szoka",
                    "suffix": ""
                }
            ],
            "year": 2005,
            "venue": "Nat Biotechnol",
            "volume": "23",
            "issn": "12",
            "pages": "",
            "other_ids": {
                "DOI": [
                    "10.1038/nbt1171"
                ]
            }
        },
        "BIBREF22": {
            "ref_id": "b22",
            "title": "Direct gene transfer into mouse muscle in vivo",
            "authors": [
                {
                    "first": "J",
                    "middle": [
                        "A"
                    ],
                    "last": "Wolff",
                    "suffix": ""
                },
                {
                    "first": "R",
                    "middle": [
                        "W"
                    ],
                    "last": "Malone",
                    "suffix": ""
                },
                {
                    "first": "P",
                    "middle": [],
                    "last": "Williams",
                    "suffix": ""
                },
                {
                    "first": "W",
                    "middle": [],
                    "last": "Chong",
                    "suffix": ""
                },
                {
                    "first": "G",
                    "middle": [],
                    "last": "Acsadi",
                    "suffix": ""
                },
                {
                    "first": "Jani",
                    "middle": [
                        "A"
                    ],
                    "last": "Felgner",
                    "suffix": ""
                },
                {
                    "first": "P",
                    "middle": [
                        "L"
                    ],
                    "last": "",
                    "suffix": ""
                }
            ],
            "year": 1990,
            "venue": "Science",
            "volume": "247",
            "issn": "",
            "pages": "1465--1468",
            "other_ids": {}
        },
        "BIBREF23": {
            "ref_id": "b23",
            "title": "Heterologous protection against infl uenza by injection of DNA encoding a viral protein",
            "authors": [
                {
                    "first": "J",
                    "middle": [
                        "B"
                    ],
                    "last": "Ulmer",
                    "suffix": ""
                },
                {
                    "first": "J",
                    "middle": [
                        "J"
                    ],
                    "last": "Donnelly",
                    "suffix": ""
                },
                {
                    "first": "S",
                    "middle": [
                        "E"
                    ],
                    "last": "Parker",
                    "suffix": ""
                },
                {
                    "first": "G",
                    "middle": [
                        "H"
                    ],
                    "last": "Rhodes",
                    "suffix": ""
                },
                {
                    "first": "P",
                    "middle": [
                        "L"
                    ],
                    "last": "Felgner",
                    "suffix": ""
                },
                {
                    "first": "V",
                    "middle": [
                        "J"
                    ],
                    "last": "Dwarki",
                    "suffix": ""
                },
                {
                    "first": "S",
                    "middle": [
                        "H"
                    ],
                    "last": "Gromkowski",
                    "suffix": ""
                },
                {
                    "first": "R",
                    "middle": [
                        "R"
                    ],
                    "last": "Deck",
                    "suffix": ""
                },
                {
                    "first": "C",
                    "middle": [
                        "M"
                    ],
                    "last": "Dewitt",
                    "suffix": ""
                },
                {
                    "first": "A",
                    "middle": [],
                    "last": "Friedman",
                    "suffix": ""
                }
            ],
            "year": 1993,
            "venue": "Science",
            "volume": "259",
            "issn": "5102",
            "pages": "1745--1749",
            "other_ids": {}
        },
        "BIBREF24": {
            "ref_id": "b24",
            "title": "Antigen delivery systems for veterinary vaccine development. Viral-vector based delivery systems",
            "authors": [
                {
                    "first": "A",
                    "middle": [],
                    "last": "Brun",
                    "suffix": ""
                },
                {
                    "first": "Albina",
                    "middle": [
                        "E"
                    ],
                    "last": "Barret",
                    "suffix": ""
                },
                {
                    "first": "T",
                    "middle": [],
                    "last": "Chapman",
                    "suffix": ""
                },
                {
                    "first": "D",
                    "middle": [
                        "A"
                    ],
                    "last": "Czub",
                    "suffix": ""
                },
                {
                    "first": "M",
                    "middle": [],
                    "last": "Dixon",
                    "suffix": ""
                },
                {
                    "first": "L",
                    "middle": [
                        "K"
                    ],
                    "last": "Keil",
                    "suffix": ""
                },
                {
                    "first": "G",
                    "middle": [
                        "M"
                    ],
                    "last": "Klonjkowski",
                    "suffix": ""
                },
                {
                    "first": "B",
                    "middle": [],
                    "last": "",
                    "suffix": ""
                },
                {
                    "first": "Le",
                    "middle": [],
                    "last": "Potier",
                    "suffix": ""
                },
                {
                    "first": "M",
                    "middle": [
                        "F"
                    ],
                    "last": "Libeau",
                    "suffix": ""
                },
                {
                    "first": "G",
                    "middle": [],
                    "last": "Ortego",
                    "suffix": ""
                },
                {
                    "first": "J",
                    "middle": [],
                    "last": "Richardson",
                    "suffix": ""
                },
                {
                    "first": "J",
                    "middle": [],
                    "last": "Takamatsu",
                    "suffix": ""
                },
                {
                    "first": "H",
                    "middle": [
                        "H"
                    ],
                    "last": "",
                    "suffix": ""
                }
            ],
            "year": 2008,
            "venue": "Vaccine",
            "volume": "26",
            "issn": "51",
            "pages": "1293--1293",
            "other_ids": {
                "DOI": [
                    "10.1016/j.vaccine.2008.09.044"
                ]
            }
        },
        "BIBREF25": {
            "ref_id": "b25",
            "title": "Human immunodefi ciency virus type 1 Gagspecifi c vaginal immunity and protection after local immunizations with sindbis virus-based replicon particles",
            "authors": [
                {
                    "first": "M",
                    "middle": [],
                    "last": "Vajdy",
                    "suffix": ""
                },
                {
                    "first": "J",
                    "middle": [],
                    "last": "Gardner",
                    "suffix": ""
                },
                {
                    "first": "J",
                    "middle": [],
                    "last": "Neidleman",
                    "suffix": ""
                },
                {
                    "first": "L",
                    "middle": [],
                    "last": "Cuadra",
                    "suffix": ""
                },
                {
                    "first": "C",
                    "middle": [],
                    "last": "Greer",
                    "suffix": ""
                },
                {
                    "first": "Perri",
                    "middle": [
                        "S"
                    ],
                    "last": "O&apos;hagan",
                    "suffix": ""
                },
                {
                    "first": "D",
                    "middle": [],
                    "last": "Polo",
                    "suffix": ""
                },
                {
                    "first": "J",
                    "middle": [
                        "M"
                    ],
                    "last": "",
                    "suffix": ""
                }
            ],
            "year": 2001,
            "venue": "J Infect Dis",
            "volume": "184",
            "issn": "12",
            "pages": "",
            "other_ids": {
                "DOI": [
                    "10.1086/324581"
                ]
            }
        },
        "BIBREF26": {
            "ref_id": "b26",
            "title": "Vaccination with recombinant alphavirus or immune-stimulating complex antigen against respiratory syncytial virus",
            "authors": [
                {
                    "first": "M",
                    "middle": [],
                    "last": "Chen",
                    "suffix": ""
                },
                {
                    "first": "K",
                    "middle": [
                        "F"
                    ],
                    "last": "Hu",
                    "suffix": ""
                },
                {
                    "first": "B",
                    "middle": [],
                    "last": "Rozell",
                    "suffix": ""
                },
                {
                    "first": "C",
                    "middle": [],
                    "last": "Orvell",
                    "suffix": ""
                },
                {
                    "first": "B",
                    "middle": [],
                    "last": "Morein",
                    "suffix": ""
                },
                {
                    "first": "P",
                    "middle": [],
                    "last": "Liljestrom",
                    "suffix": ""
                }
            ],
            "year": 2002,
            "venue": "J Immunol",
            "volume": "169",
            "issn": "6",
            "pages": "3208--3216",
            "other_ids": {}
        },
        "BIBREF27": {
            "ref_id": "b27",
            "title": "Rescue of infectious rift valley fever virus entirely from cDNA, analysis of virus lacking the NSs gene, and expression of a foreign gene",
            "authors": [
                {
                    "first": "T",
                    "middle": [],
                    "last": "Ikegami",
                    "suffix": ""
                },
                {
                    "first": "S",
                    "middle": [],
                    "last": "Won",
                    "suffix": ""
                },
                {
                    "first": "C",
                    "middle": [
                        "J"
                    ],
                    "last": "Peters",
                    "suffix": ""
                },
                {
                    "first": "S",
                    "middle": [],
                    "last": "Makino",
                    "suffix": ""
                }
            ],
            "year": 2006,
            "venue": "J Virol",
            "volume": "80",
            "issn": "6",
            "pages": "80--86",
            "other_ids": {
                "DOI": [
                    "10.1128/JVI.80.6.2933-2940.2006"
                ]
            }
        },
        "BIBREF28": {
            "ref_id": "b28",
            "title": "Evaluation of nonspreading Rift Valley fever virus as a vaccine vector using infl uenza virus hemagglutinin as a model antigen",
            "authors": [
                {
                    "first": "N",
                    "middle": [],
                    "last": "Oreshkova",
                    "suffix": ""
                },
                {
                    "first": "L",
                    "middle": [
                        "A"
                    ],
                    "last": "Cornelissen",
                    "suffix": ""
                },
                {
                    "first": "C",
                    "middle": [
                        "A"
                    ],
                    "last": "De Haan",
                    "suffix": ""
                },
                {
                    "first": "R",
                    "middle": [
                        "J"
                    ],
                    "last": "Moormann",
                    "suffix": ""
                },
                {
                    "first": "J",
                    "middle": [],
                    "last": "Kortekaas",
                    "suffix": ""
                }
            ],
            "year": 2014,
            "venue": "Vaccine",
            "volume": "32",
            "issn": "41",
            "pages": "994--997",
            "other_ids": {
                "DOI": [
                    "10.1016/j.vaccine.2014.07.051"
                ]
            }
        },
        "BIBREF29": {
            "ref_id": "b29",
            "title": "Highly multiparametric analysis by mass cytometry",
            "authors": [
                {
                    "first": "O",
                    "middle": [],
                    "last": "Ornatsky",
                    "suffix": ""
                },
                {
                    "first": "D",
                    "middle": [],
                    "last": "Bandura",
                    "suffix": ""
                },
                {
                    "first": "V",
                    "middle": [],
                    "last": "Baranov",
                    "suffix": ""
                },
                {
                    "first": "M",
                    "middle": [],
                    "last": "Nitz",
                    "suffix": ""
                },
                {
                    "first": "M",
                    "middle": [
                        "A"
                    ],
                    "last": "Winnik",
                    "suffix": ""
                },
                {
                    "first": "S",
                    "middle": [],
                    "last": "Tanner",
                    "suffix": ""
                }
            ],
            "year": 2010,
            "venue": "J Immunol Methods",
            "volume": "361",
            "issn": "10",
            "pages": "198--203",
            "other_ids": {
                "DOI": [
                    "10.1016/j.jim.2010.07.002"
                ]
            }
        },
        "BIBREF30": {
            "ref_id": "b30",
            "title": "Databases and in silico tools for vaccine design",
            "authors": [
                {
                    "first": "Y",
                    "middle": [],
                    "last": "He",
                    "suffix": ""
                },
                {
                    "first": "Z",
                    "middle": [],
                    "last": "Xiang",
                    "suffix": ""
                }
            ],
            "year": 2013,
            "venue": "Methods Mol Biol",
            "volume": "993",
            "issn": "",
            "pages": "115--127",
            "other_ids": {
                "DOI": [
                    "10.1007/978-1-62703-342-8_8"
                ]
            }
        },
        "BIBREF31": {
            "ref_id": "b31",
            "title": "Systems vaccinology: its promise and challenge for HIV vaccine development",
            "authors": [
                {
                    "first": "H",
                    "middle": [
                        "I"
                    ],
                    "last": "Nakaya",
                    "suffix": ""
                },
                {
                    "first": "B",
                    "middle": [],
                    "last": "Pulendran",
                    "suffix": ""
                }
            ],
            "year": 2012,
            "venue": "Curr Opin HIV AIDS",
            "volume": "7",
            "issn": "1",
            "pages": "24--31",
            "other_ids": {
                "DOI": [
                    "10.1097/COH.0b013e32834dc37b"
                ]
            }
        }
    },
    "ref_entries": {
        "FIGREF0": {
            "text": "Virus families including members causing notifi able animal diseases. The fi gure depicts the number of pathogenic members from each virus family causing important diseases in terrestrial and aquatic animals",
            "latex": null,
            "type": "figure"
        },
        "FIGREF1": {
            "text": "Vaccination exploits the induction of specifi city and immunological memory. A primary clonal expansion of lymphocytes is produced upon activation of na\u00efve T-cells by phagocytes primed with specifi c vaccine antigens/stimulus. Both effector and memory cell pools are generated that upon encounter with pathogen (infection) will undergo a massive secondary expansion of both cell pools (adapted from[ 33 ])",
            "latex": null,
            "type": "figure"
        },
        "TABREF0": {
            "text": "",
            "latex": null,
            "type": "table"
        },
        "TABREF1": {
            "text": "proposed classifi cation for the current vaccine technologies",
            "latex": null,
            "type": "table"
        },
        "TABREF2": {
            "text": "",
            "latex": null,
            "type": "table"
        },
        "TABREF3": {
            "text": "Most recognizable pros and cons of inactivated and attenuated vaccines",
            "latex": null,
            "type": "table"
        }
    },
    "back_matter": []
}