{
    "paper_id": "PMC7087289",
    "metadata": {
        "title": "Detection of transmissible gastroenteritis virus neutralising antibody in cats",
        "authors": [
            {
                "first": "D.",
                "middle": [
                    "J."
                ],
                "last": "Reynolds",
                "suffix": "",
                "email": null,
                "affiliation": {}
            },
            {
                "first": "D.",
                "middle": [
                    "J."
                ],
                "last": "Garwes",
                "suffix": "",
                "email": null,
                "affiliation": {}
            },
            {
                "first": "C.",
                "middle": [
                    "J."
                ],
                "last": "Gaskell",
                "suffix": "",
                "email": null,
                "affiliation": {}
            }
        ]
    },
    "body_text": [],
    "ref_entries": {},
    "back_matter": [],
    "bib_entries": {
        "BIBREF0": {
            "title": "",
            "authors": [],
            "year": null,
            "venue": "",
            "volume": "",
            "issn": "",
            "pages": null,
            "other_ids": {
                "DOI": []
            }
        },
        "BIBREF1": {
            "title": "Transmissible gastroenteritis (TGE) of swine: The possible role of dogs in the epizootiology of TGE",
            "authors": [
                {
                    "first": "A.",
                    "middle": [
                        "W."
                    ],
                    "last": "McClurkin",
                    "suffix": ""
                },
                {
                    "first": "",
                    "middle": [],
                    "last": "Stark",
                    "suffix": ""
                },
                {
                    "first": "L.",
                    "middle": [],
                    "last": "Sharon",
                    "suffix": ""
                },
                {
                    "first": "J.",
                    "middle": [
                        "O."
                    ],
                    "last": "Norman",
                    "suffix": ""
                }
            ],
            "year": 1970,
            "venue": "Canad. J. comp. Med.",
            "volume": "34",
            "issn": "",
            "pages": "347-349",
            "other_ids": {
                "DOI": []
            }
        },
        "BIBREF2": {
            "title": "Morphologic and physical characteristics of feline infectious peritonitis and its growth in autochthonous peritoneal cell cultures",
            "authors": [
                {
                    "first": "N.",
                    "middle": [
                        "C."
                    ],
                    "last": "Pedersen",
                    "suffix": ""
                }
            ],
            "year": 1976,
            "venue": "Amer. J. vet. Res.",
            "volume": "37",
            "issn": "",
            "pages": "567-572",
            "other_ids": {
                "DOI": []
            }
        },
        "BIBREF3": {
            "title": "Serologic studies of naturally occurring feline infectious peritonitis",
            "authors": [
                {
                    "first": "N.",
                    "middle": [
                        "C."
                    ],
                    "last": "Pedersen",
                    "suffix": ""
                }
            ],
            "year": 1976,
            "venue": "Amer. J. vet. Res.",
            "volume": "37",
            "issn": "",
            "pages": "1449-1453",
            "other_ids": {
                "DOI": []
            }
        },
        "BIBREF4": {
            "title": "",
            "authors": [],
            "year": null,
            "venue": "",
            "volume": "",
            "issn": "",
            "pages": null,
            "other_ids": {
                "DOI": []
            }
        },
        "BIBREF5": {
            "title": "Cytopathic factors in bacteria-free lysates ofEscherichia coli",
            "authors": [
                {
                    "first": "J.",
                    "middle": [
                        "M."
                    ],
                    "last": "Rutter",
                    "suffix": ""
                },
                {
                    "first": "P.",
                    "middle": [
                        "D."
                    ],
                    "last": "Luther",
                    "suffix": ""
                }
            ],
            "year": 1973,
            "venue": "J. med. Microbiol.",
            "volume": "6",
            "issn": "",
            "pages": "565-571",
            "other_ids": {
                "DOI": []
            }
        },
        "BIBREF6": {
            "title": "Isolation of porcine immunoglobulins and determination of the immunoglobulin class",
            "authors": [
                {
                    "first": "L.",
                    "middle": [
                        "J."
                    ],
                    "last": "Saif",
                    "suffix": ""
                },
                {
                    "first": "E.",
                    "middle": [
                        "H."
                    ],
                    "last": "Bohl",
                    "suffix": ""
                },
                {
                    "first": "R.",
                    "middle": [
                        "K.",
                        "P."
                    ],
                    "last": "Gupta",
                    "suffix": ""
                }
            ],
            "year": 1972,
            "venue": "Infect. Immun.",
            "volume": "6",
            "issn": "",
            "pages": "600-609",
            "other_ids": {
                "DOI": []
            }
        },
        "BIBREF7": {
            "title": "Partial characterization of the principal soluble antigens associated with the coronavirus of transmissible gastroenteritis by complement fixation and immunodiffusion",
            "authors": [
                {
                    "first": "S.",
                    "middle": [
                        "S."
                    ],
                    "last": "Stone",
                    "suffix": ""
                },
                {
                    "first": "L.",
                    "middle": [
                        "J."
                    ],
                    "last": "Kemeny",
                    "suffix": ""
                },
                {
                    "first": "M.",
                    "middle": [
                        "T."
                    ],
                    "last": "Jensen",
                    "suffix": ""
                }
            ],
            "year": 1976,
            "venue": "Infect. Immun.",
            "volume": "13",
            "issn": "",
            "pages": "521-526",
            "other_ids": {
                "DOI": []
            }
        },
        "BIBREF8": {
            "title": "Coronaviridae",
            "authors": [
                {
                    "first": "D.",
                    "middle": [
                        "A.",
                        "J."
                    ],
                    "last": "Tyrrell",
                    "suffix": ""
                },
                {
                    "first": "J.",
                    "middle": [
                        "D."
                    ],
                    "last": "Almeida",
                    "suffix": ""
                },
                {
                    "first": "C.",
                    "middle": [
                        "H."
                    ],
                    "last": "Cunningham",
                    "suffix": ""
                },
                {
                    "first": "W.",
                    "middle": [
                        "R."
                    ],
                    "last": "Dowdle",
                    "suffix": ""
                },
                {
                    "first": "M.",
                    "middle": [
                        "S."
                    ],
                    "last": "Hofstad",
                    "suffix": ""
                },
                {
                    "first": "K.",
                    "middle": [],
                    "last": "McIntosh",
                    "suffix": ""
                },
                {
                    "first": "M.",
                    "middle": [],
                    "last": "Tajima",
                    "suffix": ""
                },
                {
                    "first": "L.",
                    "middle": [
                        "Ya."
                    ],
                    "last": "Zakstelskaya",
                    "suffix": ""
                },
                {
                    "first": "B.",
                    "middle": [
                        "C."
                    ],
                    "last": "Easterday",
                    "suffix": ""
                },
                {
                    "first": "A.",
                    "middle": [],
                    "last": "Kapikian",
                    "suffix": ""
                },
                {
                    "first": "R.",
                    "middle": [
                        "W."
                    ],
                    "last": "Bingham",
                    "suffix": ""
                }
            ],
            "year": 1975,
            "venue": "Intervirology",
            "volume": "5",
            "issn": "",
            "pages": "76-82",
            "other_ids": {
                "DOI": []
            }
        },
        "BIBREF9": {
            "title": "Micro-color test for assay of TGE virus-neutralizing antibodies",
            "authors": [
                {
                    "first": "K.",
                    "middle": [
                        "H."
                    ],
                    "last": "Witte",
                    "suffix": ""
                }
            ],
            "year": 1971,
            "venue": "Arch. ges. Virusforsch.",
            "volume": "33",
            "issn": "",
            "pages": "171-176",
            "other_ids": {
                "DOI": []
            }
        },
        "BIBREF10": {
            "title": "Vomiting and diarrhoea in dogs",
            "authors": [
                {
                    "first": "S.",
                    "middle": [],
                    "last": "Cartwright",
                    "suffix": ""
                },
                {
                    "first": "M.",
                    "middle": [],
                    "last": "Lucas",
                    "suffix": ""
                }
            ],
            "year": 1972,
            "venue": "Vet. Rec.",
            "volume": "91",
            "issn": "",
            "pages": "571-572",
            "other_ids": {
                "DOI": []
            }
        },
        "BIBREF11": {
            "title": "A study of an inhibitor in bovine serum active against respiratory syncytial virus",
            "authors": [
                {
                    "first": "J.",
                    "middle": [
                        "E."
                    ],
                    "last": "Doggett",
                    "suffix": ""
                },
                {
                    "first": "D.",
                    "middle": [],
                    "last": "Taylor-Robinson",
                    "suffix": ""
                },
                {
                    "first": "R.",
                    "middle": [
                        "G.",
                        "C."
                    ],
                    "last": "Gallop",
                    "suffix": ""
                }
            ],
            "year": 1968,
            "venue": "Arch. ges. Virusforsch.",
            "volume": "23",
            "issn": "",
            "pages": "126-137",
            "other_ids": {
                "DOI": []
            }
        },
        "BIBREF12": {
            "title": "Feline infectious peritonitis. Proteins of plasma and ascitic fluids",
            "authors": [
                {
                    "first": "M.",
                    "middle": [],
                    "last": "Gouffaux",
                    "suffix": ""
                },
                {
                    "first": "P.",
                    "middle": [
                        "P."
                    ],
                    "last": "Pastoret",
                    "suffix": ""
                },
                {
                    "first": "M.",
                    "middle": [],
                    "last": "Henrcteaux",
                    "suffix": ""
                },
                {
                    "first": "A.",
                    "middle": [],
                    "last": "Massip",
                    "suffix": ""
                }
            ],
            "year": 1975,
            "venue": "Vet. Pathol.",
            "volume": "12",
            "issn": "",
            "pages": "335-348",
            "other_ids": {
                "DOI": []
            }
        },
        "BIBREF13": {
            "title": "Epidemiological studies of transmissible gastroenteritis of swine",
            "authors": [
                {
                    "first": "E.",
                    "middle": [
                        "O."
                    ],
                    "last": "Haelterman",
                    "suffix": ""
                }
            ],
            "year": 1962,
            "venue": "Proc. U.S. Livestock Sanit. Assn.",
            "volume": "66",
            "issn": "",
            "pages": "305-315",
            "other_ids": {
                "DOI": []
            }
        },
        "BIBREF14": {
            "title": "",
            "authors": [],
            "year": null,
            "venue": "",
            "volume": "",
            "issn": "",
            "pages": null,
            "other_ids": {
                "DOI": []
            }
        },
        "BIBREF15": {
            "title": "A microneutralization test for the assay of porcine parvovirus antibody",
            "authors": [
                {
                    "first": "H.",
                    "middle": [
                        "S."
                    ],
                    "last": "Joo",
                    "suffix": ""
                },
                {
                    "first": "C.",
                    "middle": [
                        "R."
                    ],
                    "last": "Donaldson-Wood",
                    "suffix": ""
                },
                {
                    "first": "R.",
                    "middle": [
                        "H."
                    ],
                    "last": "Johnson",
                    "suffix": ""
                }
            ],
            "year": 1975,
            "venue": "Arch. Virol.",
            "volume": "47",
            "issn": "",
            "pages": "337-341",
            "other_ids": {
                "DOI": []
            }
        },
        "BIBREF16": {
            "title": "Beitrag zur kollektiven Behandlung pharmakologischer Reihenversuche",
            "authors": [
                {
                    "first": "G.",
                    "middle": [],
                    "last": "K\u00e4rber",
                    "suffix": ""
                }
            ],
            "year": 1931,
            "venue": "Arch. exp. path. Pharmakol.",
            "volume": "162",
            "issn": "",
            "pages": "480-483",
            "other_ids": {
                "DOI": []
            }
        },
        "BIBREF17": {
            "title": "Avian infectious bronchitis virus. Characteristics of an inhibitor found in serum",
            "authors": [
                {
                    "first": "P.",
                    "middle": [
                        "D."
                    ],
                    "last": "Lukert",
                    "suffix": ""
                }
            ],
            "year": 1973,
            "venue": "Arch. ges. Virusforsch.",
            "volume": "40",
            "issn": "",
            "pages": "93-104",
            "other_ids": {
                "DOI": []
            }
        }
    }
}