{
    "paper_id": "1385eed8eb4af87726ffb3e2831c85b85cc735b1",
    "metadata": {
        "title": "Coronavims Infection in Acute Lower Respiratory Tract Disease of Infants",
        "authors": [
            {
                "first": "Kenneth",
                "middle": [],
                "last": "Mcintosh",
                "suffix": "",
                "affiliation": {},
                "email": ""
            },
            {
                "first": "Ru",
                "middle": [
                    "Kwa"
                ],
                "last": "Chao",
                "suffix": "",
                "affiliation": {},
                "email": ""
            },
            {
                "first": "Helen",
                "middle": [
                    "E"
                ],
                "last": "Krause",
                "suffix": "",
                "affiliation": {},
                "email": ""
            },
            {
                "first": "Raymond",
                "middle": [],
                "last": "Wash",
                "suffix": "",
                "affiliation": {},
                "email": ""
            },
            {
                "first": "Hilda",
                "middle": [
                    "E"
                ],
                "last": "Mocega",
                "suffix": "",
                "affiliation": {},
                "email": ""
            },
            {
                "first": "Maurice",
                "middle": [
                    "A"
                ],
                "last": "Mufson",
                "suffix": "",
                "affiliation": {},
                "email": ""
            }
        ]
    },
    "abstract": [],
    "body_text": [
        {
            "text": "A serologic surveillance of lower respiratory tract disease in 417 hospitalized children under 18 months of age revealed infection with coronaviruses (strains OC43 and/or 229E) in 34 (8.2%). During the same interval, one of 13 control infants was infected. There were two distinct periods lasting six and 14 weeks, respectively, during which the incidence rose to as high as 18.9% of patients with lower respiratory tract disease. The incidence of coronavirus infection in patients with pneumonia and bronchiolitis was higher than the incidences of adenoviruses, influenza, parainfluenza viruses types 1 and 2, and rhinoviruses, and lower only than the incidences of parainfluenza virus type 3 and respiratory syncytial virus. Coronaviruses serologically similar or identical to strain 229E were recovered from frozen nasal washes obtained during the acute phase of pneumonia in two children.",
            "cite_spans": [],
            "ref_spans": [],
            "section": ""
        },
        {
            "text": "Continuing programs of surveillance during the past decade have provided evidence that viral infection is the major identifiable cause of acute lower respiratory tract disease (LRTD) in children. Nevertheless, in every published study between one-third and two-thirds of serious illnesses cannot be associated with infection by known viruses [1] [2] [3] [4] . When the human coronaviruses were first discovered [5] [6] [7] and were shown to be of importance in upper respiratory disease in adults [8, 9] , it was hoped that they might account for a proportion of these unexplained illnesses. However, a seroepidemiologic study of their role in LRTD showed no statistically significant correlation with illness [8] . Nevertheless, in the youngest group examined (children less than one year Received for publication March 1, 1974 , and in revised form July 19, 1974. This work was supported in part by contracts no. PH 43-63-76 and NIH 72-2501 from the Infectious Disease Branch, National Institute of Allergy and Infectious Diseases.",
            "cite_spans": [
                {
                    "start": 342,
                    "end": 345,
                    "text": "[1]",
                    "ref_id": "BIBREF0"
                },
                {
                    "start": 346,
                    "end": 349,
                    "text": "[2]",
                    "ref_id": "BIBREF1"
                },
                {
                    "start": 350,
                    "end": 353,
                    "text": "[3]",
                    "ref_id": "BIBREF2"
                },
                {
                    "start": 354,
                    "end": 357,
                    "text": "[4]",
                    "ref_id": "BIBREF3"
                },
                {
                    "start": 411,
                    "end": 414,
                    "text": "[5]",
                    "ref_id": "BIBREF4"
                },
                {
                    "start": 415,
                    "end": 418,
                    "text": "[6]",
                    "ref_id": "BIBREF5"
                },
                {
                    "start": 419,
                    "end": 422,
                    "text": "[7]",
                    "ref_id": "BIBREF6"
                },
                {
                    "start": 497,
                    "end": 500,
                    "text": "[8,",
                    "ref_id": "BIBREF7"
                },
                {
                    "start": 501,
                    "end": 503,
                    "text": "9]",
                    "ref_id": "BIBREF8"
                },
                {
                    "start": 710,
                    "end": 713,
                    "text": "[8]",
                    "ref_id": "BIBREF7"
                },
                {
                    "start": 815,
                    "end": 828,
                    "text": "March 1, 1974",
                    "ref_id": null
                },
                {
                    "start": 851,
                    "end": 865,
                    "text": "July 19, 1974.",
                    "ref_id": null
                }
            ],
            "ref_spans": [],
            "section": ""
        },
        {
            "text": "We are grateful for the assistance of Ms. Sally De-Long and Ms. Virginia Chapman in obtaining electron micrographs.",
            "cite_spans": [],
            "ref_spans": [],
            "section": ""
        },
        {
            "text": "Please address requests for reprints to Dr. Kenneth McIntosh, Mail Container #2541, University of Colorado Medical Center, 4200 East Ninth Avenue, Denver, Colorado 80220. old), there was a suggestion that coronaviruses might playa small but definite part in the etiology of bronchiolitis and pneumonia. Because of the great difficulty in cultivation of coronaviruses in vitro, no attempts were made in these studies to corroborate serologic data with recovery of virus. Indeed, to our knowledge, coronaviruses have not previously been isolated from young children.",
            "cite_spans": [],
            "ref_spans": [],
            "section": ""
        },
        {
            "text": "Because of this paucity of information, and because of the suggestive evidence that infants might be subject to lower respiratory infections with coronaviruses, we undertook an examination of coronavirus infections in children less than 18 months old who were admitted to Cook County Hospital with acute LRTD. Conventional studies of respiratory virus in this group of children have been reported elsewhere [4] .",
            "cite_spans": [
                {
                    "start": 407,
                    "end": 410,
                    "text": "[4]",
                    "ref_id": "BIBREF3"
                }
            ],
            "ref_spans": [],
            "section": ""
        },
        {
            "text": "Patients. Children less than 18 months old admitted on Sunday through Friday mornings to Cook County Hospital in Chicago were included in the study. They were housed in a single ward and were tested for shedding of virus within 24 hr of admission. Acute and convalescent sera were obtained from every child.",
            "cite_spans": [],
            "ref_spans": [],
            "section": "Materials and Methods"
        },
        {
            "text": "The diagnostic definitions in this study were 502 1/13 (7.7) Results 2/49 (4.9) 13/137 (9.5) 10/143 (7.0) 9/88 (10.2) 34/417 (8.2) Corona virus in In/ant Respiratory Disease those commonly used by others. Pneumonia required the demonstration by chest X ray of an infiltrate; bronchiolitis was characterized by cough, tachypnea, suprasternal and subcostal retractions, expiratory wheezes, and, often, rales; in laryngo-tracheo-bronchitis there was a harsh \"croupy\" cough, with stridor; and bronchitis was used to define a lesser disease with cough, rhonchi, and, sometimes, wheezing.",
            "cite_spans": [
                {
                    "start": 46,
                    "end": 49,
                    "text": "502",
                    "ref_id": null
                },
                {
                    "start": 125,
                    "end": 130,
                    "text": "(8.2)",
                    "ref_id": null
                }
            ],
            "ref_spans": [],
            "section": "Materials and Methods"
        },
        {
            "text": "\"Control\" children with adequate serum samples were few. Such infants were admitted for noninfectious disorders and had not experienced an acute respiratory illness during the previous 10 days.",
            "cite_spans": [],
            "ref_spans": [],
            "section": "Materials and Methods"
        },
        {
            "text": "Virologic methods. Conventional methods for recovery of virus and serodiagnosis have been described [4] . These methods would detect infection by respiratory syncytial virus, parainfluenza viruses types 1, 2, and 3, adenoviruses influenza virus types A and B, and Mycoplasm~pneumoniae [10] . In this study, antibodies to three coronavirus serotypes were measured. Human coronavirus type 229E [6] CF antigen was made in L-132 cells [11] . Strain OC43 antigen [7] was produced in brains of suckling mice [12] . Hemagglutination inhibition was measured with chicken erythrocytes as described by Kaye and Dowdle [13] . A multivalent CF antigen containing four serotypes of mouse hepatitis virus (Microbiological Associates, Bethesda, Md.) was included in our tests because of the known antigenic relationship of mouse hepatitis virus to the human coronaviruses [14, 15] and because of its demonstrated capacity to react with antibodies to coronavirus in human sera [16] .",
            "cite_spans": [
                {
                    "start": 100,
                    "end": 103,
                    "text": "[4]",
                    "ref_id": "BIBREF3"
                },
                {
                    "start": 285,
                    "end": 289,
                    "text": "[10]",
                    "ref_id": "BIBREF9"
                },
                {
                    "start": 392,
                    "end": 395,
                    "text": "[6]",
                    "ref_id": "BIBREF5"
                },
                {
                    "start": 431,
                    "end": 435,
                    "text": "[11]",
                    "ref_id": "BIBREF10"
                },
                {
                    "start": 458,
                    "end": 461,
                    "text": "[7]",
                    "ref_id": "BIBREF6"
                },
                {
                    "start": 502,
                    "end": 506,
                    "text": "[12]",
                    "ref_id": "BIBREF11"
                },
                {
                    "start": 608,
                    "end": 612,
                    "text": "[13]",
                    "ref_id": "BIBREF12"
                },
                {
                    "start": 857,
                    "end": 861,
                    "text": "[14,",
                    "ref_id": "BIBREF13"
                },
                {
                    "start": 862,
                    "end": 865,
                    "text": "15]",
                    "ref_id": "BIBREF14"
                },
                {
                    "start": 961,
                    "end": 965,
                    "text": "[16]",
                    "ref_id": "BIBREF16"
                }
            ],
            "ref_spans": [],
            "section": "Materials and Methods"
        },
        {
            "text": "We attempted recovery of coronavirus from frozen oropharyngeal swab specimens obtained from selected children during acute illness with serologic evidence of 229E infection. Specimens were thawed and inoculated onto roller-tube monolayers of the human embryonic intestine fibroblast cell line MA-177 (Microbiological Associates) . This line previously had exhibited unusual sensitivity in the recovery of 229E-like viruses [17] . Material from the first or second passage was then transferred to and further propagated in WI-38 cells. Unconcentrated sonicates from infected roller-tube cultures were stained with phosphotungstic acid and examined in an RCA EMU-4A electron microscope. 503 Epidemiology of corona virus infection. During the study period 417 children with acute LRTD were examined for serologic evidence of coronavirus infection. Only 13 serum pairs from control patients were available during this period, but these had an age distribution proportionally similar to that of the LRTD serum pairs. About 80% of the children were under one year old; more than 90% of the infants were black.",
            "cite_spans": [
                {
                    "start": 423,
                    "end": 427,
                    "text": "[17]",
                    "ref_id": "BIBREF17"
                },
                {
                    "start": 685,
                    "end": 688,
                    "text": "503",
                    "ref_id": null
                }
            ],
            "ref_spans": [],
            "section": "Materials and Methods"
        },
        {
            "text": "Coronavirus infection was detected serologi-call~by a fourfold or greater rise in antibody in 34 I~fants (8.2% of all those with acute LRTD) and III one of the 13 control infants. The incidence of infection in relation to age is shown in table 1. There is some evidence that the youngest group shown, those under two months old, were infected less often than older children.",
            "cite_spans": [],
            "ref_spans": [],
            "section": "Materials and Methods"
        },
        {
            "text": "The seasonal incidence of acute LRTD and of coronavirus infection is shown in figure 1 . Numbers of hospital admissions for patients with acute LRTD show the expected peaks during the winter months. Coronavirus infections tended to occur in small outbreaks but with little seasonal preference. This finding is in contrast to most other studies, which have shown distinct increases in coronavirus infections in the winter and early spring [8, 18] .",
            "cite_spans": [
                {
                    "start": 438,
                    "end": 441,
                    "text": "[8,",
                    "ref_id": "BIBREF7"
                },
                {
                    "start": 442,
                    "end": 445,
                    "text": "18]",
                    "ref_id": "BIBREF18"
                }
            ],
            "ref_spans": [
                {
                    "start": 78,
                    "end": 86,
                    "text": "figure 1",
                    "ref_id": "FIGREF0"
                }
            ],
            "section": "Materials and Methods"
        },
        {
            "text": "Two periods of increased coronavirus incidence occurred (table 2) . Both small outbreaks involved infants who had either pneumonia [6] or bronchiolitis [1, 2] .",
            "cite_spans": [
                {
                    "start": 131,
                    "end": 134,
                    "text": "[6]",
                    "ref_id": "BIBREF5"
                },
                {
                    "start": 152,
                    "end": 155,
                    "text": "[1,",
                    "ref_id": "BIBREF0"
                },
                {
                    "start": 156,
                    "end": 158,
                    "text": "2]",
                    "ref_id": "BIBREF1"
                }
            ],
            "ref_spans": [
                {
                    "start": 56,
                    "end": 65,
                    "text": "(table 2)",
                    "ref_id": "TABREF1"
                }
            ],
            "section": "Materials and Methods"
        },
        {
            "text": "During both these periods infections with coronavirus were more common than those due to ot~er~iruses. T~e first period followed a large epidemic of respiratory syncytial virus, but during the two months of coronavirus activity only 8.9 % of the children were infected with respiratory syncytial virus. During the second period there were cases of respiratory syncytial virus, influenza A, and parainfluenza types 1 and 3, but none of these individual viruses was found in more than 11.6% of infants, whereas 16.3% of the infants had coronavirus infections.",
            "cite_spans": [],
            "ref_spans": [],
            "section": "Materials and Methods"
        },
        {
            "text": "3. Coronavirus infection in pneumonia and bronchiolitis (table 4) ranks in incidence higher than adenovirus, parainfluenza viruses types 1 and 2, influenza A, and rhinovirus, and lower than respiratory syncytial virus and parainfluenza type 3.",
            "cite_spans": [],
            "ref_spans": [],
            "section": "The incidence of coronavirus infection in the four clinical LRTD syndromes is shown in table'"
        },
        {
            "text": "Clinical aspects of pneumonia and bronchiolitis associated with coronavirus infection. Of the 30 infants with coronavirus infection during bronchiolitis or pneumonia, 13 were simultaneously infected with one or more other viruses. However, the single infections did not differ clinically from the multiple infections. Eighteen children required oxygen or were thought. to be in respiratory distress with intercostal retractions. Vomiting occurred in nine infants and otitis media Shared serologic activity among the human coronaviruses. The rises in antibody to coronaviruses in paired sera of infants are analyzed in detail in table 5. All such rises were reproduced in replicate testing or were eightfold or greater. Serologic responses were shared between OC43 and mouse hepatitis virus in seven serum pairs. Crossreactivity between OC43 and 229E was found in five infants. It is of interest that the seven infants included in the first outbreak of coronavirus described in table 2 all showed infection with 229E alone. At other times the character of the rises in antibody to coronavirus was more heterogeneous.",
            "cite_spans": [],
            "ref_spans": [],
            "section": "The incidence of coronavirus infection in the four clinical LRTD syndromes is shown in table'"
        },
        {
            "text": "Recovery of coronaviruses from infants with acute LRTD. Frozen oropharyngeal swab specimens from nine infants with serologic evidence of infection with 229E alone were thawed and inoculated onto MA-177 monolayers. Seven specimens were from children involved in the outbreak in February and March 1967. Despite multiple blind passages of these specimens, and despite the appearance of suggestive cytopathic changes at certain passage levels, consistent CPE failed to develop. NOTE. Infants were considered positive if virus was recovered or if there was serologic evidence of infection; 231 infants with pneumonia and 149 infants with bronchiolitis were tested. Some infants were positive for more than one virus.",
            "cite_spans": [],
            "ref_spans": [],
            "section": "The incidence of coronavirus infection in the four clinical LRTD syndromes is shown in table'"
        },
        {
            "text": "Specimens from two infants (ages, one and two months) hospitalized with pneumonia on August 11 and August 28, 1967 yielded cytopathic agents on second blind subpassage. The Table 4 . Relative incidence of various respiratory virus infections in infants with pneumonia or bronchiolitis. of the two isolates of virus (strain 1428) detected rises in antibody in nine serum pairs that exhibited rises to strain 229E CF antigen and to no other viral antigens tested. The two homologous serum pairs were included.",
            "cite_spans": [],
            "ref_spans": [
                {
                    "start": 173,
                    "end": 180,
                    "text": "Table 4",
                    "ref_id": null
                }
            ],
            "section": "The incidence of coronavirus infection in the four clinical LRTD syndromes is shown in table'"
        },
        {
            "text": "Coronavirus infections are common in young children hospitalized with pneumonia and bronchiolitis, ranking in frequency only behind respiratory syncytial virus and parainfluenza type 3 infection. This high rate of prevalence clearly does not constitute proof that coronaviruses are causes of bronchiolitis and pneumonia in infants. Indeed, infection might have been incidental to LRTD caused by another agent. In the one previous study that examined this problem [8] infections in control children were common, but the number of such children in the group aged less than 18 months was, as in the present study, too small to be of significance, and the suitability of the \"control\" group was also in question. In the absence of statistically valid data, therefore, other considerations are of importance.",
            "cite_spans": [
                {
                    "start": 463,
                    "end": 466,
                    "text": "[8]",
                    "ref_id": "BIBREF7"
                }
            ],
            "ref_spans": [],
            "section": "Discussion"
        },
        {
            "text": "Two aspects of this study are unique, and provide some argument for the etiologic importance of coronaviruses in LRTD in infants. First, two small outbreaks (i.e., circumscribed periods of increased incidence) of coronavirus infection were defined. In both, coronavirus infections were clearly more common than those due to other respiratory viruses. In the first outbreak, children infected with strain 229E showed no evidence of infection with other respiratory viruses, including other serotypes of human coronavirus. In the second, despite activity of several common respiratory viruses, coronaviruses were predominant.",
            "cite_spans": [],
            "ref_spans": [],
            "section": "Discussion"
        },
        {
            "text": "Second, coronavirus strains were recovered from two children during the acute stage of pneumonia. The strains were antigenically similar or identical to strain 229E, and antibody responses to these strains were demonstrated in the homologous paired sera. These two recoveries of coronavirus are the first reported from infants.",
            "cite_spans": [],
            "ref_spans": [],
            "section": "Discussion"
        },
        {
            "text": "Further studies to identify the role of coronaviruses in infant LRTD seem indicated. At the present time, their role is uncertain. The present study provides data that may implicate coronaviruses in at least a portion of pneumonia and bronchiolitis of young children. The pathogenicity of coronaviruses, which has been demonstrated in adults beyond reasonable doubt by studies in volunteers [19] , is more difficult to prove in children. It is likely that as techniques for recovery and recognition of coronavirus are improved, and as other coronavirus serotypes are discovered, infection will be found more frequently, and the etiologic role of coronaviruses in LR TD of children will be better defined.",
            "cite_spans": [
                {
                    "start": 391,
                    "end": 395,
                    "text": "[19]",
                    "ref_id": "BIBREF19"
                }
            ],
            "ref_spans": [],
            "section": "Discussion"
        }
    ],
    "bib_entries": {
        "BIBREF0": {
            "ref_id": "b0",
            "title": "Incidence and etiology of pneumonia, croup and bronchiolititis in preschool children belonging to a prepaid medical care group over a four-year period",
            "authors": [
                {
                    "first": "H",
                    "middle": [
                        "M"
                    ],
                    "last": "Foy",
                    "suffix": ""
                },
                {
                    "first": "M",
                    "middle": [
                        "K"
                    ],
                    "last": "Cooney",
                    "suffix": ""
                },
                {
                    "first": "A",
                    "middle": [
                        "1"
                    ],
                    "last": "Maletzky",
                    "suffix": ""
                },
                {
                    "first": "J",
                    "middle": [
                        "T"
                    ],
                    "last": "Grayston",
                    "suffix": ""
                }
            ],
            "year": 1973,
            "venue": "Am. J. Epidemiol",
            "volume": "97",
            "issn": "",
            "pages": "80--92",
            "other_ids": {}
        },
        "BIBREF1": {
            "ref_id": "b1",
            "title": "Virus infections and respiratory disease of childhood",
            "authors": [
                {
                    "first": "P",
                    "middle": [
                        "S"
                    ],
                    "last": "Gardner",
                    "suffix": ""
                }
            ],
            "year": 1968,
            "venue": "Arch. Dis. Child",
            "volume": "43",
            "issn": "",
            "pages": "629--645",
            "other_ids": {}
        },
        "BIBREF2": {
            "ref_id": "b2",
            "title": "Studies on the role of viruses, bacteria, and M. pneumoniae as causes of lower respiratory tract infections in children",
            "authors": [
                {
                    "first": "F",
                    "middle": [
                        "A"
                    ],
                    "last": "Loda",
                    "suffix": ""
                },
                {
                    "first": "W",
                    "middle": [
                        "A"
                    ],
                    "last": "Clyde",
                    "suffix": ""
                },
                {
                    "first": "",
                    "middle": [],
                    "last": "Jr",
                    "suffix": ""
                },
                {
                    "first": "W",
                    "middle": [
                        "P"
                    ],
                    "last": "Glezen",
                    "suffix": ""
                },
                {
                    "first": "R",
                    "middle": [
                        "1"
                    ],
                    "last": "Senior",
                    "suffix": ""
                },
                {
                    "first": "C",
                    "middle": [
                        "I"
                    ],
                    "last": "Sheaffer",
                    "suffix": ""
                },
                {
                    "first": "F",
                    "middle": [
                        "W"
                    ],
                    "last": "Denny",
                    "suffix": ""
                },
                {
                    "first": "",
                    "middle": [],
                    "last": "Jr",
                    "suffix": ""
                }
            ],
            "year": 1968,
            "venue": "J. Pediatr",
            "volume": "72",
            "issn": "",
            "pages": "161--176",
            "other_ids": {}
        },
        "BIBREF3": {
            "ref_id": "b3",
            "title": "Mycoplasma pneumoniae and bacteria associated with lower respiratory tract disease among infants",
            "authors": [
                {
                    "first": "M",
                    "middle": [
                        "A"
                    ],
                    "last": "Mufson",
                    "suffix": ""
                },
                {
                    "first": "H",
                    "middle": [
                        "E"
                    ],
                    "last": "Krause",
                    "suffix": ""
                },
                {
                    "first": "H",
                    "middle": [
                        "E"
                    ],
                    "last": "Mocega",
                    "suffix": ""
                },
                {
                    "first": "F",
                    "middle": [
                        "W"
                    ],
                    "last": "Dawson",
                    "suffix": ""
                },
                {
                    "first": "",
                    "middle": [],
                    "last": "Viruses",
                    "suffix": ""
                }
            ],
            "year": 1970,
            "venue": "Am. J. Epidemiol",
            "volume": "91",
            "issn": "",
            "pages": "192--202",
            "other_ids": {}
        },
        "BIBREF4": {
            "ref_id": "b4",
            "title": "Cultivation of a novel type of common cold virus in organ cultures",
            "authors": [
                {
                    "first": "D",
                    "middle": [
                        "A J"
                    ],
                    "last": "Tyrrell",
                    "suffix": ""
                },
                {
                    "first": "M",
                    "middle": [
                        "L"
                    ],
                    "last": "Bynoe",
                    "suffix": ""
                }
            ],
            "year": 1965,
            "venue": "Br. Med. J",
            "volume": "1",
            "issn": "",
            "pages": "1467--1470",
            "other_ids": {}
        },
        "BIBREF5": {
            "ref_id": "b5",
            "title": "A new virus isolated from the human respiratory tract",
            "authors": [
                {
                    "first": "D",
                    "middle": [],
                    "last": "Hamre",
                    "suffix": ""
                },
                {
                    "first": "J",
                    "middle": [
                        "J"
                    ],
                    "last": "Procknow",
                    "suffix": ""
                }
            ],
            "year": 1966,
            "venue": "Proc. Soc. Exp. BioI. Med",
            "volume": "121",
            "issn": "",
            "pages": "190--193",
            "other_ids": {}
        },
        "BIBREF6": {
            "ref_id": "b6",
            "title": "Recovery in tracheal organ cultures of novel viruses from patients with respiratory disease",
            "authors": [
                {
                    "first": "K",
                    "middle": [],
                    "last": "Mcintosh",
                    "suffix": ""
                },
                {
                    "first": "J",
                    "middle": [
                        "H"
                    ],
                    "last": "Dees",
                    "suffix": ""
                },
                {
                    "first": "W",
                    "middle": [
                        "B"
                    ],
                    "last": "Becker",
                    "suffix": ""
                },
                {
                    "first": "A",
                    "middle": [
                        "Z"
                    ],
                    "last": "Kapikian",
                    "suffix": ""
                },
                {
                    "first": "R",
                    "middle": [
                        "M"
                    ],
                    "last": "Chanock",
                    "suffix": ""
                }
            ],
            "year": 1967,
            "venue": "Proc. N atl. Acad. Sci. U.S.A",
            "volume": "57",
            "issn": "",
            "pages": "933--940",
            "other_ids": {}
        },
        "BIBREF7": {
            "ref_id": "b7",
            "title": "Seroepidemiologic studies of coronavirus infection in adults and children",
            "authors": [
                {
                    "first": "K",
                    "middle": [],
                    "last": "Mcintosh",
                    "suffix": ""
                },
                {
                    "first": "A",
                    "middle": [
                        "Z"
                    ],
                    "last": "Kapikian",
                    "suffix": ""
                },
                {
                    "first": "H",
                    "middle": [
                        "C"
                    ],
                    "last": "Turner",
                    "suffix": ""
                },
                {
                    "first": "J",
                    "middle": [
                        "M"
                    ],
                    "last": "Hartley",
                    "suffix": ""
                },
                {
                    "first": "R",
                    "middle": [
                        "H"
                    ],
                    "last": "Parrott",
                    "suffix": ""
                },
                {
                    "first": "R",
                    "middle": [
                        "M"
                    ],
                    "last": "Chanock",
                    "suffix": ""
                }
            ],
            "year": 1970,
            "venue": "Am. J. Epiderniol",
            "volume": "91",
            "issn": "",
            "pages": "585--592",
            "other_ids": {}
        },
        "BIBREF8": {
            "ref_id": "b8",
            "title": "Virologic studies of acute respiratory disease in young adults. V. Coronavirus 229E infections during six years of surveillance",
            "authors": [
                {
                    "first": "D",
                    "middle": [],
                    "last": "Hamre",
                    "suffix": ""
                },
                {
                    "first": "M",
                    "middle": [],
                    "last": "Beem",
                    "suffix": ""
                }
            ],
            "year": 1972,
            "venue": "Am. J. Epidemiol",
            "volume": "96",
            "issn": "",
            "pages": "94--106",
            "other_ids": {}
        },
        "BIBREF9": {
            "ref_id": "b9",
            "title": "Diagnostic procedures for viral and rickettsial infections",
            "authors": [
                {
                    "first": "E",
                    "middle": [
                        "H"
                    ],
                    "last": "Lennette",
                    "suffix": ""
                },
                {
                    "first": "N",
                    "middle": [
                        "J"
                    ],
                    "last": "Schmidt",
                    "suffix": ""
                }
            ],
            "year": 1969,
            "venue": "",
            "volume": "",
            "issn": "",
            "pages": "",
            "other_ids": {}
        },
        "BIBREF10": {
            "ref_id": "b10",
            "title": "The propagation of \"coronaviruses\" in tissue culture",
            "authors": [
                {
                    "first": "A",
                    "middle": [
                        "F"
                    ],
                    "last": "Bradburne",
                    "suffix": ""
                },
                {
                    "first": "D",
                    "middle": [
                        "A J"
                    ],
                    "last": "Tyrrell",
                    "suffix": ""
                }
            ],
            "year": 1969,
            "venue": "Arch. Gesamte Virusforsch",
            "volume": "28",
            "issn": "",
            "pages": "133--150",
            "other_ids": {}
        },
        "BIBREF11": {
            "ref_id": "b11",
            "title": "Growth in suckling mouse brain of \"IBV-like\" viruses from patients with upper respiratory tract disease",
            "authors": [
                {
                    "first": "K",
                    "middle": [],
                    "last": "Mcintosh",
                    "suffix": ""
                },
                {
                    "first": "W",
                    "middle": [
                        "B"
                    ],
                    "last": "Becker",
                    "suffix": ""
                },
                {
                    "first": "R",
                    "middle": [
                        "M"
                    ],
                    "last": "Chanock",
                    "suffix": ""
                }
            ],
            "year": 1967,
            "venue": "Proc. NatI. Acad. Sci. U.S.A",
            "volume": "58",
            "issn": "",
            "pages": "2268--2273",
            "other_ids": {}
        },
        "BIBREF12": {
            "ref_id": "b12",
            "title": "Some characteristics of hemagglutination of certain strains of \"IBV -like\" virus",
            "authors": [
                {
                    "first": "H",
                    "middle": [
                        "S"
                    ],
                    "last": "Kaye",
                    "suffix": ""
                },
                {
                    "first": "W",
                    "middle": [
                        "R"
                    ],
                    "last": "Dowdle",
                    "suffix": ""
                }
            ],
            "year": 1969,
            "venue": "J. Infect. Dis",
            "volume": "120",
            "issn": "",
            "pages": "576--581",
            "other_ids": {}
        },
        "BIBREF13": {
            "ref_id": "b13",
            "title": "Antigenic relationships among the coronaviruses of man and between human and animal coronaviruses",
            "authors": [
                {
                    "first": "K",
                    "middle": [],
                    "last": "Mcintosh",
                    "suffix": ""
                },
                {
                    "first": "A",
                    "middle": [
                        "Z"
                    ],
                    "last": "Kapikian",
                    "suffix": ""
                },
                {
                    "first": "K",
                    "middle": [
                        "A"
                    ],
                    "last": "Hardison",
                    "suffix": ""
                },
                {
                    "first": "J",
                    "middle": [
                        "W"
                    ],
                    "last": "Hartley",
                    "suffix": ""
                },
                {
                    "first": "R",
                    "middle": [
                        "M"
                    ],
                    "last": "Chanock",
                    "suffix": ""
                }
            ],
            "year": 1969,
            "venue": "J. ImmunoI",
            "volume": "102",
            "issn": "",
            "pages": "1109--1118",
            "other_ids": {}
        },
        "BIBREF14": {
            "ref_id": "b14",
            "title": "Antigenic relationships amongst",
            "authors": [
                {
                    "first": "A",
                    "middle": [
                        "F"
                    ],
                    "last": "Bradburne",
                    "suffix": ""
                }
            ],
            "year": null,
            "venue": "",
            "volume": "",
            "issn": "",
            "pages": "",
            "other_ids": {}
        },
        "BIBREF16": {
            "ref_id": "b16",
            "title": "Antibodies to mouse hepatitis viruses in human sera",
            "authors": [
                {
                    "first": "J",
                    "middle": [
                        "W"
                    ],
                    "last": "Hartley",
                    "suffix": ""
                },
                {
                    "first": "W",
                    "middle": [
                        "P"
                    ],
                    "last": "Rowe",
                    "suffix": ""
                },
                {
                    "first": "H",
                    "middle": [
                        "H"
                    ],
                    "last": "Bloom",
                    "suffix": ""
                },
                {
                    "first": "H",
                    "middle": [
                        "C"
                    ],
                    "last": "Turner",
                    "suffix": ""
                }
            ],
            "year": 1964,
            "venue": "Proc. Soc. Exp. BioI. Med",
            "volume": "115",
            "issn": "",
            "pages": "414--418",
            "other_ids": {}
        },
        "BIBREF17": {
            "ref_id": "b17",
            "title": "Isolation from man of \"avian infectious bronchitis virus-like\" viruses (coronaviruses) similar to 229E virus, with some epidemiological observations",
            "authors": [
                {
                    "first": "A",
                    "middle": [
                        "Z"
                    ],
                    "last": "Kapikian",
                    "suffix": ""
                },
                {
                    "first": "H",
                    "middle": [
                        "D"
                    ],
                    "last": "James",
                    "suffix": ""
                },
                {
                    "first": "",
                    "middle": [],
                    "last": "Jr",
                    "suffix": ""
                },
                {
                    "first": "S",
                    "middle": [
                        "J"
                    ],
                    "last": "Kelly",
                    "suffix": ""
                },
                {
                    "first": "J",
                    "middle": [
                        "H"
                    ],
                    "last": "Dees",
                    "suffix": ""
                },
                {
                    "first": "H",
                    "middle": [
                        "C"
                    ],
                    "last": "Turner",
                    "suffix": ""
                },
                {
                    "first": "K",
                    "middle": [],
                    "last": "Mcintosh",
                    "suffix": ""
                },
                {
                    "first": "H",
                    "middle": [
                        "W"
                    ],
                    "last": "Kim",
                    "suffix": ""
                },
                {
                    "first": "R",
                    "middle": [
                        "H"
                    ],
                    "last": "Parrott",
                    "suffix": ""
                },
                {
                    "first": "M",
                    "middle": [
                        "M"
                    ],
                    "last": "Vincent",
                    "suffix": ""
                },
                {
                    "first": "R",
                    "middle": [
                        "M"
                    ],
                    "last": "Chanock",
                    "suffix": ""
                }
            ],
            "year": 1969,
            "venue": "J. Infect. Dis",
            "volume": "119",
            "issn": "",
            "pages": "282--290",
            "other_ids": {}
        },
        "BIBREF18": {
            "ref_id": "b18",
            "title": "Seroepidemiologic survey of coronavirus (strain OC 43) related infections in a children's population",
            "authors": [
                {
                    "first": "H",
                    "middle": [
                        "S"
                    ],
                    "last": "Kaye",
                    "suffix": ""
                },
                {
                    "first": "H",
                    "middle": [
                        "B"
                    ],
                    "last": "Marsh",
                    "suffix": ""
                },
                {
                    "first": "W",
                    "middle": [
                        "R"
                    ],
                    "last": "Dowdle",
                    "suffix": ""
                }
            ],
            "year": 1971,
            "venue": "Am. J. EpidemioI",
            "volume": "94",
            "issn": "",
            "pages": "43--49",
            "other_ids": {}
        },
        "BIBREF19": {
            "ref_id": "b19",
            "title": "Effects of a \"new\" human respiratory virus in volunteers",
            "authors": [
                {
                    "first": "A",
                    "middle": [
                        "F"
                    ],
                    "last": "Bradburne",
                    "suffix": ""
                },
                {
                    "first": "M",
                    "middle": [
                        "L"
                    ],
                    "last": "Bynoe",
                    "suffix": ""
                },
                {
                    "first": "D",
                    "middle": [
                        "A"
                    ],
                    "last": "Tyrrell",
                    "suffix": ""
                }
            ],
            "year": 1967,
            "venue": "Br. Med. J",
            "volume": "3",
            "issn": "",
            "pages": "767--769",
            "other_ids": {}
        }
    },
    "ref_entries": {
        "FIGREF0": {
            "text": "Incidence of coronavirus infection in acute lower respiratory tract disease during the period of study.",
            "latex": null,
            "type": "figure"
        },
        "FIGREF1": {
            "text": "WI38 cells was typical of that described for strain 229E[6].Sonicates  of infected cells showed typical particles of coronavirus (figure 2) by electron microscopy. Guinea pig antiserum to strain 229E neutralized both viruses, and guinea pigs antiserum to one of the two strains neutralized both test viruses and strain 229E. The viruses were chloroform-labile and insensitive to the action of 0.05 M iodo-deoxyuridine. Both viruses were successfully isolated again from the original specimens. CF antigen made from one",
            "latex": null,
            "type": "figure"
        },
        "FIGREF2": {
            "text": "Electron micrographs of characteristic coronavirus particles (strain 1428) recovered from a child with pneumonia (phosphotungstic acid staining, X 129,540). Several particles from the same specimen are shown. Small tail-like protuberances in all four pictures may be artifacts. Bar represents 100 nm.",
            "latex": null,
            "type": "figure"
        },
        "TABREF0": {
            "text": "Relation of age to coronavirus infection.",
            "latex": null,
            "type": "table"
        },
        "TABREF1": {
            "text": "Periods of increased incidence of coronavirus infection.",
            "latex": null,
            "type": "table"
        },
        "TABREF2": {
            "text": "Relation of clinical category of lower respiratory tract disease in infants to coronavirus infection.in six. Diarrhea was seen only once. The right lower lobe was the site of most frequent involvement, as shown by radiographic examination. The average length. of hospital stay was 4.6 days, with a range of one to 16 days.",
            "latex": null,
            "type": "table"
        },
        "TABREF3": {
            "text": "Shared serologic activity of coronavirus in 34 infants with evidence of coronavirus infection .",
            "latex": null,
            "type": "table"
        }
    },
    "back_matter": []
}