{
    "paper_id": "779bc5b3d941add03f4ee7385487bfdacd72d672",
    "metadata": {
        "title": "Journal Pre-proofs In reply to Simcock et al In reply to Simcock et al. Corresponding to",
        "authors": [
            {
                "first": "Stefano",
                "middle": [],
                "last": "Magrini",
                "suffix": "",
                "affiliation": {},
                "email": ""
            },
            {
                "first": "Mazzola",
                "middle": [],
                "last": "Maria",
                "suffix": "",
                "affiliation": {},
                "email": ""
            },
            {
                "first": "Greco",
                "middle": [],
                "last": "Rosario",
                "suffix": "",
                "affiliation": {},
                "email": ""
            },
            {
                "first": "Alongi",
                "middle": [],
                "last": "Diana",
                "suffix": "",
                "affiliation": {},
                "email": ""
            },
            {
                "first": "Buglione",
                "middle": [],
                "last": "Filippo",
                "suffix": "",
                "affiliation": {},
                "email": ""
            },
            {
                "first": "",
                "middle": [],
                "last": "Michela",
                "suffix": "",
                "affiliation": {},
                "email": ""
            },
            {
                "first": "Magrini",
                "middle": [
                    "Stefano"
                ],
                "last": "Maria",
                "suffix": "",
                "affiliation": {
                    "laboratory": "",
                    "institution": "Ospedali Civili Hospital and Brescia University",
                    "location": {
                        "settlement": "Brescia",
                        "country": "Italy"
                    }
                },
                "email": ""
            },
            {
                "first": "Mazzola",
                "middle": [],
                "last": "Rosario",
                "suffix": "",
                "affiliation": {
                    "laboratory": "",
                    "institution": "IRCCS Sacro Cuore Don Calabria Hospital",
                    "location": {
                        "settlement": "Negrar-Verona",
                        "country": "Italy"
                    }
                },
                "email": "rosario.mazzola@hotmail.it"
            },
            {
                "first": "Greco",
                "middle": [],
                "last": "Diana",
                "suffix": "",
                "affiliation": {
                    "laboratory": "",
                    "institution": "Ospedali Civili Hospital and Brescia University",
                    "location": {
                        "settlement": "Brescia",
                        "country": "Italy"
                    }
                },
                "email": ""
            },
            {
                "first": "Alongi",
                "middle": [],
                "last": "Filippo",
                "suffix": "",
                "affiliation": {
                    "laboratory": "",
                    "institution": "Ospedali Civili Hospital and Brescia University",
                    "location": {
                        "settlement": "Brescia",
                        "country": "Italy"
                    }
                },
                "email": ""
            },
            {
                "first": "Buglione",
                "middle": [],
                "last": "Michela",
                "suffix": "",
                "affiliation": {
                    "laboratory": "",
                    "institution": "Ospedali Civili Hospital and Brescia University",
                    "location": {
                        "settlement": "Brescia",
                        "country": "Italy"
                    }
                },
                "email": ""
            },
            {
                "first": "Rosario",
                "middle": [],
                "last": "Mazzola",
                "suffix": "",
                "affiliation": {},
                "email": ""
            }
        ]
    },
    "abstract": [],
    "body_text": [
        {
            "text": "We read with interest the article by Simcock and colleagues [1] . Due to the COVID-19 global pandemic, the Authors [1] report proposals to reduce the related risks for radiotherapy (RT) staff and patients.",
            "cite_spans": [
                {
                    "start": 60,
                    "end": 63,
                    "text": "[1]",
                    "ref_id": "BIBREF0"
                },
                {
                    "start": 115,
                    "end": 118,
                    "text": "[1]",
                    "ref_id": "BIBREF0"
                }
            ],
            "ref_spans": [],
            "section": "Dear Editor"
        },
        {
            "text": "These suggestions summarize a Twitter discussion held by several members of the global radiation oncology community, invited to suggest how to modify Radiation Oncologists behaviors according to the emergency situation, and in particular discussing the possible changes in indications and fractionation for the patients candidate to radiation treatments.",
            "cite_spans": [],
            "ref_spans": [],
            "section": "Dear Editor"
        },
        {
            "text": "The Authors have to be congratulated for their efforts, to suggest practical solutions, and to provide fast guidance in these extraordinary times.",
            "cite_spans": [],
            "ref_spans": [],
            "section": "Dear Editor"
        },
        {
            "text": "However, any proposal of RT schedule variation (especially omission!) needs some caution. Patients denied a treatment -not only life-saving treatments-may be severely damaged if an accurate balance between the risk of uncontrolled cancer progression and that related to COVID-infection have not been carefully evaluated on an individual basis. The latter is very difficult to calculate, as the Authors correctly underline in the paper. Therefore, very detailed indications, summarized in Tables, may possibly convey the misleading message that radiotherapy is not useful in some clinical situations where we are using it; paradoxically, in some cases it is suggested (brain tumors, pancreatic and esophageal cancer, seminoma) to give chemotherapy instead, a treatment that also may well be very difficult to administer to infected patients.",
            "cite_spans": [],
            "ref_spans": [],
            "section": "Dear Editor"
        },
        {
            "text": "Also the definitive omission of RT in selected breast cancer patients due to the lack of survival advantage may be questionable. In fact, the benefit of loco-regional control still remains in low risk breast cancer. Thus, the omission of RT could translate into a higher incidence of local failure in the near future with subsequent radical surgery affecting patients's quality of life [4] . Prostate cancer patients omitting radiotherapy, even if having the same survival results at ten years, face an increased number of treatments for symptomatic progression [5] . Delaying RT in such situations may be wiser.",
            "cite_spans": [
                {
                    "start": 386,
                    "end": 389,
                    "text": "[4]",
                    "ref_id": "BIBREF2"
                },
                {
                    "start": 562,
                    "end": 565,
                    "text": "[5]",
                    "ref_id": "BIBREF3"
                }
            ],
            "ref_spans": [],
            "section": "Dear Editor"
        },
        {
            "text": "Similarly, it is impossible to simply omit symptomatic RT in all patients affected by bone metastases, by replacing it with opioids. In the case of painful bone metastases, the RT benefit is multifactorial: to control pain in cases poorly responsive to opioids, to limit the dose of opioids and their side effects (constipation, nausea\u2026), to prevent the skeletal related events (SRE) such as bone fractures in highrisk bone metastases [6, 7] . In the era of COVID-19, it is not reasonable to clog inpatients wards or emergency areas due to medically unmanageable pain or SRE, only to avoid single fraction radiotherapy.",
            "cite_spans": [
                {
                    "start": 435,
                    "end": 438,
                    "text": "[6,",
                    "ref_id": "BIBREF4"
                },
                {
                    "start": 439,
                    "end": 441,
                    "text": "7]",
                    "ref_id": "BIBREF5"
                }
            ],
            "ref_spans": [],
            "section": "Dear Editor"
        },
        {
            "text": "Therefore, the pros and cons of any single radiation treatment change should be carefully evaluated by radiation oncologists and carefully discussed with each patient. In this scenario, synthetic and documented guidelines are very helpful and provide expert support, but their application should take into account the cost/benefit ratio of the individual treatment (difficult to quantify), the local organizational and cultural constraints, and undoubtedly need to be tailored.",
            "cite_spans": [],
            "ref_spans": [],
            "section": "Dear Editor"
        }
    ],
    "bib_entries": {
        "BIBREF0": {
            "ref_id": "b0",
            "title": "COVID-19: Global Radiation Oncology's Targeted Response for Pandemic Preparedness",
            "authors": [
                {
                    "first": "R",
                    "middle": [],
                    "last": "Simcock",
                    "suffix": ""
                },
                {
                    "first": "T",
                    "middle": [
                        "V"
                    ],
                    "last": "Thomas",
                    "suffix": ""
                },
                {
                    "first": "C",
                    "middle": [
                        "E"
                    ],
                    "last": "Mercy",
                    "suffix": ""
                },
                {
                    "first": "A",
                    "middle": [
                        "R"
                    ],
                    "last": "Filippi",
                    "suffix": ""
                },
                {
                    "first": "M",
                    "middle": [
                        "A"
                    ],
                    "last": "Katz",
                    "suffix": ""
                },
                {
                    "first": "I",
                    "middle": [
                        "J"
                    ],
                    "last": "Pereira",
                    "suffix": ""
                },
                {
                    "first": "H",
                    "middle": [],
                    "last": "Saeed",
                    "suffix": ""
                },
                {
                    "first": "K",
                    "middle": [
                        "D"
                    ],
                    "last": "Miller",
                    "suffix": ""
                },
                {
                    "first": "L",
                    "middle": [],
                    "last": "Nogueira",
                    "suffix": ""
                },
                {
                    "first": "A",
                    "middle": [
                        "B"
                    ],
                    "last": "Mariotto",
                    "suffix": ""
                },
                {
                    "first": "J",
                    "middle": [
                        "H"
                    ],
                    "last": "Rowland",
                    "suffix": ""
                },
                {
                    "first": "K",
                    "middle": [
                        "R"
                    ],
                    "last": "Yabroff",
                    "suffix": ""
                },
                {
                    "first": "C",
                    "middle": [
                        "M"
                    ],
                    "last": "Alfano",
                    "suffix": ""
                }
            ],
            "year": 2019,
            "venue": "Clinical & Translational Radiation Oncology",
            "volume": "69",
            "issn": "5",
            "pages": "363--385",
            "other_ids": {
                "DOI": [
                    "10.1016/j.ctro.2020.03.0092"
                ]
            }
        },
        "BIBREF1": {
            "ref_id": "b1",
            "title": "Personalized--Not Omitted--Radiation Oncology for Breast Cancer",
            "authors": [
                {
                    "first": "A",
                    "middle": [],
                    "last": "Fiorentino",
                    "suffix": ""
                },
                {
                    "first": "R",
                    "middle": [],
                    "last": "Mazzola",
                    "suffix": ""
                },
                {
                    "first": "F",
                    "middle": [],
                    "last": "Ricchetti",
                    "suffix": ""
                },
                {
                    "first": "S",
                    "middle": [],
                    "last": "Fersino",
                    "suffix": ""
                },
                {
                    "first": "Giaj",
                    "middle": [],
                    "last": "Levra",
                    "suffix": ""
                },
                {
                    "first": "N",
                    "middle": [],
                    "last": "Alongi",
                    "suffix": ""
                },
                {
                    "first": "F",
                    "middle": [],
                    "last": "",
                    "suffix": ""
                }
            ],
            "year": 2015,
            "venue": "J Clin Oncol",
            "volume": "33",
            "issn": "36",
            "pages": "4313--4317",
            "other_ids": {}
        },
        "BIBREF2": {
            "ref_id": "b2",
            "title": "Quality of life of early-stage breast cancer patients treated with radical mastectomy or breast-conserving procedures: Results of EORTC Trial 10801. The European Organization for Research and Treatment of Cancer (EORTC), Breast Cancer Co-operative Group (BCCG)",
            "authors": [
                {
                    "first": "D",
                    "middle": [],
                    "last": "Curran",
                    "suffix": ""
                },
                {
                    "first": "J",
                    "middle": [
                        "P"
                    ],
                    "last": "Van Dongen",
                    "suffix": ""
                },
                {
                    "first": "N",
                    "middle": [
                        "K"
                    ],
                    "last": "Aaronson",
                    "suffix": ""
                }
            ],
            "year": 1998,
            "venue": "Eur J Cancer",
            "volume": "34",
            "issn": "",
            "pages": "307--314",
            "other_ids": {}
        },
        "BIBREF3": {
            "ref_id": "b3",
            "title": "10-Year Outcomes after Monitoring, Surgery, or Radiotherapy for Localized Prostate Cancer",
            "authors": [
                {
                    "first": "F",
                    "middle": [
                        "C"
                    ],
                    "last": "Hamdy",
                    "suffix": ""
                },
                {
                    "first": "J",
                    "middle": [
                        "L"
                    ],
                    "last": "Donovan",
                    "suffix": ""
                },
                {
                    "first": "J",
                    "middle": [
                        "A"
                    ],
                    "last": "Lane",
                    "suffix": ""
                },
                {
                    "first": "M",
                    "middle": [],
                    "last": "Mason",
                    "suffix": ""
                },
                {
                    "first": "C",
                    "middle": [],
                    "last": "Metcalfe",
                    "suffix": ""
                },
                {
                    "first": "P",
                    "middle": [],
                    "last": "Holding",
                    "suffix": ""
                }
            ],
            "year": 2016,
            "venue": "N Engl J Med",
            "volume": "375",
            "issn": "15",
            "pages": "1415--1424",
            "other_ids": {}
        },
        "BIBREF4": {
            "ref_id": "b4",
            "title": "Radiotherapy for pain",
            "authors": [
                {
                    "first": "S",
                    "middle": [],
                    "last": "Culleton",
                    "suffix": ""
                },
                {
                    "first": "S",
                    "middle": [],
                    "last": "Kwok",
                    "suffix": ""
                },
                {
                    "first": "E",
                    "middle": [],
                    "last": "Chow",
                    "suffix": ""
                }
            ],
            "year": 2011,
            "venue": "Clin Oncol (R Coll Radiol)",
            "volume": "23",
            "issn": "6",
            "pages": "399--406",
            "other_ids": {}
        },
        "BIBREF5": {
            "ref_id": "b5",
            "title": "Spinal metastases: Is stereotactic body radiation therapy supported by evidences?",
            "authors": [
                {
                    "first": "De",
                    "middle": [],
                    "last": "Bari",
                    "suffix": ""
                },
                {
                    "first": "B",
                    "middle": [],
                    "last": "Alongi",
                    "suffix": ""
                },
                {
                    "first": "F",
                    "middle": [],
                    "last": "Mortellaro",
                    "suffix": ""
                },
                {
                    "first": "G",
                    "middle": [],
                    "last": "Mazzola",
                    "suffix": ""
                },
                {
                    "first": "R",
                    "middle": [],
                    "last": "Schiappacasse",
                    "suffix": ""
                },
                {
                    "first": "L",
                    "middle": [],
                    "last": "Guckenberger",
                    "suffix": ""
                },
                {
                    "first": "M",
                    "middle": [],
                    "last": "",
                    "suffix": ""
                }
            ],
            "year": 2016,
            "venue": "Crit Rev Oncol Hematol",
            "volume": "98",
            "issn": "",
            "pages": "147--58",
            "other_ids": {}
        }
    },
    "ref_entries": {},
    "back_matter": []
}