{
    "paper_id": "PMC7090560",
    "metadata": {
        "title": "Chemokine expression and viral infection of the central nervous system: Regulation of host defense and neuropathology",
        "authors": [
            {
                "first": "Michael",
                "middle": [
                    "T."
                ],
                "last": "Liu",
                "suffix": "",
                "email": null,
                "affiliation": {}
            },
            {
                "first": "Thomas",
                "middle": [
                    "E."
                ],
                "last": "Lane",
                "suffix": "",
                "email": "tlane@uci.edu",
                "affiliation": {}
            }
        ]
    },
    "body_text": [],
    "ref_entries": {},
    "back_matter": [],
    "bib_entries": {
        "BIBREF0": {
            "title": "A Central Role for CD4+ T Cells and RANTES in virus induced central nervous system inflammation and demyelination",
            "authors": [
                {
                    "first": "TE",
                    "middle": [],
                    "last": "Lane",
                    "suffix": ""
                }
            ],
            "year": 2000,
            "venue": "J Virol",
            "volume": "74",
            "issn": "",
            "pages": "1415-1424",
            "other_ids": {
                "DOI": [
                    "10.1128/JVI.74.3.1415-1424.2000"
                ]
            }
        },
        "BIBREF1": {
            "title": "Alterations in cytokine but not chemokine mRNA expression during three distinct Theiler's virus infections",
            "authors": [
                {
                    "first": "DJ",
                    "middle": [],
                    "last": "Theil",
                    "suffix": ""
                }
            ],
            "year": 2000,
            "venue": "J Neuroimmunol",
            "volume": "104",
            "issn": "",
            "pages": "22-30",
            "other_ids": {
                "DOI": [
                    "10.1016/S0165-5728(99)00251-9"
                ]
            }
        },
        "BIBREF2": {
            "title": "Biphasic and regionally-restricted chemokine expression in the central nervous system in the Theiler's virus model of multiple sclerosis",
            "authors": [
                {
                    "first": "PD",
                    "middle": [],
                    "last": "Murray",
                    "suffix": ""
                },
                {
                    "first": "K",
                    "middle": [],
                    "last": "Krivacic",
                    "suffix": ""
                },
                {
                    "first": "A",
                    "middle": [],
                    "last": "Chernosky",
                    "suffix": ""
                },
                {
                    "first": "T",
                    "middle": [],
                    "last": "Wei",
                    "suffix": ""
                },
                {
                    "first": "RM",
                    "middle": [],
                    "last": "Ransohoff",
                    "suffix": ""
                },
                {
                    "first": "M",
                    "middle": [],
                    "last": "Rodriguez",
                    "suffix": ""
                }
            ],
            "year": 2000,
            "venue": "J Neurovirol",
            "volume": "6",
            "issn": "Suppl 1",
            "pages": "44-52",
            "other_ids": {
                "DOI": []
            }
        },
        "BIBREF3": {
            "title": "Coronaviruses: Hepatitus, Peritonitis, and Central Nervous System Disease",
            "authors": [
                {
                    "first": "S",
                    "middle": [],
                    "last": "Perlman",
                    "suffix": ""
                },
                {
                    "first": "T",
                    "middle": [],
                    "last": "Lane",
                    "suffix": ""
                },
                {
                    "first": "M",
                    "middle": [],
                    "last": "Buchmeier",
                    "suffix": ""
                }
            ],
            "year": 2000,
            "venue": "Effects of Microbes on the Immune System",
            "volume": "",
            "issn": "",
            "pages": "339-344",
            "other_ids": {
                "DOI": []
            }
        },
        "BIBREF4": {
            "title": "Cytokine induction during T-cell-mediated clearance of mouse hepatitis virus from neurons in vivo",
            "authors": [
                {
                    "first": "BD",
                    "middle": [],
                    "last": "Pearce",
                    "suffix": ""
                },
                {
                    "first": "MV",
                    "middle": [],
                    "last": "Hobbs",
                    "suffix": ""
                },
                {
                    "first": "TS",
                    "middle": [],
                    "last": "McGraw",
                    "suffix": ""
                },
                {
                    "first": "MJ",
                    "middle": [],
                    "last": "Buchmeier",
                    "suffix": ""
                }
            ],
            "year": 1994,
            "venue": "J Virol",
            "volume": "68",
            "issn": "",
            "pages": "5483-5495",
            "other_ids": {
                "DOI": []
            }
        },
        "BIBREF5": {
            "title": "Pathogenesis of mouse hepatitis virus-induced demyelination",
            "authors": [
                {
                    "first": "JJ",
                    "middle": [],
                    "last": "Houtman",
                    "suffix": ""
                },
                {
                    "first": "JO",
                    "middle": [],
                    "last": "Fleming",
                    "suffix": ""
                }
            ],
            "year": 1996,
            "venue": "J Neurovirol",
            "volume": "2",
            "issn": "",
            "pages": "361-376",
            "other_ids": {
                "DOI": []
            }
        },
        "BIBREF6": {
            "title": "Macrophage infiltration, but not apoptosis, is correlated with immune-mediated demyclination following murine infection with a neurotropic coronavirus",
            "authors": [
                {
                    "first": "GF",
                    "middle": [],
                    "last": "Wu",
                    "suffix": ""
                },
                {
                    "first": "S",
                    "middle": [],
                    "last": "Perlman",
                    "suffix": ""
                }
            ],
            "year": 1999,
            "venue": "J Virol",
            "volume": "73",
            "issn": "10",
            "pages": "8771-8780",
            "other_ids": {
                "DOI": []
            }
        },
        "BIBREF7": {
            "title": "Protection of mice from a lethal coronavirus infection in the central nervous system by adoptive transfer of virus-specific T cell clones",
            "authors": [
                {
                    "first": "K",
                    "middle": [],
                    "last": "Yamaguchi",
                    "suffix": ""
                },
                {
                    "first": "N",
                    "middle": [],
                    "last": "Goto",
                    "suffix": ""
                },
                {
                    "first": "S",
                    "middle": [],
                    "last": "Kyuwa",
                    "suffix": ""
                },
                {
                    "first": "M",
                    "middle": [],
                    "last": "Hayami",
                    "suffix": ""
                },
                {
                    "first": "Y",
                    "middle": [],
                    "last": "Toyoda",
                    "suffix": ""
                }
            ],
            "year": 1991,
            "venue": "J Neuroimmunol",
            "volume": "32",
            "issn": "1",
            "pages": "1-9",
            "other_ids": {
                "DOI": [
                    "10.1016/0165-5728(91)90065-F"
                ]
            }
        },
        "BIBREF8": {
            "title": "",
            "authors": [],
            "year": null,
            "venue": "",
            "volume": "",
            "issn": "",
            "pages": null,
            "other_ids": {
                "DOI": []
            }
        },
        "BIBREF9": {
            "title": "IFN-gamma is required for viral cleatance from central nervous system oligodendroglia",
            "authors": [
                {
                    "first": "B",
                    "middle": [],
                    "last": "Parra",
                    "suffix": ""
                },
                {
                    "first": "DR",
                    "middle": [],
                    "last": "Hinton",
                    "suffix": ""
                },
                {
                    "first": "NW",
                    "middle": [],
                    "last": "Marien",
                    "suffix": ""
                },
                {
                    "first": "CC",
                    "middle": [],
                    "last": "Bergmann",
                    "suffix": ""
                },
                {
                    "first": "MT",
                    "middle": [],
                    "last": "Lin",
                    "suffix": ""
                },
                {
                    "first": "CS",
                    "middle": [],
                    "last": "Yang",
                    "suffix": ""
                },
                {
                    "first": "SA",
                    "middle": [],
                    "last": "Stohlman",
                    "suffix": ""
                }
            ],
            "year": 1999,
            "venue": "J Immunol",
            "volume": "162",
            "issn": "",
            "pages": "1641-1647",
            "other_ids": {
                "DOI": []
            }
        },
        "BIBREF10": {
            "title": "Disassociation between the in vitro and in vivo effects of nitric oxide on a neurotropic murine coronavirus",
            "authors": [
                {
                    "first": "TE",
                    "middle": [],
                    "last": "Lane",
                    "suffix": ""
                },
                {
                    "first": "AD",
                    "middle": [],
                    "last": "Paoletti",
                    "suffix": ""
                },
                {
                    "first": "MJ",
                    "middle": [],
                    "last": "Buchmeier",
                    "suffix": ""
                }
            ],
            "year": 1997,
            "venue": "J. Virol",
            "volume": "71",
            "issn": "",
            "pages": "2202-10",
            "other_ids": {
                "DOI": []
            }
        },
        "BIBREF11": {
            "title": "Culting Edge: The T cell chemoattractant IFN-inducible protein 10 is essential in host defense against viral-induced neurologic disease",
            "authors": [
                {
                    "first": "MT",
                    "middle": [],
                    "last": "Liu",
                    "suffix": ""
                }
            ],
            "year": 2000,
            "venue": "J Immunol",
            "volume": "165",
            "issn": "",
            "pages": "2327-2330",
            "other_ids": {
                "DOI": []
            }
        },
        "BIBREF12": {
            "title": "Temperature sensitive mutants of mouse hepatitis virus produce a high incidence of demyelination",
            "authors": [
                {
                    "first": "M",
                    "middle": [],
                    "last": "Haspel",
                    "suffix": ""
                },
                {
                    "first": "P",
                    "middle": [],
                    "last": "Lampert",
                    "suffix": ""
                },
                {
                    "first": "MBA",
                    "middle": [],
                    "last": "Oldstone",
                    "suffix": ""
                }
            ],
            "year": 1978,
            "venue": "Proc Natl Acad Sci USA",
            "volume": "75",
            "issn": "",
            "pages": "4033-4036",
            "other_ids": {
                "DOI": [
                    "10.1073/pnas.75.8.4033"
                ]
            }
        },
        "BIBREF13": {
            "title": "Pathogenesis of demyelination induced by a mouse hepatitis virus (JHM virus)",
            "authors": [
                {
                    "first": "LP",
                    "middle": [],
                    "last": "Weiner",
                    "suffix": ""
                }
            ],
            "year": 1973,
            "venue": "Arch Neurol",
            "volume": "28",
            "issn": "",
            "pages": "298-303",
            "other_ids": {
                "DOI": []
            }
        },
        "BIBREF14": {
            "title": "CD4 and CD8 T cells have redundant but not identical roles in virus-induced demyelination",
            "authors": [
                {
                    "first": "GF",
                    "middle": [],
                    "last": "Wu",
                    "suffix": ""
                },
                {
                    "first": "AA",
                    "middle": [],
                    "last": "Dandekar",
                    "suffix": ""
                },
                {
                    "first": "L",
                    "middle": [],
                    "last": "Pewe",
                    "suffix": ""
                },
                {
                    "first": "S",
                    "middle": [],
                    "last": "Perlman",
                    "suffix": ""
                }
            ],
            "year": 2000,
            "venue": "J Immunol",
            "volume": "165",
            "issn": "4",
            "pages": "2278-2286",
            "other_ids": {
                "DOI": []
            }
        },
        "BIBREF15": {
            "title": "Demyelination induced by murine hepatitis virus JHM strain (MHV-4) is immunologically mediated",
            "authors": [
                {
                    "first": "FI",
                    "middle": [],
                    "last": "Wang",
                    "suffix": ""
                },
                {
                    "first": "SA",
                    "middle": [],
                    "last": "Stohlman",
                    "suffix": ""
                },
                {
                    "first": "JO",
                    "middle": [],
                    "last": "Fleming",
                    "suffix": ""
                }
            ],
            "year": 1990,
            "venue": "J Neuroimmunol",
            "volume": "30",
            "issn": "1",
            "pages": "31-41",
            "other_ids": {
                "DOI": [
                    "10.1016/0165-5728(90)90050-W"
                ]
            }
        },
        "BIBREF16": {
            "title": "CD8+ myelin peptide-specific T cells can chemoattract CD4+ myeline peptide-specific T cells: importance of IFN-inducible protein 10",
            "authors": [
                {
                    "first": "WE",
                    "middle": [],
                    "last": "Biddison",
                    "suffix": ""
                }
            ],
            "year": 1998,
            "venue": "J Immunol",
            "volume": "160",
            "issn": "",
            "pages": "444-444",
            "other_ids": {
                "DOI": []
            }
        },
        "BIBREF17": {
            "title": "Chemokine receptor specific for 1P-10 and Mig: structure, function, and expression in activated T-lymphocytes",
            "authors": [
                {
                    "first": "M",
                    "middle": [],
                    "last": "Loetscher",
                    "suffix": ""
                },
                {
                    "first": "B",
                    "middle": [],
                    "last": "Gerber",
                    "suffix": ""
                },
                {
                    "first": "P",
                    "middle": [],
                    "last": "Loetscher",
                    "suffix": ""
                },
                {
                    "first": "SA",
                    "middle": [],
                    "last": "Jones",
                    "suffix": ""
                },
                {
                    "first": "L",
                    "middle": [],
                    "last": "Piali",
                    "suffix": ""
                },
                {
                    "first": "IC",
                    "middle": [],
                    "last": "Lewis",
                    "suffix": ""
                },
                {
                    "first": "M",
                    "middle": [],
                    "last": "Baggiolini",
                    "suffix": ""
                },
                {
                    "first": "B",
                    "middle": [],
                    "last": "Moser",
                    "suffix": ""
                }
            ],
            "year": 1996,
            "venue": "J Exp Med",
            "volume": "184",
            "issn": "",
            "pages": "963-969",
            "other_ids": {
                "DOI": [
                    "10.1084/jem.184.3.963"
                ]
            }
        },
        "BIBREF18": {
            "title": "Mig and IP-10: CXC chemokines that target lymphocytes",
            "authors": [
                {
                    "first": "JM",
                    "middle": [],
                    "last": "Farber",
                    "suffix": ""
                }
            ],
            "year": 1997,
            "venue": "J Leuk Biol",
            "volume": "61",
            "issn": "",
            "pages": "246-257",
            "other_ids": {
                "DOI": []
            }
        },
        "BIBREF19": {
            "title": "The chemokine receptor CXCR3 mediates rapid and shear-resistant adhesion-induction of effector T lymphocytes by the chemokines IP-10 and Mig",
            "authors": [
                {
                    "first": "L",
                    "middle": [],
                    "last": "Piali",
                    "suffix": ""
                },
                {
                    "first": "C",
                    "middle": [],
                    "last": "Wever",
                    "suffix": ""
                },
                {
                    "first": "G",
                    "middle": [],
                    "last": "Larasa",
                    "suffix": ""
                },
                {
                    "first": "CR",
                    "middle": [],
                    "last": "Mackay",
                    "suffix": ""
                },
                {
                    "first": "TA",
                    "middle": [],
                    "last": "Springer",
                    "suffix": ""
                },
                {
                    "first": "I",
                    "middle": [],
                    "last": "Clark-Lewis",
                    "suffix": ""
                },
                {
                    "first": "B",
                    "middle": [],
                    "last": "Moser",
                    "suffix": ""
                }
            ],
            "year": 1998,
            "venue": "Eur J Immunol",
            "volume": "28",
            "issn": "",
            "pages": "961-972",
            "other_ids": {
                "DOI": [
                    "10.1002/(SICI)1521-4141(199803)28:03<961::AID-IMMU961>3.0.CO;2-4"
                ]
            }
        },
        "BIBREF20": {
            "title": "The protective role of cytotoxic T cells and interferon against coro-navirus in vasion of the brain",
            "authors": [
                {
                    "first": "E",
                    "middle": [],
                    "last": "Lavi",
                    "suffix": ""
                },
                {
                    "first": "Q",
                    "middle": [],
                    "last": "Wang",
                    "suffix": ""
                }
            ],
            "year": 1995,
            "venue": "Adv Exp Med Biol",
            "volume": "380",
            "issn": "",
            "pages": "145-149",
            "other_ids": {
                "DOI": []
            }
        },
        "BIBREF21": {
            "title": "T-cell-mediated clearance of mouse hepatitis virus strain JHM from the central nervous system",
            "authors": [
                {
                    "first": "MA",
                    "middle": [],
                    "last": "Sussman",
                    "suffix": ""
                },
                {
                    "first": "RA",
                    "middle": [],
                    "last": "Shubin",
                    "suffix": ""
                },
                {
                    "first": "S",
                    "middle": [],
                    "last": "Kyuwa",
                    "suffix": ""
                },
                {
                    "first": "SA",
                    "middle": [],
                    "last": "Stohlman",
                    "suffix": ""
                }
            ],
            "year": 1989,
            "venue": "J Virol",
            "volume": "63",
            "issn": "",
            "pages": "3051-3056",
            "other_ids": {
                "DOI": []
            }
        },
        "BIBREF22": {
            "title": "",
            "authors": [],
            "year": null,
            "venue": "",
            "volume": "",
            "issn": "",
            "pages": null,
            "other_ids": {
                "DOI": []
            }
        },
        "BIBREF23": {
            "title": "Selective attraction of monocytes and T lymphocytes of the memory phenotype by cytokine RANTES",
            "authors": [
                {
                    "first": "TJ",
                    "middle": [],
                    "last": "Schall",
                    "suffix": ""
                },
                {
                    "first": "K",
                    "middle": [],
                    "last": "Bacon",
                    "suffix": ""
                },
                {
                    "first": "KJ",
                    "middle": [],
                    "last": "Toy",
                    "suffix": ""
                },
                {
                    "first": "DV",
                    "middle": [],
                    "last": "Goeddel",
                    "suffix": ""
                }
            ],
            "year": 1990,
            "venue": "Nature",
            "volume": "347",
            "issn": "",
            "pages": "669-671",
            "other_ids": {
                "DOI": [
                    "10.1038/347669a0"
                ]
            }
        },
        "BIBREF24": {
            "title": "Expression of specific chemokines and chemokine receptors in the central nervous system of multiple sclerosis patients",
            "authors": [
                {
                    "first": "T.",
                    "middle": [],
                    "last": "Sorensen",
                    "suffix": ""
                }
            ],
            "year": 1999,
            "venue": "J Clin Invest",
            "volume": "103",
            "issn": "",
            "pages": "807-815",
            "other_ids": {
                "DOI": [
                    "10.1172/JCI5150"
                ]
            }
        },
        "BIBREF25": {
            "title": "Expression of the interferon-\u03b3-inducible chemokines IP-10 and Mig and their receptor, CXCR3, in multiple sclerosis lesions",
            "authors": [
                {
                    "first": "JE",
                    "middle": [],
                    "last": "Simpson",
                    "suffix": ""
                },
                {
                    "first": "J",
                    "middle": [],
                    "last": "Newcombe",
                    "suffix": ""
                },
                {
                    "first": "ML",
                    "middle": [],
                    "last": "Cuzner",
                    "suffix": ""
                },
                {
                    "first": "MN",
                    "middle": [],
                    "last": "Woodroofe",
                    "suffix": ""
                }
            ],
            "year": 2000,
            "venue": "Neuropathol Appl Neurobiol",
            "volume": "26",
            "issn": "",
            "pages": "133-142",
            "other_ids": {
                "DOI": [
                    "10.1046/j.1365-2990.2000.026002133.x"
                ]
            }
        },
        "BIBREF26": {
            "title": "CCR5(+) and CXCR3(+) T cells are increased in multiplesclesosis and their ligands MIP-1 alpha and IP=10 are expressed in demyelinating brain lesions",
            "authors": [
                {
                    "first": "K",
                    "middle": [],
                    "last": "Balashov",
                    "suffix": ""
                },
                {
                    "first": "J",
                    "middle": [],
                    "last": "Rottman",
                    "suffix": ""
                },
                {
                    "first": "H.",
                    "middle": [],
                    "last": "Weiner",
                    "suffix": ""
                },
                {
                    "first": "W",
                    "middle": [],
                    "last": "Hancock",
                    "suffix": ""
                }
            ],
            "year": 1999,
            "venue": "Proc Natl Acad Sci USA",
            "volume": "96",
            "issn": "",
            "pages": "6873-6815",
            "other_ids": {
                "DOI": [
                    "10.1073/pnas.96.12.6873"
                ]
            }
        },
        "BIBREF27": {
            "title": "An important role for the chemokine macrophage inflammatory protein-1 alpha in the pathogenesis of the T cell mediated autoimmune disease, experimental autoimmune encephalomyelitis",
            "authors": [
                {
                    "first": "WJ",
                    "middle": [],
                    "last": "Karpus",
                    "suffix": ""
                },
                {
                    "first": "NW",
                    "middle": [],
                    "last": "Lukacs",
                    "suffix": ""
                },
                {
                    "first": "BL",
                    "middle": [],
                    "last": "McRae",
                    "suffix": ""
                },
                {
                    "first": "RM",
                    "middle": [],
                    "last": "Strieter",
                    "suffix": ""
                },
                {
                    "first": "SL",
                    "middle": [],
                    "last": "Kunkel",
                    "suffix": ""
                },
                {
                    "first": "SD",
                    "middle": [],
                    "last": "Miller",
                    "suffix": ""
                }
            ],
            "year": 1995,
            "venue": "J Immunol",
            "volume": "155",
            "issn": "",
            "pages": "5003-5010",
            "other_ids": {
                "DOI": []
            }
        },
        "BIBREF28": {
            "title": "Acute and relapsing experimental autoimmune encephalomyelitis are regulated by differential expression of the CC chemokines macrophage inflammatory protein-1 alpha and monocyte chemotactic protein-1",
            "authors": [
                {
                    "first": "KJ",
                    "middle": [],
                    "last": "Kennedy",
                    "suffix": ""
                },
                {
                    "first": "RM",
                    "middle": [],
                    "last": "Stricter",
                    "suffix": ""
                },
                {
                    "first": "SL",
                    "middle": [],
                    "last": "Kunkel",
                    "suffix": ""
                },
                {
                    "first": "NW",
                    "middle": [],
                    "last": "Lukacs",
                    "suffix": ""
                },
                {
                    "first": "WJ",
                    "middle": [],
                    "last": "Karpus",
                    "suffix": ""
                }
            ],
            "year": 1998,
            "venue": "J Neuroimmunol",
            "volume": "92",
            "issn": "",
            "pages": "98-108",
            "other_ids": {
                "DOI": [
                    "10.1016/S0165-5728(98)00187-8"
                ]
            }
        },
        "BIBREF29": {
            "title": "Chemokines-chemotactic cytokines that mediate inflammation",
            "authors": [
                {
                    "first": "AD",
                    "middle": [],
                    "last": "Luster",
                    "suffix": ""
                }
            ],
            "year": 1998,
            "venue": "N Engl J Med",
            "volume": "338",
            "issn": "",
            "pages": "436-436",
            "other_ids": {
                "DOI": [
                    "10.1056/NEJM199802123380706"
                ]
            }
        },
        "BIBREF30": {
            "title": "Chemokine receptors gateways to inflammation and infection",
            "authors": [
                {
                    "first": "B.",
                    "middle": [],
                    "last": "Premack",
                    "suffix": ""
                },
                {
                    "first": "T.",
                    "middle": [],
                    "last": "Schall",
                    "suffix": ""
                }
            ],
            "year": 1996,
            "venue": "Nat Med",
            "volume": "2",
            "issn": "",
            "pages": "1174-1174",
            "other_ids": {
                "DOI": [
                    "10.1038/nm1196-1174"
                ]
            }
        },
        "BIBREF31": {
            "title": "Chemokines and T lymphocytes: more than an attraction",
            "authors": [
                {
                    "first": "SG",
                    "middle": [],
                    "last": "Ward",
                    "suffix": ""
                },
                {
                    "first": "K.",
                    "middle": [],
                    "last": "Bacon",
                    "suffix": ""
                },
                {
                    "first": "J",
                    "middle": [],
                    "last": "Westwick",
                    "suffix": ""
                }
            ],
            "year": 1998,
            "venue": "Immunity",
            "volume": "9",
            "issn": "",
            "pages": "1-11",
            "other_ids": {
                "DOI": [
                    "10.1016/S1074-7613(00)80583-X"
                ]
            }
        },
        "BIBREF32": {
            "title": "Role of chemokines in the regulation of Th1/Th2 and autoimmune encephalomyelitis",
            "authors": [
                {
                    "first": "KJ",
                    "middle": [],
                    "last": "Kemedy",
                    "suffix": ""
                },
                {
                    "first": "WJ",
                    "middle": [],
                    "last": "Kampus",
                    "suffix": ""
                }
            ],
            "year": 1999,
            "venue": "J Clin Immunol",
            "volume": "19",
            "issn": "5",
            "pages": "273-279",
            "other_ids": {
                "DOI": [
                    "10.1023/A:1020535423465"
                ]
            }
        },
        "BIBREF33": {
            "title": "Dynamic regulation of alpha and beta chemokine expression in the central nervous system during mouse hepatitis virus-induced demyclinating disease",
            "authors": [
                {
                    "first": "TE",
                    "middle": [],
                    "last": "Lane",
                    "suffix": ""
                }
            ],
            "year": 1998,
            "venue": "J Immunol",
            "volume": "160",
            "issn": "",
            "pages": "970-978",
            "other_ids": {
                "DOI": []
            }
        },
        "BIBREF34": {
            "title": "Chemokine gene expression in the brains of mice with lymphocytic choriomeningitis",
            "authors": [
                {
                    "first": "VC",
                    "middle": [],
                    "last": "Asensio",
                    "suffix": ""
                },
                {
                    "first": "IL",
                    "middle": [],
                    "last": "Camphell",
                    "suffix": ""
                }
            ],
            "year": 1997,
            "venue": "J Virol",
            "volume": "71",
            "issn": "",
            "pages": "7832-7840",
            "other_ids": {
                "DOI": []
            }
        }
    }
}