{
    "paper_id": "PMC7120801",
    "metadata": {
        "title": "Towards Automated TEM for Virus Diagnostics: Segmentation of Grid Squares and Detection of Regions of Interest",
        "authors": [
            {
                "first": "Arnt-B\u00f8rre",
                "middle": [],
                "last": "Salberg",
                "suffix": "",
                "email": "arntbs@nr.no",
                "affiliation": {}
            },
            {
                "first": "Jon",
                "middle": [
                    "Yngve"
                ],
                "last": "Hardeberg",
                "suffix": "",
                "email": "jon.hardeberg@hig.no",
                "affiliation": {}
            },
            {
                "first": "Robert",
                "middle": [],
                "last": "Jenssen",
                "suffix": "",
                "email": "robertj@phys.uit.no",
                "affiliation": {}
            },
            {
                "first": "Gustaf",
                "middle": [],
                "last": "Kylberg",
                "suffix": "",
                "email": "gustaf@cb.uu.se",
                "affiliation": {}
            },
            {
                "first": "Ida-Maria",
                "middle": [],
                "last": "Sintorn",
                "suffix": "",
                "email": "ida.sintorn@cb.uu.se",
                "affiliation": {}
            },
            {
                "first": "Gunilla",
                "middle": [],
                "last": "Borgefors",
                "suffix": "",
                "email": "gunilla@cb.uu.se",
                "affiliation": {}
            }
        ]
    },
    "body_text": [],
    "ref_entries": {},
    "back_matter": [],
    "bib_entries": {
        "BIBREF0": {
            "title": "Electron microscopy for rapid diagnosis of infectious agents in emergent situations",
            "authors": [
                {
                    "first": "P.R.",
                    "middle": [],
                    "last": "Hazelton",
                    "suffix": ""
                },
                {
                    "first": "H.R.",
                    "middle": [],
                    "last": "Gelderblom",
                    "suffix": ""
                }
            ],
            "year": 2003,
            "venue": "Emerg. Infect. Dis.",
            "volume": "9",
            "issn": "3",
            "pages": "294-303",
            "other_ids": {
                "DOI": [
                    "10.3201/eid0903.020327"
                ]
            }
        },
        "BIBREF1": {
            "title": "Automatic particle selection: results of a comparative study",
            "authors": [
                {
                    "first": "Y.",
                    "middle": [],
                    "last": "Zhu",
                    "suffix": ""
                },
                {
                    "first": "B.",
                    "middle": [],
                    "last": "Carragher",
                    "suffix": ""
                },
                {
                    "first": "R.M.",
                    "middle": [],
                    "last": "Glaeser",
                    "suffix": ""
                },
                {
                    "first": "D.",
                    "middle": [],
                    "last": "Fellmann",
                    "suffix": ""
                },
                {
                    "first": "C.",
                    "middle": [],
                    "last": "Bajaj",
                    "suffix": ""
                },
                {
                    "first": "M.",
                    "middle": [],
                    "last": "Bern",
                    "suffix": ""
                },
                {
                    "first": "F.",
                    "middle": [],
                    "last": "Mouche",
                    "suffix": ""
                },
                {
                    "first": "F.",
                    "middle": [],
                    "last": "de Haas",
                    "suffix": ""
                },
                {
                    "first": "R.J.",
                    "middle": [],
                    "last": "Hall",
                    "suffix": ""
                },
                {
                    "first": "D.J.",
                    "middle": [],
                    "last": "Kriegman",
                    "suffix": ""
                },
                {
                    "first": "S.J.",
                    "middle": [],
                    "last": "Ludtke",
                    "suffix": ""
                },
                {
                    "first": "S.P.",
                    "middle": [],
                    "last": "Mallick",
                    "suffix": ""
                },
                {
                    "first": "P.A.",
                    "middle": [],
                    "last": "Penczek",
                    "suffix": ""
                },
                {
                    "first": "A.M.",
                    "middle": [],
                    "last": "Roseman",
                    "suffix": ""
                },
                {
                    "first": "F.J.",
                    "middle": [],
                    "last": "Sigworth",
                    "suffix": ""
                },
                {
                    "first": "N.",
                    "middle": [],
                    "last": "Volkmann",
                    "suffix": ""
                },
                {
                    "first": "C.S.",
                    "middle": [],
                    "last": "Potter",
                    "suffix": ""
                }
            ],
            "year": 2004,
            "venue": "J. Struct. Biol.",
            "volume": "145",
            "issn": "",
            "pages": "3-14",
            "other_ids": {
                "DOI": [
                    "10.1016/j.jsb.2003.09.033"
                ]
            }
        },
        "BIBREF2": {
            "title": "Ch. 10.2.6",
            "authors": [
                {
                    "first": "R.C.",
                    "middle": [],
                    "last": "Gonzalez",
                    "suffix": ""
                },
                {
                    "first": "R.E.",
                    "middle": [],
                    "last": "Woods",
                    "suffix": ""
                }
            ],
            "year": 2006,
            "venue": "Digital Image Processing",
            "volume": "",
            "issn": "",
            "pages": null,
            "other_ids": {
                "DOI": []
            }
        },
        "BIBREF3": {
            "title": "Ch. 5.11.3",
            "authors": [
                {
                    "first": "R.C.",
                    "middle": [],
                    "last": "Gonzalez",
                    "suffix": ""
                },
                {
                    "first": "R.E.",
                    "middle": [],
                    "last": "Woods",
                    "suffix": ""
                }
            ],
            "year": 2006,
            "venue": "Digital Image Processing",
            "volume": "",
            "issn": "",
            "pages": null,
            "other_ids": {
                "DOI": []
            }
        },
        "BIBREF4": {
            "title": "A threshold selection method from gray-level histograms",
            "authors": [
                {
                    "first": "N.",
                    "middle": [],
                    "last": "Otsu",
                    "suffix": ""
                }
            ],
            "year": 1979,
            "venue": "IEEE Trans. Syst. Man Cybern.",
            "volume": "9",
            "issn": "1",
            "pages": "62-66",
            "other_ids": {
                "DOI": [
                    "10.1109/TSMC.1979.4310076"
                ]
            }
        },
        "BIBREF5": {
            "title": "",
            "authors": [],
            "year": null,
            "venue": "",
            "volume": "",
            "issn": "",
            "pages": null,
            "other_ids": {
                "DOI": []
            }
        },
        "BIBREF6": {
            "title": "",
            "authors": [],
            "year": null,
            "venue": "",
            "volume": "",
            "issn": "",
            "pages": null,
            "other_ids": {
                "DOI": []
            }
        },
        "BIBREF7": {
            "title": "Rapid viral diagnosis: role of electron microscopy",
            "authors": [
                {
                    "first": "M.",
                    "middle": [],
                    "last": "Gentile",
                    "suffix": ""
                },
                {
                    "first": "H.R.",
                    "middle": [],
                    "last": "Gelderblom",
                    "suffix": ""
                }
            ],
            "year": 2005,
            "venue": "New Microbiol.",
            "volume": "28",
            "issn": "1",
            "pages": "1-12",
            "other_ids": {
                "DOI": []
            }
        },
        "BIBREF8": {
            "title": "Helmut ruska and the visualisation of viruses",
            "authors": [
                {
                    "first": "D.H.",
                    "middle": [],
                    "last": "Kruger",
                    "suffix": ""
                },
                {
                    "first": "P.",
                    "middle": [],
                    "last": "Schneck",
                    "suffix": ""
                },
                {
                    "first": "H.R.",
                    "middle": [],
                    "last": "Gelderblom",
                    "suffix": ""
                }
            ],
            "year": 2000,
            "venue": "Lancet",
            "volume": "355",
            "issn": "",
            "pages": "1713-1717",
            "other_ids": {
                "DOI": [
                    "10.1016/S0140-6736(00)02250-9"
                ]
            }
        },
        "BIBREF9": {
            "title": "The detection of monkeypox in humans in the western hemispher",
            "authors": [
                {
                    "first": "K.D.",
                    "middle": [],
                    "last": "Reed",
                    "suffix": ""
                },
                {
                    "first": "J.W.",
                    "middle": [],
                    "last": "Melski",
                    "suffix": ""
                },
                {
                    "first": "M.B.",
                    "middle": [],
                    "last": "Graham",
                    "suffix": ""
                },
                {
                    "first": "R.L.",
                    "middle": [],
                    "last": "Regnery",
                    "suffix": ""
                },
                {
                    "first": "M.J.",
                    "middle": [],
                    "last": "Sotir",
                    "suffix": ""
                },
                {
                    "first": "M.V.",
                    "middle": [],
                    "last": "Wegner",
                    "suffix": ""
                },
                {
                    "first": "J.J.",
                    "middle": [],
                    "last": "Kazmierczak",
                    "suffix": ""
                },
                {
                    "first": "E.J.",
                    "middle": [],
                    "last": "Stratman",
                    "suffix": ""
                },
                {
                    "first": "Y.",
                    "middle": [],
                    "last": "Li",
                    "suffix": ""
                },
                {
                    "first": "J.A.",
                    "middle": [],
                    "last": "Fairley",
                    "suffix": ""
                },
                {
                    "first": "G.R.",
                    "middle": [],
                    "last": "Swain",
                    "suffix": ""
                },
                {
                    "first": "V.A.",
                    "middle": [],
                    "last": "Olson",
                    "suffix": ""
                },
                {
                    "first": "E.K.",
                    "middle": [],
                    "last": "Sargent",
                    "suffix": ""
                },
                {
                    "first": "S.C.",
                    "middle": [],
                    "last": "Kehl",
                    "suffix": ""
                },
                {
                    "first": "M.A.",
                    "middle": [],
                    "last": "Frace",
                    "suffix": ""
                },
                {
                    "first": "R.",
                    "middle": [],
                    "last": "Kline",
                    "suffix": ""
                },
                {
                    "first": "S.L.",
                    "middle": [],
                    "last": "Foldy",
                    "suffix": ""
                },
                {
                    "first": "J.P.",
                    "middle": [],
                    "last": "Davis",
                    "suffix": ""
                },
                {
                    "first": "I.K.",
                    "middle": [],
                    "last": "Damon",
                    "suffix": ""
                }
            ],
            "year": 2004,
            "venue": "N. Engl. J. Med.",
            "volume": "350",
            "issn": "4",
            "pages": "342-350",
            "other_ids": {
                "DOI": [
                    "10.1056/NEJMoa032299"
                ]
            }
        },
        "BIBREF10": {
            "title": "A novel coronavirus associated with severe acute respiratory syndrome",
            "authors": [
                {
                    "first": "T.G.",
                    "middle": [],
                    "last": "Ksiazek",
                    "suffix": ""
                },
                {
                    "first": "D.",
                    "middle": [],
                    "last": "Erdman",
                    "suffix": ""
                },
                {
                    "first": "C.S.",
                    "middle": [],
                    "last": "Goldsmith",
                    "suffix": ""
                },
                {
                    "first": "S.R.",
                    "middle": [],
                    "last": "Zaki",
                    "suffix": ""
                },
                {
                    "first": "T.",
                    "middle": [],
                    "last": "Peret",
                    "suffix": ""
                },
                {
                    "first": "S.",
                    "middle": [],
                    "last": "Emery",
                    "suffix": ""
                },
                {
                    "first": "S.",
                    "middle": [],
                    "last": "Tong",
                    "suffix": ""
                },
                {
                    "first": "C.",
                    "middle": [],
                    "last": "Urbani",
                    "suffix": ""
                },
                {
                    "first": "J.A.",
                    "middle": [],
                    "last": "Comer",
                    "suffix": ""
                },
                {
                    "first": "W.",
                    "middle": [],
                    "last": "Lim",
                    "suffix": ""
                },
                {
                    "first": "P.E.",
                    "middle": [],
                    "last": "Rollin",
                    "suffix": ""
                },
                {
                    "first": "K.H.",
                    "middle": [],
                    "last": "Ngheim",
                    "suffix": ""
                },
                {
                    "first": "S.",
                    "middle": [],
                    "last": "Dowell",
                    "suffix": ""
                },
                {
                    "first": "A.E.",
                    "middle": [],
                    "last": "Ling",
                    "suffix": ""
                },
                {
                    "first": "C.",
                    "middle": [],
                    "last": "Humphrey",
                    "suffix": ""
                },
                {
                    "first": "W.J.",
                    "middle": [],
                    "last": "Shieh",
                    "suffix": ""
                },
                {
                    "first": "J.",
                    "middle": [],
                    "last": "Guarner",
                    "suffix": ""
                },
                {
                    "first": "C.D.",
                    "middle": [],
                    "last": "Paddock",
                    "suffix": ""
                },
                {
                    "first": "P.",
                    "middle": [],
                    "last": "Rota",
                    "suffix": ""
                },
                {
                    "first": "B.",
                    "middle": [],
                    "last": "Fields",
                    "suffix": ""
                },
                {
                    "first": "J.",
                    "middle": [],
                    "last": "DeRisi",
                    "suffix": ""
                },
                {
                    "first": "J.Y.",
                    "middle": [],
                    "last": "Yang",
                    "suffix": ""
                },
                {
                    "first": "N.",
                    "middle": [],
                    "last": "Cox",
                    "suffix": ""
                },
                {
                    "first": "J.",
                    "middle": [],
                    "last": "Hughes",
                    "suffix": ""
                },
                {
                    "first": "J.W.",
                    "middle": [],
                    "last": "LeDuc",
                    "suffix": ""
                },
                {
                    "first": "W.J.",
                    "middle": [],
                    "last": "Bellini",
                    "suffix": ""
                },
                {
                    "first": "L.J.",
                    "middle": [],
                    "last": "Anderson",
                    "suffix": ""
                }
            ],
            "year": 2003,
            "venue": "N. Engl. J. Med.",
            "volume": "348",
            "issn": "",
            "pages": "1953-1966",
            "other_ids": {
                "DOI": [
                    "10.1056/NEJMoa030781"
                ]
            }
        },
        "BIBREF11": {
            "title": "Automated molecular microscopy: The new Leginon system",
            "authors": [
                {
                    "first": "C.",
                    "middle": [],
                    "last": "Suloway",
                    "suffix": ""
                },
                {
                    "first": "J.",
                    "middle": [],
                    "last": "Pulokas",
                    "suffix": ""
                },
                {
                    "first": "D.",
                    "middle": [],
                    "last": "Fellmann",
                    "suffix": ""
                },
                {
                    "first": "A.",
                    "middle": [],
                    "last": "Cheng",
                    "suffix": ""
                },
                {
                    "first": "F.",
                    "middle": [],
                    "last": "Guerra",
                    "suffix": ""
                },
                {
                    "first": "J.",
                    "middle": [],
                    "last": "Quispe",
                    "suffix": ""
                },
                {
                    "first": "S.",
                    "middle": [],
                    "last": "Stagg",
                    "suffix": ""
                },
                {
                    "first": "C.S.",
                    "middle": [],
                    "last": "Potter",
                    "suffix": ""
                },
                {
                    "first": "B.",
                    "middle": [],
                    "last": "Carragher",
                    "suffix": ""
                }
            ],
            "year": 2005,
            "venue": "J. Struct. Biol.",
            "volume": "151",
            "issn": "",
            "pages": "41-60",
            "other_ids": {
                "DOI": [
                    "10.1016/j.jsb.2005.03.010"
                ]
            }
        },
        "BIBREF12": {
            "title": "Automated acquisition of cryo-electron micrographs for single particle reconstruction on an fei Tecnai electron microscope",
            "authors": [
                {
                    "first": "J.",
                    "middle": [],
                    "last": "Lei",
                    "suffix": ""
                },
                {
                    "first": "J.",
                    "middle": [],
                    "last": "Frank",
                    "suffix": ""
                }
            ],
            "year": 2005,
            "venue": "J. Struct. Biol.",
            "volume": "150",
            "issn": "1",
            "pages": "69-80",
            "other_ids": {
                "DOI": [
                    "10.1016/j.jsb.2005.01.002"
                ]
            }
        },
        "BIBREF13": {
            "title": "Automated 100-position specimen loader and image acquisition system for transmission electron microscopy",
            "authors": [
                {
                    "first": "J.",
                    "middle": [],
                    "last": "Lefman",
                    "suffix": ""
                },
                {
                    "first": "R.",
                    "middle": [],
                    "last": "Morrison",
                    "suffix": ""
                },
                {
                    "first": "S.",
                    "middle": [],
                    "last": "Subramaniam",
                    "suffix": ""
                }
            ],
            "year": 2007,
            "venue": "J. Struct. Biol.",
            "volume": "158",
            "issn": "3",
            "pages": "318-326",
            "other_ids": {
                "DOI": [
                    "10.1016/j.jsb.2006.11.007"
                ]
            }
        },
        "BIBREF14": {
            "title": "Automated data collection with a tecnai 12 electron microscope: Applications for molecular imaging by cryomicroscopy",
            "authors": [
                {
                    "first": "P.",
                    "middle": [],
                    "last": "Zhang",
                    "suffix": ""
                },
                {
                    "first": "A.",
                    "middle": [],
                    "last": "Beatty",
                    "suffix": ""
                },
                {
                    "first": "J.L.S.",
                    "middle": [],
                    "last": "Milne",
                    "suffix": ""
                },
                {
                    "first": "S.",
                    "middle": [],
                    "last": "Subramaniam",
                    "suffix": ""
                }
            ],
            "year": 2001,
            "venue": "J. Struct. Biol.",
            "volume": "135",
            "issn": "",
            "pages": "251-261",
            "other_ids": {
                "DOI": [
                    "10.1006/jsbi.2001.4404"
                ]
            }
        }
    }
}