{
    "paper_id": "772dc0d55dba558c45e2282bb11dc625fe274511",
    "metadata": {
        "title": "\u2022 Wang et al Intensive Care Unit, Anhui No. 2 Province People's Hospital, 17 Intensive Care Unit",
        "authors": [
            {
                "first": "Yeming",
                "middle": [],
                "last": "Wang",
                "suffix": "",
                "affiliation": {
                    "laboratory": "",
                    "institution": "Xuanwu Hospital of Capital Medical University",
                    "location": {}
                },
                "email": ""
            },
            {
                "first": "Qiang",
                "middle": [],
                "last": "Guo",
                "suffix": "",
                "affiliation": {
                    "laboratory": "",
                    "institution": "First Affiliated Hospital of Soochow University",
                    "location": {}
                },
                "email": ""
            },
            {
                "first": "Zheng",
                "middle": [],
                "last": "Yan",
                "suffix": "",
                "affiliation": {
                    "laboratory": "Intensive Care Unit",
                    "institution": "Wuxi People's Hospital",
                    "location": {
                        "settlement": "Wuxi"
                    }
                },
                "email": ""
            },
            {
                "first": "Daming",
                "middle": [],
                "last": "Zhou",
                "suffix": "",
                "affiliation": {
                    "laboratory": "Intensive Care Unit",
                    "institution": "Taizhou People's Hospital",
                    "location": {
                        "settlement": "Taizhou"
                    }
                },
                "email": ""
            },
            {
                "first": "Wei",
                "middle": [],
                "last": "Zhang",
                "suffix": "",
                "affiliation": {
                    "laboratory": "",
                    "institution": "First Affiliated Hospital of Nanchang University",
                    "location": {
                        "settlement": "Nanchang"
                    }
                },
                "email": ""
            },
            {
                "first": "Shujun",
                "middle": [],
                "last": "Zhou",
                "suffix": "",
                "affiliation": {
                    "laboratory": "",
                    "institution": "Third Affiliated Hospital of Soochow University",
                    "location": {
                        "settlement": "Changzhou"
                    }
                },
                "email": ""
            },
            {
                "first": "Yu-Ping",
                "middle": [],
                "last": "Li",
                "suffix": "",
                "affiliation": {
                    "laboratory": "",
                    "institution": "First Affiliated Hospital of Wenzhou Medical University",
                    "location": {
                        "settlement": "Wenzhou"
                    }
                },
                "email": ""
            },
            {
                "first": "Jing",
                "middle": [],
                "last": "Yuan",
                "suffix": "",
                "affiliation": {
                    "laboratory": "",
                    "institution": "Shenzhen Third People's Hospital",
                    "location": {
                        "settlement": "Shenzhen"
                    }
                },
                "email": ""
            },
            {
                "first": "Timothy",
                "middle": [
                    "M"
                ],
                "last": "Uyeki",
                "suffix": "",
                "affiliation": {},
                "email": ""
            },
            {
                "first": "Xinghua",
                "middle": [],
                "last": "Shen",
                "suffix": "",
                "affiliation": {},
                "email": ""
            },
            {
                "first": "Wenjuan",
                "middle": [],
                "last": "Wu",
                "suffix": "",
                "affiliation": {
                    "laboratory": "Intensive Care Unit",
                    "institution": "Wuhan Medical Treatment Center Hospital",
                    "location": {
                        "settlement": "Wuhan"
                    }
                },
                "email": ""
            },
            {
                "first": "Hui",
                "middle": [],
                "last": "Zhao",
                "suffix": "",
                "affiliation": {
                    "laboratory": "",
                    "institution": "Second Affiliated Hospital of Anhui Medical University",
                    "location": {
                        "addrLine": "16"
                    }
                },
                "email": ""
            },
            {
                "first": "Yun-Fu",
                "middle": [],
                "last": "Wu",
                "suffix": "",
                "affiliation": {
                    "laboratory": "Intensive Care Unit",
                    "institution": "Suzhou Municipal Hospital",
                    "location": {
                        "settlement": "Soochow"
                    }
                },
                "email": ""
            },
            {
                "first": "Jia",
                "middle": [],
                "last": "Shang",
                "suffix": "",
                "affiliation": {
                    "laboratory": "",
                    "institution": "Suining Central Hospital",
                    "location": {
                        "postCode": "20, 21",
                        "settlement": "Zhengzhou, Suining"
                    }
                },
                "email": ""
            },
            {
                "first": "Zhengguang",
                "middle": [],
                "last": "He",
                "suffix": "",
                "affiliation": {},
                "email": ""
            },
            {
                "first": "Yi",
                "middle": [],
                "last": "Yang",
                "suffix": "",
                "affiliation": {},
                "email": ""
            },
            {
                "first": "Hongsheng",
                "middle": [],
                "last": "Zhao",
                "suffix": "",
                "affiliation": {},
                "email": ""
            },
            {
                "first": "Yongqing",
                "middle": [],
                "last": "Hong",
                "suffix": "",
                "affiliation": {},
                "email": ""
            },
            {
                "first": "Zehua",
                "middle": [],
                "last": "Zhang",
                "suffix": "",
                "affiliation": {},
                "email": ""
            },
            {
                "first": "Min",
                "middle": [],
                "last": "Wu",
                "suffix": "",
                "affiliation": {},
                "email": ""
            },
            {
                "first": "Tiemin",
                "middle": [],
                "last": "Wei",
                "suffix": "",
                "affiliation": {},
                "email": ""
            },
            {
                "first": "Xilong",
                "middle": [],
                "last": "Deng",
                "suffix": "",
                "affiliation": {},
                "email": ""
            },
            {
                "first": "Yijun",
                "middle": [],
                "last": "Deng",
                "suffix": "",
                "affiliation": {},
                "email": ""
            },
            {
                "first": "Li-Hua",
                "middle": [],
                "last": "Cai",
                "suffix": "",
                "affiliation": {},
                "email": ""
            },
            {
                "first": "Weihua",
                "middle": [],
                "last": "Lu",
                "suffix": "",
                "affiliation": {
                    "laboratory": "Intensive Care Unit, First Affiliated Hospital of Wannan Medical College",
                    "institution": "Yijishan Hospital",
                    "location": {
                        "settlement": "Wuhu"
                    }
                },
                "email": ""
            },
            {
                "first": "Hongmei",
                "middle": [],
                "last": "Shu",
                "suffix": "",
                "affiliation": {
                    "laboratory": "",
                    "institution": "Anqing Municipal Hospital",
                    "location": {
                        "postCode": "32",
                        "settlement": "Anqing"
                    }
                },
                "email": ""
            },
            {
                "first": "Lin",
                "middle": [],
                "last": "Zhang",
                "suffix": "",
                "affiliation": {},
                "email": ""
            },
            {
                "first": "Hong",
                "middle": [],
                "last": "Luo",
                "suffix": "",
                "affiliation": {},
                "email": ""
            },
            {
                "first": "Ying",
                "middle": [],
                "last": "Zhou",
                "suffix": "",
                "affiliation": {},
                "email": ""
            },
            {
                "first": "Heng",
                "middle": [],
                "last": "Weng",
                "suffix": "",
                "affiliation": {
                    "laboratory": "",
                    "institution": "Fuzhou Pulmonary Hospital of Fujian",
                    "location": {
                        "addrLine": "35 Bozhou People's Hospital",
                        "settlement": "Fuzhou, Bozhou"
                    }
                },
                "email": ""
            },
            {
                "first": "Keyi",
                "middle": [],
                "last": "Song",
                "suffix": "",
                "affiliation": {},
                "email": ""
            },
            {
                "first": "Li",
                "middle": [],
                "last": "Yao",
                "suffix": "",
                "affiliation": {},
                "email": ""
            },
            {
                "first": "Mingguang",
                "middle": [],
                "last": "Jiang",
                "suffix": "",
                "affiliation": {},
                "email": ""
            },
            {
                "first": "Boliang",
                "middle": [],
                "last": "Zhao",
                "suffix": "",
                "affiliation": {},
                "email": ""
            },
            {
                "first": "Ruibin",
                "middle": [],
                "last": "Chi",
                "suffix": "",
                "affiliation": {
                    "laboratory": "",
                    "institution": "Xiaolan People's Hospital of Zhongshan",
                    "location": {
                        "postCode": "39",
                        "settlement": "Zhongshan"
                    }
                },
                "email": ""
            },
            {
                "first": "Boqi",
                "middle": [],
                "last": "Guo",
                "suffix": "",
                "affiliation": {},
                "email": ""
            },
            {
                "first": "Lin",
                "middle": [],
                "last": "Fu",
                "suffix": "",
                "affiliation": {
                    "laboratory": "Intensive Care Unit, First People's Hospital of Xiangtan City, Xiangtan, 41 Infectious Diseases Department, Lu'an People's Hospital, Lu'an, 42 Yunnan Provincial Infectious Disease Hospital",
                    "institution": "Wenzhou Medical University",
                    "location": {
                        "postCode": "43, 44",
                        "settlement": "Kunming, Yueqing"
                    }
                },
                "email": ""
            },
            {
                "first": "Long",
                "middle": [],
                "last": "Yu",
                "suffix": "",
                "affiliation": {},
                "email": ""
            },
            {
                "first": "Haiyan",
                "middle": [],
                "last": "Min",
                "suffix": "",
                "affiliation": {},
                "email": ""
            },
            {
                "first": "Pu",
                "middle": [],
                "last": "Chen",
                "suffix": "",
                "affiliation": {},
                "email": ""
            },
            {
                "first": "Shuifang",
                "middle": [],
                "last": "Chen",
                "suffix": "",
                "affiliation": {},
                "email": ""
            },
            {
                "first": "Liang",
                "middle": [],
                "last": "Hong",
                "suffix": "",
                "affiliation": {},
                "email": ""
            },
            {
                "first": "Wei",
                "middle": [],
                "last": "Mao",
                "suffix": "",
                "affiliation": {},
                "email": ""
            },
            {
                "first": "Xiaoping",
                "middle": [],
                "last": "Huang",
                "suffix": "",
                "affiliation": {
                    "laboratory": "",
                    "institution": "Ningbo First Hospital",
                    "location": {
                        "addrLine": "Rui'an, and 47",
                        "postCode": "46",
                        "settlement": "Ningbo"
                    }
                },
                "email": ""
            },
            {
                "first": "Lijun",
                "middle": [],
                "last": "Gu",
                "suffix": "",
                "affiliation": {},
                "email": ""
            },
            {
                "first": "Hui",
                "middle": [],
                "last": "Li",
                "suffix": "",
                "affiliation": {
                    "laboratory": "",
                    "institution": "National Clinical Research Center for Respiratory Diseases",
                    "location": {}
                },
                "email": ""
            },
            {
                "first": "Chen",
                "middle": [],
                "last": "Wang",
                "suffix": "",
                "affiliation": {
                    "laboratory": "",
                    "institution": "National Clinical Research Center for Respiratory Diseases",
                    "location": {}
                },
                "email": ""
            },
            {
                "first": "Bin",
                "middle": [],
                "last": "Cao",
                "suffix": "",
                "affiliation": {
                    "laboratory": "",
                    "institution": "National Clinical Research Center for Respiratory Diseases",
                    "location": {}
                },
                "email": ""
            }
        ]
    },
    "abstract": [
        {
            "text": "Background. Data are limited on the impact of neuraminidase inhibitor (NAI) treatment on avian influenza A(H7N9) virus RNA shedding.",
            "cite_spans": [],
            "ref_spans": [],
            "section": "Abstract"
        },
        {
            "text": "Methods. In this multicenter, retrospective study, data were collected from adults hospitalized with A(H7N9) infection during 2013-2017 in China. We compared clinical features and A(H7N9) shedding among patients with different NAI doses and combination therapies and evaluated factors associated with A(H7N9) shedding, using Cox proportional hazards regression.",
            "cite_spans": [],
            "ref_spans": [],
            "section": "Abstract"
        },
        {
            "text": "Results. Among 478 patients, the median age was 56 years, 71% were male, and 37% died. The median time from illness onset to NAI treatment initiation was 8 days (interquartile range [IQR], 6-10 days), and the median duration of A(H7N9) RNA detection from onset was 15.5 days (IQR, 12-20 days). A(H7N9) RNA shedding was shorter in survivors than in patients who died (P < .001). Corticosteroid administration (hazard ratio [HR], 0.62 [95% confidence interval {CI}, .50-.77]) and delayed NAI treatment (HR, 0.90 [95% CI,(91)(92)(93)(94)(95)(96)) were independent risk factors for prolonged A(H7N9) shedding. There was no significant difference in A(H7N9) shedding duration between NAI combination treatment and monotherapy (P = .65) or between standard-dose and double-dose oseltamivir treatment (P = .70).",
            "cite_spans": [],
            "ref_spans": [],
            "section": "Abstract"
        },
        {
            "text": "Conclusions. Corticosteroid therapy and delayed NAI treatment were associated with prolonged A(H7N9) RNA shedding. NAI combination therapy and double-dose oseltamivir treatment were not associated with a reduced A(H7N9) shedding duration as compared to standard-dose oseltamivir.",
            "cite_spans": [],
            "ref_spans": [],
            "section": "Abstract"
        }
    ],
    "body_text": [
        {
            "text": "Factors contributing to the pathogenesis of influenza virus infection include direct injury caused by infection and viral replication in respiratory epithelial cells and immunopathology induced by cytokine dysregulation [8, 9] . Observational studies have reported that prolonged influenza viral shedding in the respiratory tract is associated with severe outcomes of patients with seasonal influenza [10] and that early initiation of antiviral treatment with neuraminidase inhibitors (NAIs) for patients infected with 2009 pandemic influenza A(H1N1) virus (A[H1N1] pdm09) has a survival benefit [11] [12] [13] [14] [15] [16] [17] . The viral shedding duration among patients with seasonal or pandemic influenza has been reported to be associated with corticosteroid administration, delayed NAI treatment, and comorbidities [10, 18] .",
            "cite_spans": [
                {
                    "start": 220,
                    "end": 223,
                    "text": "[8,",
                    "ref_id": "BIBREF7"
                },
                {
                    "start": 224,
                    "end": 226,
                    "text": "9]",
                    "ref_id": "BIBREF8"
                },
                {
                    "start": 401,
                    "end": 405,
                    "text": "[10]",
                    "ref_id": "BIBREF9"
                },
                {
                    "start": 596,
                    "end": 600,
                    "text": "[11]",
                    "ref_id": "BIBREF10"
                },
                {
                    "start": 601,
                    "end": 605,
                    "text": "[12]",
                    "ref_id": "BIBREF11"
                },
                {
                    "start": 606,
                    "end": 610,
                    "text": "[13]",
                    "ref_id": "BIBREF12"
                },
                {
                    "start": 611,
                    "end": 615,
                    "text": "[14]",
                    "ref_id": "BIBREF13"
                },
                {
                    "start": 616,
                    "end": 620,
                    "text": "[15]",
                    "ref_id": "BIBREF14"
                },
                {
                    "start": 621,
                    "end": 625,
                    "text": "[16]",
                    "ref_id": "BIBREF15"
                },
                {
                    "start": 626,
                    "end": 630,
                    "text": "[17]",
                    "ref_id": "BIBREF16"
                },
                {
                    "start": 824,
                    "end": 828,
                    "text": "[10,",
                    "ref_id": "BIBREF9"
                },
                {
                    "start": 829,
                    "end": 832,
                    "text": "18]",
                    "ref_id": "BIBREF17"
                }
            ],
            "ref_spans": [],
            "section": ""
        },
        {
            "text": "NAI treatment of A(H7N9)-infected patients in China has included standard-or double-dose oseltamivir monotherapy, as well as combination NAI treatment with oseltamivir and peramivir. Corticosteroids have also been administered to most A(H7N9)-infected patients. Recently, a single institution study reported that A(H7N9) viral shedding duration was shorter and that mortality was lower with early initiation of NAI treatment [19] . However, the study did not assess the impact of different NAI drug doses, combination NAI treatment, or corticosteroid therapy on the duration of A(H7N9) shedding.",
            "cite_spans": [
                {
                    "start": 425,
                    "end": 429,
                    "text": "[19]",
                    "ref_id": "BIBREF18"
                }
            ],
            "ref_spans": [],
            "section": ""
        },
        {
            "text": "We conducted a retrospective, multicenter study of 478 hospitalized patients with laboratory-confirmed A(H7N9) infection who were identified during April 2013-March 2017 to assess the impact of different NAI treatment strategies and corticosteroid treatment on the duration of A(H7N9) shedding.",
            "cite_spans": [],
            "ref_spans": [],
            "section": ""
        },
        {
            "text": "Data collection and analysis were coordinated by the Chinese National Health and Family Planning Commission. The subjects included in the study were patients with laboratory-confirmed A(H7N9) infection diagnosed from 1 April 2013 to 1 March 2017. The study subjects were expanded from the cohort of 288 hospitalized A(H7N9)-infected patients with pneumonia during April 2013-March 2015 that was previously analyzed to assess the impact of corticosteroids upon mortality and A(H7N9) shedding [20] . The electronic medical records of patients were sent to a data collection center in Beijing, China. Demographic data, comorbidities, vital signs, laboratory findings at admission, virological test results, and treatments were reviewed by a trained team of physicians and medical students and entered in duplicate into a computerized database. As noted previously, the collection of data from A(H7N9)-infected patients was determined to comprise public health surveillance in China, and institutional review board assessment was waived [20, 21] .",
            "cite_spans": [
                {
                    "start": 491,
                    "end": 495,
                    "text": "[20]",
                    "ref_id": "BIBREF19"
                },
                {
                    "start": 1033,
                    "end": 1037,
                    "text": "[20,",
                    "ref_id": "BIBREF19"
                },
                {
                    "start": 1038,
                    "end": 1041,
                    "text": "21]",
                    "ref_id": "BIBREF20"
                }
            ],
            "ref_spans": [],
            "section": "Data Collection"
        },
        {
            "text": "A(H7N9) infection was confirmed in all patients by testing respiratory specimens with a real-time reverse transcription-polymerase chain reaction (RT-PCR) assay at the local laboratory of the Chinese Center for Disease Control and Prevention. Respiratory specimens (nasopharyngeal swab specimens, sputum specimens, endotracheal aspirates, or bronchoalveolar lavage fluid) were collected daily for detection of A(H7N9) RNA by real-time RT-PCR. Details of laboratory confirmation of A(H7N9) were described previously [21] . Respiratory specimens with cycle threshold (Ct) values of \u226438 were considered positive for A(H7N9), and those with Ct values of >38.0 underwent repeat testing. Upon repeated testing, respiratory specimens with Ct values of \u226438 were considered positive for A(H7N9), and those with Ct values of >38 or with undetectable results were considered negative for A(H7N9). We defined the interval between symptom onset and the date of the last A(H7N9) RNA-positive result for respiratory samples as the A(H7N9) RNA shedding duration. Corticosteroid treatment was defined as administration of a dose equivalent to \u226525 mg of methylprednisolone per day during hospitalization [22] .",
            "cite_spans": [
                {
                    "start": 515,
                    "end": 519,
                    "text": "[21]",
                    "ref_id": "BIBREF20"
                },
                {
                    "start": 1186,
                    "end": 1190,
                    "text": "[22]",
                    "ref_id": "BIBREF21"
                }
            ],
            "ref_spans": [],
            "section": "Virologic Investigations"
        },
        {
            "text": "Mean values and standard deviations or median values with interquartile range were used to describe continuous variables, and absolute or relative frequencies were used to describe categorical variables. We used the Student t test and the Mann-Whitney U test for analysis of continuous variables and the \u03c7 2 test or Fisher exact test for analysis of discrete variables in bivariate analyses. To identify risk factors associated with prolonged duration of A(H7N9) RNA shedding, we performed a time-dependent Cox proportional hazards model that adjusted for baseline covariates. Outcomes were defined as times to A(H7N9) RNA negativity. For this analysis, we censored patients if they never cleared A(H7N9) RNA or, if they were discharged alive before they had cleared A(H7N9) RNA, at hospital discharge. Analysis was performed using a marginal structural Cox proportional hazard model [23] . Candidate variables considered for analysis of prolonged duration of A(H7N9) shedding were sex, age, comorbidities, smoking, time from illness onset to starting antiviral treatment, and specific antiviral NAI. We used Kaplan-Meier survival analysis to estimate the cumulative A(H7N9) RNA-negativity rate and the stratified log-rank statistic to compare the difference of A(H7N9) clearance between different 2 groups (ie, patients who survivors vs those who died, patients who started NAI treatment <5 days from illness onset vs those who started NAI treatment \u22655 days from illness onset, patients who received oseltamivir vs those who received a combination of oseltamivir plus peramivir, and patients who received standard-dose oseltamivir vs those who received double-dose oseltamivir). Statistical analyses were performed using SPSS, version 20.0 for Windows (IBM, Armonk, NY), and SAS, version 9.4 (SAS Institute, Cary, NC). For all analyses, probabilities were 2-tailed, and a 2-tailed P value of <.05 was considered significant.",
            "cite_spans": [
                {
                    "start": 884,
                    "end": 888,
                    "text": "[23]",
                    "ref_id": "BIBREF22"
                }
            ],
            "ref_spans": [],
            "section": "Statistical Analysis"
        },
        {
            "text": "From 1 April 2013 to 1 March 2017, 478 A(H7N9) case patients with virological results were included in this study from 16 provinces and 3 municipalities in mainland China. A total of 88 patients (18.4%) who tested positive for A(H7N9) RNA until death, and 390 (81.6%) had resolution of A(H7N9) shedding ( Figure 1 ). The main characteristics and outcomes of all patients are summarized in Table 1 .",
            "cite_spans": [],
            "ref_spans": [
                {
                    "start": 305,
                    "end": 313,
                    "text": "Figure 1",
                    "ref_id": "FIGREF1"
                },
                {
                    "start": 389,
                    "end": 396,
                    "text": "Table 1",
                    "ref_id": "TABREF1"
                }
            ],
            "section": "RESULTS"
        },
        {
            "text": "The source of respiratory specimens was available in medical records for 244 patients (51%) for detection of the first negative A(H7N9) RNA result. Of the specimens tested that yielded the first negative A(H7N9) RNA test result, 145 (59%) were from an endotracheal aspirate, 35 (14.3%) were from a sputum specimen, and 64 (26.2%) were from a nasopharyngeal swab specimen.",
            "cite_spans": [],
            "ref_spans": [],
            "section": "RESULTS"
        },
        {
            "text": "The median duration of A(H7N9) RNA shedding was 15 Figure 3A ).",
            "cite_spans": [],
            "ref_spans": [
                {
                    "start": 51,
                    "end": 60,
                    "text": "Figure 3A",
                    "ref_id": null
                }
            ],
            "section": "Prolonged Duration of A(H7N9) RNA Shedding"
        },
        {
            "text": "In a multivariable model that included available data from 478 patients, the time from illness onset to antiviral treatment (HR, 0.90 [95% CI, .91-.96]) and systemic corticosteroid administration (HR, 0.62 [95% CI, .50-.77]) were independent factors associated with the duration of A(H7N9) RNA shedding (Table 2 and Figure 4 ). Similar risk factors for delayed A(H7N9) RNA clearance were observed when the data were analyzed using a marginal structural Cox proportional hazards model (Supplementary Table 2 ).",
            "cite_spans": [],
            "ref_spans": [
                {
                    "start": 303,
                    "end": 311,
                    "text": "(Table 2",
                    "ref_id": "TABREF2"
                },
                {
                    "start": 316,
                    "end": 324,
                    "text": "Figure 4",
                    "ref_id": "FIGREF4"
                },
                {
                    "start": 499,
                    "end": 506,
                    "text": "Table 2",
                    "ref_id": "TABREF2"
                }
            ],
            "section": "Risk Factors for Prolonged Viral Shedding"
        },
        {
            "text": "The median time from illness onset to NAI treatment initiation was 8 days (IQR, 6-10 days). A(H7N9) RNA clearance was significantly delayed in patients who received NAI treatment beginning \u22655 days after illness onset, compared with those in whom NAI treatment was started <5 days after illness onset (HR, 2.64 [95% CI, 1.74-4.03]; P < .001; Figure 3B ).",
            "cite_spans": [],
            "ref_spans": [
                {
                    "start": 341,
                    "end": 350,
                    "text": "Figure 3B",
                    "ref_id": null
                }
            ],
            "section": "Risk Factors for Prolonged Viral Shedding"
        },
        {
            "text": "Among the 478 patients, antiviral treatment administered included oseltamivir monotherapy in 307 (64.2%); peramivir and oseltamivir in 142 (29.7%); peramivir, zanamivir, and oseltamivir in 25 (5.2%); oseltamivir and ribavirin in 3 (0.6%); and oseltamivir and ganciclovir in 1 (0.2%). The median duration of A(H7N9) shedding was 17 days (range, 13-21 days) in the oseltamivir monotherapy group and 19 days (range, 14-22 days) in the oseltamivir-peramivir combination treatment group. The main characteristics of patients who received different antiviral drugs are summarized in Table 3 . The median time from antiviral treatment initiation to a negative real-time RT-PCR result in respiratory tract specimens was 8 days (range, 5-10 days) in the oseltamivir monotherapy group, and 8 days (range, 6-9 days) in the oseltamivir-peramivir combination therapy group (P = .76). There was no significant difference in duration of A(H7N9) RNA shedding between patients who received oseltamivir Survived with A(H7N9) RNA clearance, n=300",
            "cite_spans": [],
            "ref_spans": [
                {
                    "start": 577,
                    "end": 584,
                    "text": "Table 3",
                    "ref_id": "TABREF3"
                }
            ],
            "section": "Impact of Different Antiviral Treatment Regimens and Oseltamivir Dosing on Outcomes"
        },
        {
            "text": "Patients whose physicians declined to participate, n=689",
            "cite_spans": [],
            "ref_spans": [],
            "section": "Impact of Different Antiviral Treatment Regimens and Oseltamivir Dosing on Outcomes"
        },
        {
            "text": "Patients with missing virological data, n=78",
            "cite_spans": [],
            "ref_spans": [],
            "section": "Impact of Different Antiviral Treatment Regimens and Oseltamivir Dosing on Outcomes"
        },
        {
            "text": "Patients aged <18 y, n = 3 monotherapy, compared with those who received oseltamivir-peramivir combination therapy ( Figure 3C ). Oseltamivir dosing data were available for 180 patients. There was no difference in A(H7N9) RNA clearance (HR, 1.08 [95% CI, .67-1.68]; P = .7; Figure 3D ) or in-hospital mortality (51.4% and 57.5%, respectively; P = .58; Table 3 ) between patients who received oseltamivir 150-mg twice-daily treatment and those who received 75-mg twice-daily treatment.",
            "cite_spans": [],
            "ref_spans": [
                {
                    "start": 117,
                    "end": 126,
                    "text": "Figure 3C",
                    "ref_id": null
                },
                {
                    "start": 274,
                    "end": 283,
                    "text": "Figure 3D",
                    "ref_id": null
                },
                {
                    "start": 352,
                    "end": 359,
                    "text": "Table 3",
                    "ref_id": "TABREF3"
                }
            ],
            "section": "Impact of Different Antiviral Treatment Regimens and Oseltamivir Dosing on Outcomes"
        },
        {
            "text": "We further compared the proportion of patients who tested positive for A(H7N9) RNA over time after starting NAI treatment, using the log-rank test. There was no significant difference among patients who received standard-dose oseltamivir, double-dose oseltamivir, or oseltamivir and peramivir treatment (HR, 1.18 [95% CI, .78-1.79]; P = .43; Supplementary Figure 2 ). DISCUSSION We report on the largest cohort of hospitalized patients with A(H7N9) infection in China to date. This study expands on our prior study of 288 hospitalized A(H7N9)-infected patients with pneumonia that reported associations between high-dose corticosteroid therapy and increased 30-day and 60-day mortality and a longer duration of A(H7N9) RNA detection [20] . In the current study of 478 hospitalized A(H7N9)-infected patients, we identified independent risk factors for prolonged A(H7N9) RNA detection and examined the impact of different antiviral treatment regimens on A(H7N9) RNA shedding. In most patients, NAI treatment was started >48 hours after illness onset, but initiation of NAI treatment before the fifth day of illness was associated with a shorter duration of A(H7N9) RNA shedding. Combination antiviral treatment with different NAIs and double-dose oseltamivir was not associated with significant differences in A(H7N9) RNA shedding or in-hospital mortality, compared with standard-dose oseltamivir monotherapy.",
            "cite_spans": [
                {
                    "start": 368,
                    "end": 378,
                    "text": "DISCUSSION",
                    "ref_id": null
                },
                {
                    "start": 733,
                    "end": 737,
                    "text": "[20]",
                    "ref_id": "BIBREF19"
                }
            ],
            "ref_spans": [
                {
                    "start": 342,
                    "end": 364,
                    "text": "Supplementary Figure 2",
                    "ref_id": null
                }
            ],
            "section": "Impact of Different Antiviral Treatment Regimens and Oseltamivir Dosing on Outcomes"
        },
        {
            "text": "We detected A(H7N9) RNA in the respiratory tract for a median of 15.5 days, and prolonged A(H7N9) RNA shedding was associated with a fatal outcome. Data on the duration of highly pathogenic avian influenza A(H5N1) virus shedding are limited but indicate that A(H5N1) RNA can be detected longer and at higher levels in lower respiratory tract tissues, including up to 15-27 days in fatal cases, than in upper respiratory tract specimens [24, 25] . A systematic review reported that progressively longer shedding duration of A(H1N1)pdm09 in patients was correlated with disease severity when studies were stratified into community (range of mean and median values, 2-9 days), hospital (range of mean and median values, 6-10 days), and intensive care (range of mean and median values, 13-20 days) settings [18] . We detected A(H7N9) RNA for up to 30 days in 22 patients, most of whom received a corticosteroid dose of at least 40 mg/day (50 mg prednisone/day), which can be considered an immunosuppressive dose (Supplementary Table 1) . Influenza viral RNA can be detected in the respiratory tract, particularly the lower respiratory tract, for a prolonged period in patients with severe disease or immunosuppression after illness onset, and better understanding of the kinetics of influenza virus replication in the upper and lower respiratory tracts of A(H7N9)-infected patients would be useful in future studies.",
            "cite_spans": [
                {
                    "start": 436,
                    "end": 440,
                    "text": "[24,",
                    "ref_id": "BIBREF23"
                },
                {
                    "start": 441,
                    "end": 444,
                    "text": "25]",
                    "ref_id": "BIBREF24"
                },
                {
                    "start": 803,
                    "end": 807,
                    "text": "[18]",
                    "ref_id": "BIBREF17"
                }
            ],
            "ref_spans": [
                {
                    "start": 1023,
                    "end": 1031,
                    "text": "Table 1)",
                    "ref_id": "TABREF1"
                }
            ],
            "section": "Impact of Different Antiviral Treatment Regimens and Oseltamivir Dosing on Outcomes"
        },
        {
            "text": "Delayed initiation of NAI treatment was an independent risk factor associated with prolonged A(H7N9) RNA shedding. Similarly, in a single-center retrospective study, Zheng et al reported that A(H7N9) RNA shedding was significantly shorter 1  2  3  4  5  6  7  8  9  10  11  12  13  14  15  16  17  18  19  20  21  22  23  24  25  26  27  28  29  30  31  32  33  34  35  36  37  38  39  40  41  42  43 while early (\u22642 days) versus later (3-5 days) initiation of NAI treatment was significantly associated with a survival benefit in adults, later initiation of NAI treatment was significantly associated with a lower mortality risk, compared with no treatment [17] . Our findings also suggest that NAI treatment should be started as early as possible if A(H7N9) infection is suspected, without waiting for virological confirmation.",
            "cite_spans": [
                {
                    "start": 658,
                    "end": 662,
                    "text": "[17]",
                    "ref_id": "BIBREF16"
                }
            ],
            "ref_spans": [
                {
                    "start": 239,
                    "end": 400,
                    "text": "1  2  3  4  5  6  7  8  9  10  11  12  13  14  15  16  17  18  19  20  21  22  23  24  25  26  27  28  29  30  31  32  33  34  35  36  37  38  39  40  41  42  43",
                    "ref_id": "TABREF1"
                }
            ],
            "section": "Impact of Different Antiviral Treatment Regimens and Oseltamivir Dosing on Outcomes"
        },
        {
            "text": "Corticosteroid therapy is commonly administrated in critically ill patients with influenza to reduce cytokine dysregulation and lung inflammation and to improve clinical outcomes [26] . However, most observational studies have reported that use of corticosteroids was associated with persistent viral shedding in patients with seasonal influenza, Middle East respiratory syndrome, or severe acute respiratory syndrome [10, 23, 27] . In addition, our previous observational study that used propensity-score matching showed that use of high-dose corticosteroids was associated with a fatal outcome among patients with pneumonia and A(H7N9) infection [20] . Our results are in accordance with the above findings that corticosteroid treatment, not only high-dose corticosteroid dosing, is associated with prolonged viral shedding duration and that prolonged viral shedding is associated with a fatal outcome. The mechanisms of delayed viral clearance due to corticosteroid treatment are not well defined but might be associated with impaired T-cell responses [10] . Taken together, our findings suggest that corticosteroids should not be given for treatment of A(H7N9) infection.",
            "cite_spans": [
                {
                    "start": 179,
                    "end": 183,
                    "text": "[26]",
                    "ref_id": "BIBREF25"
                },
                {
                    "start": 418,
                    "end": 422,
                    "text": "[10,",
                    "ref_id": "BIBREF9"
                },
                {
                    "start": 423,
                    "end": 426,
                    "text": "23,",
                    "ref_id": "BIBREF22"
                },
                {
                    "start": 427,
                    "end": 430,
                    "text": "27]",
                    "ref_id": "BIBREF26"
                },
                {
                    "start": 648,
                    "end": 652,
                    "text": "[20]",
                    "ref_id": "BIBREF19"
                },
                {
                    "start": 1055,
                    "end": 1059,
                    "text": "[10]",
                    "ref_id": "BIBREF9"
                }
            ],
            "ref_spans": [],
            "section": "Impact of Different Antiviral Treatment Regimens and Oseltamivir Dosing on Outcomes"
        },
        {
            "text": "Another potential reason for prolonged duration of viral RNA shedding is the emergence of NAI resistance during antiviral treatment. Hu et al [28] reported the emergence of oseltamivir-resistant virus with the Arg292Lys (R292K) mutation in the gene encoding viral neuraminidase in 2 A(H7N9)-infected patients during NAI treatment, which was temporally associated with a rebound in the A(H7N9) load and treatment failure. The R292K mutation confers resistance to oseltamivir and highly reduced inhibition to peramivir and zanamivir in vitro, suggesting that NAI treatment would not be effective in treating infection with viruses containing the R292K mutation. Of concern, the prevalence of the R292K mutation has increased since the first human infections with A(H7N9), in 2013, and was reported to be approximately 11% among sequenced viruses from A(H7N9)-infected patients during the fifth epidemic [4] . Recently, Ke et al [29] described the detection of the R292K mutation as early as 2 days after starting oseltamivir treatment in a patient with highly pathogenic A(H7N9) infection.",
            "cite_spans": [
                {
                    "start": 142,
                    "end": 146,
                    "text": "[28]",
                    "ref_id": "BIBREF27"
                },
                {
                    "start": 901,
                    "end": 904,
                    "text": "[4]",
                    "ref_id": "BIBREF3"
                },
                {
                    "start": 926,
                    "end": 930,
                    "text": "[29]",
                    "ref_id": "BIBREF28"
                }
            ],
            "ref_spans": [],
            "section": "Impact of Different Antiviral Treatment Regimens and Oseltamivir Dosing on Outcomes"
        },
        {
            "text": "Our study is the first to assess the impact of different NAI regimens, including combination treatment, and different dosages of oseltamivir on viral shedding and clinical outcome in patients with A(H7N9) infection. Our finding that double-dose oseltamivir did not provide an additional virologic benefit as compared to standard-dose oseltamivir treatment is consistent with results from controlled trials in outpatients [30] and inpatients with seasonal influenza [31] and from observational studies in hospitalized patients with A(H5N1) [32] or A(H1N1) pdm09 [33] infections. Previous studies suggested reasons for these observations [31, 34] . Oseltamivir is generally well absorbed and rapidly converted to the active compound, oseltamivir carboxylate, with a bioavailability of >80% [35] . Blood Of 269 patients during the fifth epidemic with data available on neuraminidase inhibitor dosing, 140 were administered standard-dose (75 mg twice daily) oseltamivir, and 40 received 150-mg twice-daily oseltamivir; the remaining 89 are not included in last 2 columns because they received combination therapy with other antiviral agents.",
            "cite_spans": [
                {
                    "start": 421,
                    "end": 425,
                    "text": "[30]",
                    "ref_id": "BIBREF29"
                },
                {
                    "start": 465,
                    "end": 469,
                    "text": "[31]",
                    "ref_id": "BIBREF30"
                },
                {
                    "start": 539,
                    "end": 543,
                    "text": "[32]",
                    "ref_id": "BIBREF32"
                },
                {
                    "start": 561,
                    "end": 565,
                    "text": "[33]",
                    "ref_id": "BIBREF33"
                },
                {
                    "start": 636,
                    "end": 640,
                    "text": "[31,",
                    "ref_id": "BIBREF30"
                },
                {
                    "start": 641,
                    "end": 644,
                    "text": "34]",
                    "ref_id": "BIBREF34"
                },
                {
                    "start": 788,
                    "end": 792,
                    "text": "[35]",
                    "ref_id": "BIBREF35"
                }
            ],
            "ref_spans": [],
            "section": "Impact of Different Antiviral Treatment Regimens and Oseltamivir Dosing on Outcomes"
        },
        {
            "text": "Abbreviations: AST, aspartate aminotransferase; COPD, chronic obstructive pulmonary disease; CRRT, continuous renal replacement therapy; ECMO, extracorporeal membrane oxygenation; FiO 2 , fraction of inspired oxygen; LOS, length of stay; PaO 2 , partial pressure of oxygen; WBC, white blood cell.",
            "cite_spans": [],
            "ref_spans": [],
            "section": "Impact of Different Antiviral Treatment Regimens and Oseltamivir Dosing on Outcomes"
        },
        {
            "text": "concentrations of oseltamivir carboxylate associated with single-or double-dose therapy in patients with influenza both exceed the median inhibitory concentration (ie, 0.7-2.2 ng/ mL [36] ) of influenza viruses. Exceeding these concentrations might not produce additional clinical or virological effect [37] . In addition, it may be that delayed antiviral treatment, when severe disease is already present, may reduce any potential benefit of double-dose oseltamivir. A retrospective analysis from a limited number of patients with A(H7N9) infection reported that oseltamivir plus peramivir was not superior to oseltamivir monotherapy in clinical or virological outcomes [38] . Clinical data, including a randomized trial of combination oseltamivir and zanamivir treatment, compared with either monotherapy alone, for seasonal influenza have not substantiated a potential advantage in using combinations of NAIs [30] . Rather, the data appear consistent in showing that use of combinations that target the same protein do not show an additive or synergistic effect against influenza virus infection [39] . This study has several limitations. First, our study was limited by its retrospective nature, with dosing of antivirals missing in some patients during the first 3 epidemics. Second, not all of the patients with laboratory-confirmed A(H7N9) infection in mainland China could be included in this study. However, we were able to include patients managed at 96 different hospitals. Third, owing to the small number of patients who initiated NAI treatment 2-3 days of illness onset, we were not able to assess the effect of early versus later initiation of NAI treatment. Fourth, genetic sequencing was not performed on specimens from patients with prolonged duration of A(H7N9) RNA shedding, to assess the frequency of emergence of antiviral resistance. It was therefore not possible to analyze the relationship between antiviral resistance and prolonged A(H7N9) shedding. Since paired upper and lower respiratory tract specimens were not collected prospectively from all patients, we could not directly compare differences in viral shedding between upper (ie, nasopharyngeal swab specimens) versus lower (endotracheal aspirates) respiratory tract specimens. However, we did not find any significant difference in the duration of A(H7N9) shedding between nasopharyngeal swab specimens and endotracheal aspirates.",
            "cite_spans": [
                {
                    "start": 183,
                    "end": 187,
                    "text": "[36]",
                    "ref_id": "BIBREF36"
                },
                {
                    "start": 303,
                    "end": 307,
                    "text": "[37]",
                    "ref_id": "BIBREF37"
                },
                {
                    "start": 671,
                    "end": 675,
                    "text": "[38]",
                    "ref_id": "BIBREF38"
                },
                {
                    "start": 912,
                    "end": 916,
                    "text": "[30]",
                    "ref_id": "BIBREF29"
                },
                {
                    "start": 1099,
                    "end": 1103,
                    "text": "[39]",
                    "ref_id": "BIBREF39"
                }
            ],
            "ref_spans": [],
            "section": "Impact of Different Antiviral Treatment Regimens and Oseltamivir Dosing on Outcomes"
        },
        {
            "text": "In conclusion, prolonged A(H7N9) RNA shedding in the respiratory tract was independently associated with delayed initiation of NAI treatment and with use of corticosteroids. These results reinforce guidance that NAI treatment should be started as soon as possible in patients with suspected A(H7N9) infection and suggest that corticosteroids should be avoided except in clinical situations where they have proven benefit. Although a prospective, randomized, controlled study is needed to definitely assess the clinical and virologic benefit of combination NAI therapy or higher dosing of oseltamivir, our findings in this observational study suggest that there is no benefit of higher oseltamivir dosing or use of multiple NAIs for treatment of A(H7N9)-infected patients. The increased frequency of emergence of resistance to NAIs during treatment and the high case-fatality proportion indicate an urgent need for improved antiviral treatment strategies, including drugs with different mechanisms of action than NAIs or those used in combination with NAIs, in hospitalized patients with A(H7N9) infection. Ideally, when available, new drugs should be evaluated in the context of randomized, controlled trials in A(H7N9)-infected patients.",
            "cite_spans": [],
            "ref_spans": [],
            "section": "Impact of Different Antiviral Treatment Regimens and Oseltamivir Dosing on Outcomes"
        },
        {
            "text": "Notes",
            "cite_spans": [],
            "ref_spans": [],
            "section": "Impact of Different Antiviral Treatment Regimens and Oseltamivir Dosing on Outcomes"
        }
    ],
    "bib_entries": {
        "BIBREF0": {
            "ref_id": "b0",
            "title": "Human infection with a novel avian-origin influenza A (H7N9) virus",
            "authors": [
                {
                    "first": "R",
                    "middle": [],
                    "last": "Gao",
                    "suffix": ""
                },
                {
                    "first": "B",
                    "middle": [],
                    "last": "Cao",
                    "suffix": ""
                },
                {
                    "first": "Y",
                    "middle": [],
                    "last": "Hu",
                    "suffix": ""
                }
            ],
            "year": 2013,
            "venue": "N Engl J Med",
            "volume": "368",
            "issn": "",
            "pages": "1888--97",
            "other_ids": {}
        },
        "BIBREF1": {
            "ref_id": "b1",
            "title": "Epidemiology of avian influenza A H7N9 virus in human beings across five epidemics in mainland China, 2013-17: an epidemiological study of laboratory-confirmed case series",
            "authors": [
                {
                    "first": "X",
                    "middle": [],
                    "last": "Wang",
                    "suffix": ""
                },
                {
                    "first": "H",
                    "middle": [],
                    "last": "Jiang",
                    "suffix": ""
                },
                {
                    "first": "P",
                    "middle": [],
                    "last": "Wu",
                    "suffix": ""
                }
            ],
            "year": 2017,
            "venue": "Lancet Infect Dis",
            "volume": "17",
            "issn": "",
            "pages": "822--854",
            "other_ids": {}
        },
        "BIBREF2": {
            "ref_id": "b2",
            "title": "Sudden increase in human infection with avian influenza A(H7N9) virus in China",
            "authors": [
                {
                    "first": "L",
                    "middle": [],
                    "last": "Zhou",
                    "suffix": ""
                },
                {
                    "first": "R",
                    "middle": [],
                    "last": "Ren",
                    "suffix": ""
                },
                {
                    "first": "L",
                    "middle": [],
                    "last": "Yang",
                    "suffix": ""
                }
            ],
            "year": 2016,
            "venue": "Western Pac Surveill Response J",
            "volume": "8",
            "issn": "",
            "pages": "6--14",
            "other_ids": {}
        },
        "BIBREF3": {
            "ref_id": "b3",
            "title": "Update: increase in human infections with novel Asian lineage avian influenza A(H7N9) viruses during the fifth epidemic -China",
            "authors": [
                {
                    "first": "J",
                    "middle": [
                        "C"
                    ],
                    "last": "Kile",
                    "suffix": ""
                },
                {
                    "first": "R",
                    "middle": [],
                    "last": "Ren",
                    "suffix": ""
                },
                {
                    "first": "L",
                    "middle": [],
                    "last": "Liu",
                    "suffix": ""
                }
            ],
            "year": 2016,
            "venue": "MMWR Morb Mortal Wkly Rep",
            "volume": "66",
            "issn": "",
            "pages": "928--960",
            "other_ids": {}
        },
        "BIBREF4": {
            "ref_id": "b4",
            "title": "Epidemiology of human infections with highly pathogenic avian influenza A(H7N9) virus in Guangdong",
            "authors": [
                {
                    "first": "M",
                    "middle": [],
                    "last": "Kang",
                    "suffix": ""
                },
                {
                    "first": "Ehy",
                    "middle": [],
                    "last": "Lau",
                    "suffix": ""
                },
                {
                    "first": "W",
                    "middle": [],
                    "last": "Guan",
                    "suffix": ""
                }
            ],
            "year": 2016,
            "venue": "Euro Surveill",
            "volume": "22",
            "issn": "",
            "pages": "",
            "other_ids": {
                "DOI": [
                    "10.2807/1560-7917.ES.2017.22.27.30568"
                ]
            }
        },
        "BIBREF5": {
            "ref_id": "b5",
            "title": "Preliminary epidemiology of human infections with highly pathogenic avian influenza A(H7N9) virus, China",
            "authors": [
                {
                    "first": "L",
                    "middle": [],
                    "last": "Zhou",
                    "suffix": ""
                },
                {
                    "first": "Y",
                    "middle": [],
                    "last": "Tan",
                    "suffix": ""
                },
                {
                    "first": "M",
                    "middle": [],
                    "last": "Kang",
                    "suffix": ""
                }
            ],
            "year": 2017,
            "venue": "Emerg Infect Dis",
            "volume": "23",
            "issn": "",
            "pages": "1355--1364",
            "other_ids": {}
        },
        "BIBREF6": {
            "ref_id": "b6",
            "title": "Novel influenza A viruses and pandemic threats",
            "authors": [
                {
                    "first": "T",
                    "middle": [
                        "M"
                    ],
                    "last": "Uyeki",
                    "suffix": ""
                },
                {
                    "first": "J",
                    "middle": [
                        "M"
                    ],
                    "last": "Katz",
                    "suffix": ""
                },
                {
                    "first": "D",
                    "middle": [
                        "B"
                    ],
                    "last": "Jernigan",
                    "suffix": ""
                }
            ],
            "year": 2017,
            "venue": "Lancet",
            "volume": "389",
            "issn": "",
            "pages": "2172--2176",
            "other_ids": {}
        },
        "BIBREF7": {
            "ref_id": "b7",
            "title": "Pathogenesis of influenza-induced acute respiratory distress syndrome",
            "authors": [
                {
                    "first": "K",
                    "middle": [
                        "R"
                    ],
                    "last": "Short",
                    "suffix": ""
                },
                {
                    "first": "Ejbv",
                    "middle": [],
                    "last": "Kroeze",
                    "suffix": ""
                },
                {
                    "first": "Ram",
                    "middle": [],
                    "last": "Fouchier",
                    "suffix": ""
                },
                {
                    "first": "T",
                    "middle": [],
                    "last": "Kuiken",
                    "suffix": ""
                }
            ],
            "year": 2014,
            "venue": "Lancet Infect Dis",
            "volume": "14",
            "issn": "",
            "pages": "57--69",
            "other_ids": {}
        },
        "BIBREF8": {
            "ref_id": "b8",
            "title": "Influenza virus-induced lung injury: pathogenesis and implications for treatment",
            "authors": [
                {
                    "first": "S",
                    "middle": [],
                    "last": "Herold",
                    "suffix": ""
                },
                {
                    "first": "C",
                    "middle": [],
                    "last": "Becker",
                    "suffix": ""
                },
                {
                    "first": "K",
                    "middle": [
                        "M"
                    ],
                    "last": "Ridge",
                    "suffix": ""
                },
                {
                    "first": "G",
                    "middle": [
                        "R"
                    ],
                    "last": "Budinger",
                    "suffix": ""
                }
            ],
            "year": 2015,
            "venue": "Eur Respir J",
            "volume": "45",
            "issn": "",
            "pages": "1463--78",
            "other_ids": {}
        },
        "BIBREF9": {
            "ref_id": "b9",
            "title": "Viral loads and duration of viral shedding in adult patients hospitalized with influenza",
            "authors": [
                {
                    "first": "N",
                    "middle": [],
                    "last": "Lee",
                    "suffix": ""
                },
                {
                    "first": "P",
                    "middle": [
                        "K"
                    ],
                    "last": "Chan",
                    "suffix": ""
                },
                {
                    "first": "D",
                    "middle": [
                        "S"
                    ],
                    "last": "Hui",
                    "suffix": ""
                }
            ],
            "year": 2009,
            "venue": "J Infect Dis",
            "volume": "200",
            "issn": "",
            "pages": "492--500",
            "other_ids": {}
        },
        "BIBREF10": {
            "ref_id": "b10",
            "title": "Toronto Invasive Bacterial Diseases Network. Antiviral therapy and outcomes of influenza requiring hospitalization in Ontario",
            "authors": [
                {
                    "first": "A",
                    "middle": [],
                    "last": "Mcgeer",
                    "suffix": ""
                },
                {
                    "first": "K",
                    "middle": [
                        "A"
                    ],
                    "last": "Green",
                    "suffix": ""
                },
                {
                    "first": "A",
                    "middle": [],
                    "last": "Plevneshi",
                    "suffix": ""
                }
            ],
            "year": 2007,
            "venue": "Canada. Clin Infect Dis",
            "volume": "45",
            "issn": "",
            "pages": "1568--75",
            "other_ids": {}
        },
        "BIBREF11": {
            "ref_id": "b11",
            "title": "American Society of Transplantation H1N1 Collaborative Study Group. Outcomes from pandemic influenza A H1N1 infection in recipients of solid-organ transplants: a multicentre cohort study",
            "authors": [
                {
                    "first": "D",
                    "middle": [],
                    "last": "Kumar",
                    "suffix": ""
                },
                {
                    "first": "M",
                    "middle": [
                        "G"
                    ],
                    "last": "Michaels",
                    "suffix": ""
                },
                {
                    "first": "M",
                    "middle": [
                        "I"
                    ],
                    "last": "Morris",
                    "suffix": ""
                }
            ],
            "year": 2010,
            "venue": "Lancet Infect Dis",
            "volume": "10",
            "issn": "",
            "pages": "521--527",
            "other_ids": {}
        },
        "BIBREF12": {
            "ref_id": "b12",
            "title": "Effectiveness of oseltamivir on disease progression and viral RNA shedding in patients with mild pandemic 2009 influenza A H1N1: opportunistic retrospective study of medical charts in China",
            "authors": [
                {
                    "first": "H",
                    "middle": [],
                    "last": "Yu",
                    "suffix": ""
                },
                {
                    "first": "Q",
                    "middle": [],
                    "last": "Liao",
                    "suffix": ""
                },
                {
                    "first": "Y",
                    "middle": [],
                    "last": "Yuan",
                    "suffix": ""
                }
            ],
            "year": 2010,
            "venue": "BMJ",
            "volume": "341",
            "issn": "",
            "pages": "",
            "other_ids": {}
        },
        "BIBREF13": {
            "ref_id": "b13",
            "title": "Treatment with neuraminidase inhibitors for critically ill patients with influenza A (H1N1)pdm09",
            "authors": [
                {
                    "first": "J",
                    "middle": [
                        "K"
                    ],
                    "last": "Louie",
                    "suffix": ""
                },
                {
                    "first": "S",
                    "middle": [],
                    "last": "Yang",
                    "suffix": ""
                },
                {
                    "first": "M",
                    "middle": [],
                    "last": "Acosta",
                    "suffix": ""
                }
            ],
            "year": 2012,
            "venue": "Clin Infect Dis",
            "volume": "55",
            "issn": "",
            "pages": "1198--204",
            "other_ids": {}
        },
        "BIBREF14": {
            "ref_id": "b14",
            "title": "Impact of neuraminidase inhibitor treatment on outcomes of public health importance during the 2009-2010 influenza A(H1N1) pandemic: a systematic review and meta-analysis in hospitalized patients",
            "authors": [
                {
                    "first": "S",
                    "middle": [
                        "G"
                    ],
                    "last": "Muthuri",
                    "suffix": ""
                },
                {
                    "first": "P",
                    "middle": [
                        "R"
                    ],
                    "last": "Myles",
                    "suffix": ""
                },
                {
                    "first": "S",
                    "middle": [],
                    "last": "Venkatesan",
                    "suffix": ""
                },
                {
                    "first": "J",
                    "middle": [],
                    "last": "Leonardi-Bee",
                    "suffix": ""
                },
                {
                    "first": "J",
                    "middle": [
                        "S"
                    ],
                    "last": "Nguyen-Van-Tam",
                    "suffix": ""
                }
            ],
            "year": 2013,
            "venue": "J Infect Dis",
            "volume": "207",
            "issn": "",
            "pages": "553--63",
            "other_ids": {}
        },
        "BIBREF15": {
            "ref_id": "b15",
            "title": "Effectiveness of neuraminidase inhibitors in reducing mortality in patients admitted to hospital with influenza A H1N1pdm09 virus infection: a meta-analysis of individual participant data",
            "authors": [
                {
                    "first": "S",
                    "middle": [
                        "G"
                    ],
                    "last": "Muthuri",
                    "suffix": ""
                },
                {
                    "first": "S",
                    "middle": [],
                    "last": "Venkatesan",
                    "suffix": ""
                },
                {
                    "first": "P",
                    "middle": [
                        "R"
                    ],
                    "last": "Myles",
                    "suffix": ""
                }
            ],
            "year": 2014,
            "venue": "Lancet Respir Med",
            "volume": "2",
            "issn": "",
            "pages": "395--404",
            "other_ids": {}
        },
        "BIBREF16": {
            "ref_id": "b16",
            "title": "Determinants of antiviral effectiveness in influenza virus A subtype H5N1",
            "authors": [
                {
                    "first": "P",
                    "middle": [
                        "K"
                    ],
                    "last": "Chan",
                    "suffix": ""
                },
                {
                    "first": "N",
                    "middle": [],
                    "last": "Lee",
                    "suffix": ""
                },
                {
                    "first": "M",
                    "middle": [],
                    "last": "Zaman",
                    "suffix": ""
                }
            ],
            "year": 2012,
            "venue": "J Infect Dis",
            "volume": "206",
            "issn": "",
            "pages": "1359--66",
            "other_ids": {}
        },
        "BIBREF17": {
            "ref_id": "b17",
            "title": "Systematic review of influenza A(H1N1)pdm09 virus shedding: duration is affected by severity, but not age",
            "authors": [
                {
                    "first": "J",
                    "middle": [
                        "E"
                    ],
                    "last": "Fielding",
                    "suffix": ""
                },
                {
                    "first": "H",
                    "middle": [
                        "A"
                    ],
                    "last": "Kelly",
                    "suffix": ""
                },
                {
                    "first": "G",
                    "middle": [
                        "N"
                    ],
                    "last": "Mercer",
                    "suffix": ""
                },
                {
                    "first": "K",
                    "middle": [],
                    "last": "Glass",
                    "suffix": ""
                }
            ],
            "year": 2014,
            "venue": "Influenza Other Respir Viruses",
            "volume": "8",
            "issn": "",
            "pages": "142--50",
            "other_ids": {}
        },
        "BIBREF18": {
            "ref_id": "b18",
            "title": "Benefit of early initiation of neuraminidase inhibitor treatment to hospitalized patients with avian influenza A (H7N9) virus",
            "authors": [
                {
                    "first": "S",
                    "middle": [],
                    "last": "Zheng",
                    "suffix": ""
                },
                {
                    "first": "Y",
                    "middle": [],
                    "last": "Wang",
                    "suffix": ""
                },
                {
                    "first": "F",
                    "middle": [],
                    "last": "Yu",
                    "suffix": ""
                }
            ],
            "year": 2017,
            "venue": "Clin Infect Dis",
            "volume": "",
            "issn": "",
            "pages": "",
            "other_ids": {
                "DOI": [
                    "10.1093/cid/cix930"
                ]
            }
        },
        "BIBREF19": {
            "ref_id": "b19",
            "title": "Adjuvant Corticosteroid Treatment in Adults With Influenza A (H7N9) Viral Pneumonia",
            "authors": [
                {
                    "first": "B",
                    "middle": [],
                    "last": "Cao",
                    "suffix": ""
                },
                {
                    "first": "H",
                    "middle": [],
                    "last": "Gao",
                    "suffix": ""
                },
                {
                    "first": "B",
                    "middle": [],
                    "last": "Zhou",
                    "suffix": ""
                }
            ],
            "year": 2016,
            "venue": "Crit Care Med",
            "volume": "44",
            "issn": "",
            "pages": "318--346",
            "other_ids": {}
        },
        "BIBREF20": {
            "ref_id": "b20",
            "title": "Clinical findings in 111 cases of influenza A (H7N9) virus infection",
            "authors": [
                {
                    "first": "H",
                    "middle": [
                        "N"
                    ],
                    "last": "Gao",
                    "suffix": ""
                },
                {
                    "first": "H",
                    "middle": [
                        "Z"
                    ],
                    "last": "Lu",
                    "suffix": ""
                },
                {
                    "first": "B",
                    "middle": [],
                    "last": "Cao",
                    "suffix": ""
                }
            ],
            "year": 2013,
            "venue": "N Engl J Med",
            "volume": "368",
            "issn": "",
            "pages": "2277--85",
            "other_ids": {}
        },
        "BIBREF21": {
            "ref_id": "b21",
            "title": "Use of corticosteroids in acute lung injury and acute respiratory distress syndrome: a systematic review and meta-analysis",
            "authors": [
                {
                    "first": "B",
                    "middle": [
                        "M"
                    ],
                    "last": "Tang",
                    "suffix": ""
                },
                {
                    "first": "J",
                    "middle": [
                        "C"
                    ],
                    "last": "Craig",
                    "suffix": ""
                },
                {
                    "first": "G",
                    "middle": [
                        "D"
                    ],
                    "last": "Eslick",
                    "suffix": ""
                },
                {
                    "first": "I",
                    "middle": [],
                    "last": "Seppelt",
                    "suffix": ""
                },
                {
                    "first": "A",
                    "middle": [
                        "S"
                    ],
                    "last": "Mclean",
                    "suffix": ""
                }
            ],
            "year": 2009,
            "venue": "Crit Care Med",
            "volume": "37",
            "issn": "",
            "pages": "1594--603",
            "other_ids": {}
        },
        "BIBREF22": {
            "ref_id": "b22",
            "title": "Corticosteroid therapy for critically ill patients with the middle east respiratory syndrome",
            "authors": [
                {
                    "first": "Y",
                    "middle": [
                        "M"
                    ],
                    "last": "Arabi",
                    "suffix": ""
                },
                {
                    "first": "Y",
                    "middle": [],
                    "last": "Mandourah",
                    "suffix": ""
                },
                {
                    "first": "F",
                    "middle": [],
                    "last": "Al-Hameed",
                    "suffix": ""
                }
            ],
            "year": 2017,
            "venue": "Am J Respir Crit Care Med",
            "volume": "",
            "issn": "",
            "pages": "",
            "other_ids": {
                "DOI": [
                    "10.1164/rccm.201706-1172OC"
                ]
            }
        },
        "BIBREF23": {
            "ref_id": "b23",
            "title": "Fatal outcome of human influenza A (H5N1) is associated with high viral load and hypercytokinemia",
            "authors": [
                {
                    "first": "M",
                    "middle": [
                        "D"
                    ],
                    "last": "De Jong",
                    "suffix": ""
                },
                {
                    "first": "C",
                    "middle": [
                        "P"
                    ],
                    "last": "Simmons",
                    "suffix": ""
                },
                {
                    "first": "T",
                    "middle": [
                        "T"
                    ],
                    "last": "Thanh",
                    "suffix": ""
                }
            ],
            "year": 2006,
            "venue": "Nat Med",
            "volume": "12",
            "issn": "",
            "pages": "1203--1210",
            "other_ids": {}
        },
        "BIBREF24": {
            "ref_id": "b24",
            "title": "H5N1 infection of the respiratory tract and beyond: a molecular pathology study",
            "authors": [
                {
                    "first": "J",
                    "middle": [],
                    "last": "Gu",
                    "suffix": ""
                },
                {
                    "first": "Z",
                    "middle": [],
                    "last": "Xie",
                    "suffix": ""
                },
                {
                    "first": "Z",
                    "middle": [],
                    "last": "Gao",
                    "suffix": ""
                }
            ],
            "year": 2007,
            "venue": "Lancet",
            "volume": "370",
            "issn": "",
            "pages": "1137--1182",
            "other_ids": {}
        },
        "BIBREF25": {
            "ref_id": "b25",
            "title": "The role of adjuvant immunomodulatory agents for treatment of severe influenza",
            "authors": [
                {
                    "first": "D",
                    "middle": [
                        "S"
                    ],
                    "last": "Hui",
                    "suffix": ""
                },
                {
                    "first": "N",
                    "middle": [],
                    "last": "Lee",
                    "suffix": ""
                },
                {
                    "first": "P",
                    "middle": [
                        "K"
                    ],
                    "last": "Chan",
                    "suffix": ""
                },
                {
                    "first": "J",
                    "middle": [
                        "H"
                    ],
                    "last": "Beigel",
                    "suffix": ""
                }
            ],
            "year": 2018,
            "venue": "Antiviral Res",
            "volume": "150",
            "issn": "",
            "pages": "202--218",
            "other_ids": {}
        },
        "BIBREF26": {
            "ref_id": "b26",
            "title": "Effects of early corticosteroid treatment on plasma SARS-associated Coronavirus RNA concentrations in adult patients",
            "authors": [
                {
                    "first": "N",
                    "middle": [],
                    "last": "Lee",
                    "suffix": ""
                },
                {
                    "first": "Allen",
                    "middle": [],
                    "last": "Chan",
                    "suffix": ""
                },
                {
                    "first": "K",
                    "middle": [
                        "C"
                    ],
                    "last": "Hui",
                    "suffix": ""
                },
                {
                    "first": "D",
                    "middle": [
                        "S"
                    ],
                    "last": "",
                    "suffix": ""
                }
            ],
            "year": 2004,
            "venue": "J Clin Virol",
            "volume": "31",
            "issn": "",
            "pages": "304--313",
            "other_ids": {}
        },
        "BIBREF27": {
            "ref_id": "b27",
            "title": "Association between adverse clinical outcome in human disease caused by novel influenza A H7N9 virus and sustained viral shedding and emergence of antiviral resistance",
            "authors": [
                {
                    "first": "Y",
                    "middle": [],
                    "last": "Hu",
                    "suffix": ""
                },
                {
                    "first": "S",
                    "middle": [],
                    "last": "Lu",
                    "suffix": ""
                },
                {
                    "first": "Z",
                    "middle": [],
                    "last": "Song",
                    "suffix": ""
                }
            ],
            "year": 2013,
            "venue": "Lancet",
            "volume": "381",
            "issn": "",
            "pages": "2273--2282",
            "other_ids": {}
        },
        "BIBREF28": {
            "ref_id": "b28",
            "title": "Human infection with highly pathogenic avian influenza A(H7N9) virus, China",
            "authors": [
                {
                    "first": "C",
                    "middle": [],
                    "last": "Ke",
                    "suffix": ""
                },
                {
                    "first": "Ckp",
                    "middle": [],
                    "last": "Mok",
                    "suffix": ""
                },
                {
                    "first": "W",
                    "middle": [],
                    "last": "Zhu",
                    "suffix": ""
                }
            ],
            "year": 2017,
            "venue": "Emerg Infect Dis",
            "volume": "23",
            "issn": "",
            "pages": "1332--1372",
            "other_ids": {}
        },
        "BIBREF29": {
            "ref_id": "b29",
            "title": "Bivir Study Group. Efficacy of oseltamivir-zanamivir combination compared to each monotherapy for seasonal influenza: a randomized placebo-controlled trial",
            "authors": [
                {
                    "first": "X",
                    "middle": [],
                    "last": "Duval",
                    "suffix": ""
                },
                {
                    "first": "S",
                    "middle": [],
                    "last": "Van Der Werf",
                    "suffix": ""
                },
                {
                    "first": "T",
                    "middle": [],
                    "last": "Blanchon",
                    "suffix": ""
                }
            ],
            "year": 2010,
            "venue": "PLoS Med",
            "volume": "7",
            "issn": "",
            "pages": "",
            "other_ids": {}
        },
        "BIBREF30": {
            "ref_id": "b30",
            "title": "Effect of double dose oseltamivir on clinical and virological outcomes in children and adults admitted to hospital with severe influenza: double blind randomised controlled trial",
            "authors": [],
            "year": 2013,
            "venue": "BMJ",
            "volume": "346",
            "issn": "",
            "pages": "",
            "other_ids": {}
        },
        "BIBREF32": {
            "ref_id": "b32",
            "title": "Effectiveness of antiviral treatment in human influenza A(H5N1) infections: analysis of a Global Patient Registry",
            "authors": [
                {
                    "first": "W",
                    "middle": [],
                    "last": "Adisasmito",
                    "suffix": ""
                },
                {
                    "first": "P",
                    "middle": [
                        "K"
                    ],
                    "last": "Chan",
                    "suffix": ""
                },
                {
                    "first": "N",
                    "middle": [],
                    "last": "Lee",
                    "suffix": ""
                }
            ],
            "year": 2010,
            "venue": "J Infect Dis",
            "volume": "202",
            "issn": "",
            "pages": "1154--60",
            "other_ids": {}
        },
        "BIBREF33": {
            "ref_id": "b33",
            "title": "National Influenza A Pandemic (H1N1) 2009 Clinical Investigation Group of China. Antiviral therapy and outcomes of patients with pneumonia caused by influenza A pandemic (H1N1) virus",
            "authors": [
                {
                    "first": "S",
                    "middle": [
                        "G"
                    ],
                    "last": "Yang",
                    "suffix": ""
                },
                {
                    "first": "B",
                    "middle": [],
                    "last": "Cao",
                    "suffix": ""
                },
                {
                    "first": "L",
                    "middle": [
                        "R"
                    ],
                    "last": "Liang",
                    "suffix": ""
                }
            ],
            "year": 2012,
            "venue": "PLoS One",
            "volume": "7",
            "issn": "",
            "pages": "",
            "other_ids": {}
        },
        "BIBREF34": {
            "ref_id": "b34",
            "title": "A prospective intervention study on higher-dose oseltamivir treatment in adults hospitalized with influenza a and B infections",
            "authors": [
                {
                    "first": "N",
                    "middle": [],
                    "last": "Lee",
                    "suffix": ""
                },
                {
                    "first": "D",
                    "middle": [
                        "S"
                    ],
                    "last": "Hui",
                    "suffix": ""
                },
                {
                    "first": "Z",
                    "middle": [],
                    "last": "Zuo",
                    "suffix": ""
                }
            ],
            "year": 2013,
            "venue": "Clin Infect Dis",
            "volume": "57",
            "issn": "",
            "pages": "1511--1520",
            "other_ids": {}
        },
        "BIBREF35": {
            "ref_id": "b35",
            "title": "Oseltamivir in seasonal, avian H5N1 and pandemic 2009 A/H1N1 influenza: pharmacokinetic and pharmacodynamic characteristics",
            "authors": [
                {
                    "first": "N",
                    "middle": [],
                    "last": "Widmer",
                    "suffix": ""
                },
                {
                    "first": "P",
                    "middle": [],
                    "last": "Meylan",
                    "suffix": ""
                },
                {
                    "first": "A",
                    "middle": [],
                    "last": "Ivanyuk",
                    "suffix": ""
                },
                {
                    "first": "M",
                    "middle": [],
                    "last": "Aouri",
                    "suffix": ""
                },
                {
                    "first": "L",
                    "middle": [
                        "A"
                    ],
                    "last": "Decosterd",
                    "suffix": ""
                },
                {
                    "first": "T",
                    "middle": [],
                    "last": "Buclin",
                    "suffix": ""
                }
            ],
            "year": 2010,
            "venue": "Clin Pharmacokinet",
            "volume": "49",
            "issn": "",
            "pages": "741--65",
            "other_ids": {}
        },
        "BIBREF36": {
            "ref_id": "b36",
            "title": "Comparison of the anti-influenza virus activity of RWJ-270201 with those of oseltamivir and zanamivir",
            "authors": [
                {
                    "first": "S",
                    "middle": [],
                    "last": "Bantia",
                    "suffix": ""
                },
                {
                    "first": "C",
                    "middle": [
                        "D"
                    ],
                    "last": "Parker",
                    "suffix": ""
                },
                {
                    "first": "S",
                    "middle": [
                        "L"
                    ],
                    "last": "Ananth",
                    "suffix": ""
                }
            ],
            "year": 2001,
            "venue": "Antimicrob Agents Chemother",
            "volume": "45",
            "issn": "",
            "pages": "1162--1169",
            "other_ids": {}
        },
        "BIBREF37": {
            "ref_id": "b37",
            "title": "Pharmacokinetics of oseltamivir: an oral antiviral for the treatment and prophylaxis of influenza in diverse populations",
            "authors": [
                {
                    "first": "B",
                    "middle": [
                        "E"
                    ],
                    "last": "Davies",
                    "suffix": ""
                }
            ],
            "year": 2010,
            "venue": "J Antimicrob Chemother",
            "volume": "65",
            "issn": "2",
            "pages": "5--10",
            "other_ids": {}
        },
        "BIBREF38": {
            "ref_id": "b38",
            "title": "Efficacy of oseltamivir-peramivir combination therapy compared to oseltamivir monotherapy for Influenza A (H7N9) infection: a retrospective study",
            "authors": [
                {
                    "first": "Y",
                    "middle": [],
                    "last": "Zhang",
                    "suffix": ""
                },
                {
                    "first": "H",
                    "middle": [],
                    "last": "Gao",
                    "suffix": ""
                },
                {
                    "first": "W",
                    "middle": [],
                    "last": "Liang",
                    "suffix": ""
                }
            ],
            "year": 2016,
            "venue": "BMC Infect Dis",
            "volume": "16",
            "issn": "",
            "pages": "",
            "other_ids": {}
        },
        "BIBREF39": {
            "ref_id": "b39",
            "title": "International Severe Acute Respiratory and Emerging Infection Consortium (ISARIC)",
            "authors": [
                {
                    "first": "J",
                    "middle": [],
                    "last": "Dunning",
                    "suffix": ""
                },
                {
                    "first": "J",
                    "middle": [
                        "K"
                    ],
                    "last": "Baillie",
                    "suffix": ""
                },
                {
                    "first": "B",
                    "middle": [],
                    "last": "Cao",
                    "suffix": ""
                },
                {
                    "first": "F",
                    "middle": [
                        "G"
                    ],
                    "last": "Hayden",
                    "suffix": ""
                }
            ],
            "year": 2014,
            "venue": "Lancet Infect Dis",
            "volume": "14",
            "issn": "",
            "pages": "1259--70",
            "other_ids": {}
        }
    },
    "ref_entries": {
        "FIGREF0": {
            "text": "A(H7N9)positive test result, n=88Dided with A(H7N9) clearance, n=90",
            "latex": null,
            "type": "figure"
        },
        "FIGREF1": {
            "text": "Flow diagram of hospitalized patients with confirmed avian influenza A(H7N9) virus infection included into this study.",
            "latex": null,
            "type": "figure"
        },
        "FIGREF2": {
            "text": "Distribution of antiviral treatment (ARV) and proportion of patients with undetectable avian influenza A(H7N9) virus RNA by day after onset A, Cumulative proportion of patients between patients who survived and those who died with detectable avian influenza A(H7N9) virus RNA, by day after onset of illness. B, Cumulative proportion of patients who started neuraminidase inhibitor (NAI) therapy <5 days versus \u22655 days after illness onset who had detectable A(H7N9) RNA, by day after onset of illness. C, Cumulative proportion of patients treated with oseltamivir versus oseltamivir and peramivir who had detectable A(H7N9) RNA, by day after onset of illness. D, Cumulative proportion of patients treated with oseltamivir (75 mg twice daily) versus oseltamivir (150 mg twice daily) with detectable A(H7N9) RNA, by day after onset of illness. CI, confidence interval.",
            "latex": null,
            "type": "figure"
        },
        "FIGREF4": {
            "text": "Duration of avian influenza A(H7N9) virus RNA detection in relationship to time from illness onset to antiviral treatment initiation.",
            "latex": null,
            "type": "figure"
        },
        "TABREF0": {
            "text": "days of illness onset. A(H7N9) RNA was undetectable among most patients (92.3%) within 27 days after symptom onset, but it was detectable in a small subset of 22 patients up to 30 days after symptom onset (Figure 2 and Supplementary Table 1).",
            "latex": null,
            "type": "table"
        },
        "TABREF1": {
            "text": "Characteristics of 478 Hospitalized Patients With Avian Influenza A(H7N9) Virus Infection in China From 1 April 2013 to 1 March 2017 AST, and creatine kinase are listed in the SupplementaryTables and Figures.",
            "latex": null,
            "type": "table"
        },
        "TABREF2": {
            "text": "",
            "latex": null,
            "type": "table"
        },
        "TABREF3": {
            "text": "Comparison of Characteristics of Hospitalized Patients With Avian Influenza A(H7N9) Virus Infection Treated With Combination and Different Continuous variables are expressed as median values (interquartile ranges), and categorical variables are presented as number of patients (percentages). Among the 478 patients, 307 (62.9%) received oseltamivir monotherapy, 142 (29.1%) received combination therapy with peramivir plus oseltamivir, and 29 (5.9%) who are not included in first 2 columns (19 [4.0%] received combination therapy with peramivir, zanamivir, and oseltamivir; 7 [1.4%] received combination therapy with oseltamivir plus ribavirin; 2 [0.4%] received combination therapy with oseltamivir plus ganciclovir; and 1 [0.2%] received peramivir only).",
            "latex": null,
            "type": "table"
        }
    },
    "back_matter": []
}