{
    "paper_id": "PMC7088969",
    "metadata": {
        "title": "Comparison of the photosynthetic characteristics of four Lycoris species with leaf appearing in autumn under field conditions",
        "authors": [
            {
                "first": "K.",
                "middle": [],
                "last": "Liu",
                "suffix": "",
                "email": null,
                "affiliation": {}
            },
            {
                "first": "C.",
                "middle": [
                    "F."
                ],
                "last": "Tang",
                "suffix": "",
                "email": null,
                "affiliation": {}
            },
            {
                "first": "S.",
                "middle": [
                    "B."
                ],
                "last": "Zhou",
                "suffix": "",
                "email": "zhoushoubiao@vip.163.com",
                "affiliation": {}
            },
            {
                "first": "Y.",
                "middle": [
                    "P."
                ],
                "last": "Wang",
                "suffix": "",
                "email": null,
                "affiliation": {}
            },
            {
                "first": "D.",
                "middle": [],
                "last": "Zhang",
                "suffix": "",
                "email": null,
                "affiliation": {}
            },
            {
                "first": "G.",
                "middle": [
                    "W."
                ],
                "last": "Wu",
                "suffix": "",
                "email": null,
                "affiliation": {}
            },
            {
                "first": "L.",
                "middle": [
                    "L."
                ],
                "last": "Chang",
                "suffix": "",
                "email": null,
                "affiliation": {}
            }
        ]
    },
    "body_text": [],
    "ref_entries": {},
    "back_matter": [],
    "bib_entries": {
        "BIBREF0": {
            "title": "Growth and photosynthetic responses of the federally endangered shrub, Lindera melissifolia (Lauraceae), to varied light environments",
            "authors": [
                {
                    "first": "K.M.",
                    "middle": [],
                    "last": "Aleric",
                    "suffix": ""
                },
                {
                    "first": "L.K.",
                    "middle": [],
                    "last": "Kirkman",
                    "suffix": ""
                }
            ],
            "year": 2005,
            "venue": "Amer. J. Bot.",
            "volume": "92",
            "issn": "",
            "pages": "682-689",
            "other_ids": {
                "DOI": [
                    "10.3732/ajb.92.4.682"
                ]
            }
        },
        "BIBREF1": {
            "title": "Analysis of floral transcription factors from Lycoris longituba",
            "authors": [
                {
                    "first": "Q.L.",
                    "middle": [],
                    "last": "He",
                    "suffix": ""
                },
                {
                    "first": "S.J.",
                    "middle": [],
                    "last": "Cui",
                    "suffix": ""
                },
                {
                    "first": "J.L.",
                    "middle": [],
                    "last": "Gu",
                    "suffix": ""
                },
                {
                    "first": "H.",
                    "middle": [],
                    "last": "Zhang",
                    "suffix": ""
                },
                {
                    "first": "M.X.",
                    "middle": [],
                    "last": "Wang",
                    "suffix": ""
                },
                {
                    "first": "Y.",
                    "middle": [],
                    "last": "Zhou",
                    "suffix": ""
                },
                {
                    "first": "L.",
                    "middle": [],
                    "last": "Zhang",
                    "suffix": ""
                },
                {
                    "first": "M.R.",
                    "middle": [],
                    "last": "Huang",
                    "suffix": ""
                }
            ],
            "year": 2010,
            "venue": "Genomics",
            "volume": "96",
            "issn": "",
            "pages": "119-127",
            "other_ids": {
                "DOI": [
                    "10.1016/j.ygeno.2010.04.002"
                ]
            }
        },
        "BIBREF2": {
            "title": "Genetic variations in the chloroplast genome and phylogenetic clustering of Lycoris species",
            "authors": [
                {
                    "first": "T.",
                    "middle": [],
                    "last": "Hori",
                    "suffix": ""
                },
                {
                    "first": "A.",
                    "middle": [],
                    "last": "Hanashi",
                    "suffix": ""
                },
                {
                    "first": "T.",
                    "middle": [],
                    "last": "Sasanuma",
                    "suffix": ""
                },
                {
                    "first": "S.",
                    "middle": [],
                    "last": "Kurita",
                    "suffix": ""
                }
            ],
            "year": 2006,
            "venue": "Genes Genet. Syst.",
            "volume": "81",
            "issn": "",
            "pages": "243-253",
            "other_ids": {
                "DOI": [
                    "10.1266/ggs.81.243"
                ]
            }
        },
        "BIBREF3": {
            "title": "Plants used in Chinese and Indian traditional medicine for improvement of memory and cognitive function",
            "authors": [
                {
                    "first": "M.J.",
                    "middle": [],
                    "last": "Howes",
                    "suffix": ""
                },
                {
                    "first": "P.",
                    "middle": [],
                    "last": "Houghton",
                    "suffix": ""
                }
            ],
            "year": 2003,
            "venue": "Pharmacol. Biochem. Be.",
            "volume": "75",
            "issn": "",
            "pages": "513-527",
            "other_ids": {
                "DOI": [
                    "10.1016/S0091-3057(03)00128-X"
                ]
            }
        },
        "BIBREF4": {
            "title": "Synopsis of the genus Lycoris (Amaryllidaceae)",
            "authors": [
                {
                    "first": "B.S.",
                    "middle": [],
                    "last": "Hsu",
                    "suffix": ""
                },
                {
                    "first": "S.",
                    "middle": [],
                    "last": "Kurita",
                    "suffix": ""
                },
                {
                    "first": "Z.Z.",
                    "middle": [],
                    "last": "Yu",
                    "suffix": ""
                },
                {
                    "first": "J.Z.",
                    "middle": [],
                    "last": "Lin",
                    "suffix": ""
                }
            ],
            "year": 1994,
            "venue": "SIDA",
            "volume": "16",
            "issn": "",
            "pages": "301-331",
            "other_ids": {
                "DOI": []
            }
        },
        "BIBREF5": {
            "title": "[Comparison of photosynthetic characteristics in two ecotypes of Jatropha curcas in summer.]",
            "authors": [
                {
                    "first": "H.Y.",
                    "middle": [],
                    "last": "Huang",
                    "suffix": ""
                },
                {
                    "first": "X.Y.",
                    "middle": [],
                    "last": "Dou",
                    "suffix": ""
                },
                {
                    "first": "B.Y.",
                    "middle": [],
                    "last": "Sun",
                    "suffix": ""
                },
                {
                    "first": "B.",
                    "middle": [],
                    "last": "Deng",
                    "suffix": ""
                },
                {
                    "first": "G.J.",
                    "middle": [],
                    "last": "Wu",
                    "suffix": ""
                },
                {
                    "first": "C.L.",
                    "middle": [],
                    "last": "Peng",
                    "suffix": ""
                }
            ],
            "year": 2009,
            "venue": "Acta Ecol. Sin.",
            "volume": "29",
            "issn": "",
            "pages": "2861-2867",
            "other_ids": {
                "DOI": [
                    "10.1016/j.chnaes.2009.09.011"
                ]
            }
        },
        "BIBREF6": {
            "title": "[The main affected environment factors of photosynthesis.]",
            "authors": [
                {
                    "first": "G.M.",
                    "middle": [],
                    "last": "Jiang",
                    "suffix": ""
                },
                {
                    "first": "J.",
                    "middle": [],
                    "last": "Chang",
                    "suffix": ""
                },
                {
                    "first": "Y.B.",
                    "middle": [],
                    "last": "Gao",
                    "suffix": ""
                }
            ],
            "year": 2004,
            "venue": "Plant Ecophysiology",
            "volume": "",
            "issn": "",
            "pages": "65-67",
            "other_ids": {
                "DOI": []
            }
        },
        "BIBREF7": {
            "title": "[Effect of applying naphthaleneacetic acid (NAA) onto stigma on fruit set and seed formation in interspecific hybrids between Lycoris species.]",
            "authors": [
                {
                    "first": "K.",
                    "middle": [],
                    "last": "Katsukawa",
                    "suffix": ""
                },
                {
                    "first": "G.",
                    "middle": [],
                    "last": "Mori",
                    "suffix": ""
                },
                {
                    "first": "H.",
                    "middle": [],
                    "last": "Imanishi",
                    "suffix": ""
                }
            ],
            "year": 2000,
            "venue": "J. Japan. Soc. Hort. Sci.",
            "volume": "69",
            "issn": "",
            "pages": "224-226",
            "other_ids": {
                "DOI": [
                    "10.2503/jjshs.69.224"
                ]
            }
        },
        "BIBREF8": {
            "title": "Variation and evolution in the karyotype of Lycoris IV. Intraspecific variation in the karyotype of L. radiata Herb. and the origin of this triploid species",
            "authors": [
                {
                    "first": "S.",
                    "middle": [],
                    "last": "Kurita",
                    "suffix": ""
                }
            ],
            "year": 1987,
            "venue": "Cytologia",
            "volume": "52",
            "issn": "",
            "pages": "137-149",
            "other_ids": {
                "DOI": [
                    "10.1508/cytologia.52.137"
                ]
            }
        },
        "BIBREF9": {
            "title": "Variation and evolution in the karyotype of Lycoris, Amaryllidaceae VII. Modes of karyotype alteration within species and probable trend of karyotype evolution in the genus",
            "authors": [
                {
                    "first": "S.",
                    "middle": [],
                    "last": "Kurita",
                    "suffix": ""
                }
            ],
            "year": 1988,
            "venue": "Cytologia",
            "volume": "53",
            "issn": "",
            "pages": "323-335",
            "other_ids": {
                "DOI": [
                    "10.1508/cytologia.53.323"
                ]
            }
        },
        "BIBREF10": {
            "title": "Correlates of leaf optical properties in tropical forest sun and extreme two shade plants",
            "authors": [
                {
                    "first": "D.W.",
                    "middle": [],
                    "last": "Lee",
                    "suffix": ""
                },
                {
                    "first": "R.A.",
                    "middle": [],
                    "last": "Bone",
                    "suffix": ""
                },
                {
                    "first": "S.L.",
                    "middle": [],
                    "last": "Tarsis",
                    "suffix": ""
                },
                {
                    "first": "D.",
                    "middle": [],
                    "last": "Storch",
                    "suffix": ""
                }
            ],
            "year": 1990,
            "venue": "Amer. J. Bot.",
            "volume": "77",
            "issn": "",
            "pages": "370-380",
            "other_ids": {
                "DOI": [
                    "10.2307/2444723"
                ]
            }
        },
        "BIBREF11": {
            "title": "Gas exchange characteristics of Populus trichocarpa, Populus deltoides and Populus trichocarpa \u00d7 P. deltoides clones",
            "authors": [
                {
                    "first": "J.H.",
                    "middle": [],
                    "last": "Bassman",
                    "suffix": ""
                },
                {
                    "first": "J.C.",
                    "middle": [],
                    "last": "Zwier",
                    "suffix": ""
                }
            ],
            "year": 1991,
            "venue": "Tree Physiol.",
            "volume": "8",
            "issn": "",
            "pages": "145-159",
            "other_ids": {
                "DOI": [
                    "10.1093/treephys/8.2.145"
                ]
            }
        },
        "BIBREF12": {
            "title": "Identification of natural compounds with antiviral activities against SARS-associated coronavirus",
            "authors": [
                {
                    "first": "S.Y.",
                    "middle": [],
                    "last": "Li",
                    "suffix": ""
                },
                {
                    "first": "C.",
                    "middle": [],
                    "last": "Chen",
                    "suffix": ""
                },
                {
                    "first": "H.Q.",
                    "middle": [],
                    "last": "Zhang",
                    "suffix": ""
                },
                {
                    "first": "H.Y.",
                    "middle": [],
                    "last": "Guo",
                    "suffix": ""
                },
                {
                    "first": "H.",
                    "middle": [],
                    "last": "Wang",
                    "suffix": ""
                },
                {
                    "first": "L.",
                    "middle": [],
                    "last": "Wang",
                    "suffix": ""
                },
                {
                    "first": "X.",
                    "middle": [],
                    "last": "Zhang",
                    "suffix": ""
                },
                {
                    "first": "S.N.",
                    "middle": [],
                    "last": "Hua",
                    "suffix": ""
                },
                {
                    "first": "J.",
                    "middle": [],
                    "last": "Yu",
                    "suffix": ""
                },
                {
                    "first": "P.G.",
                    "middle": [],
                    "last": "Xiao",
                    "suffix": ""
                },
                {
                    "first": "R.S.",
                    "middle": [],
                    "last": "Li",
                    "suffix": ""
                },
                {
                    "first": "X.H.",
                    "middle": [],
                    "last": "Tan",
                    "suffix": ""
                }
            ],
            "year": 2005,
            "venue": "Antivir. Res.",
            "volume": "67",
            "issn": "",
            "pages": "18-23",
            "other_ids": {
                "DOI": [
                    "10.1016/j.antiviral.2005.02.007"
                ]
            }
        },
        "BIBREF13": {
            "title": "Diurnal changes in gas exchange and chlorophyll fluorescence parameters of Fritillaria cirrhosa and F. delavayi under field conditions",
            "authors": [
                {
                    "first": "X.W.",
                    "middle": [],
                    "last": "Li",
                    "suffix": ""
                },
                {
                    "first": "S.L.",
                    "middle": [],
                    "last": "Chen",
                    "suffix": ""
                }
            ],
            "year": 2009,
            "venue": "Photosynthetica",
            "volume": "47",
            "issn": "",
            "pages": "191-198",
            "other_ids": {
                "DOI": [
                    "10.1007/s11099-009-0032-5"
                ]
            }
        },
        "BIBREF14": {
            "title": "Growth and physiological characteristics of Fritillaria cirrhosa in response to high irradiance and shade in age-related growth phases",
            "authors": [
                {
                    "first": "X.W.",
                    "middle": [],
                    "last": "Li",
                    "suffix": ""
                },
                {
                    "first": "Y.",
                    "middle": [],
                    "last": "Dai",
                    "suffix": ""
                },
                {
                    "first": "S.L.",
                    "middle": [],
                    "last": "Chen",
                    "suffix": ""
                }
            ],
            "year": 2009,
            "venue": "Environ. Exp. Bot.",
            "volume": "67",
            "issn": "",
            "pages": "77-83",
            "other_ids": {
                "DOI": [
                    "10.1016/j.envexpbot.2009.07.005"
                ]
            }
        },
        "BIBREF15": {
            "title": "[Quick propagation of bulbscale of Lycoris radiata.]",
            "authors": [
                {
                    "first": "Y.P.",
                    "middle": [],
                    "last": "Li",
                    "suffix": ""
                },
                {
                    "first": "Q.F.",
                    "middle": [],
                    "last": "Zhang",
                    "suffix": ""
                },
                {
                    "first": "G.G.",
                    "middle": [],
                    "last": "Tang",
                    "suffix": ""
                }
            ],
            "year": 2005,
            "venue": "J. Nanjing Forest. Univ.",
            "volume": "29",
            "issn": "",
            "pages": "103-105",
            "other_ids": {
                "DOI": []
            }
        },
        "BIBREF16": {
            "title": "[Effects of shades on the photosynthetic characteristics and chlorophyll fluorescence parameters of Urtica dioica.]",
            "authors": [
                {
                    "first": "Y.Q.",
                    "middle": [],
                    "last": "Liu",
                    "suffix": ""
                },
                {
                    "first": "X.Y.",
                    "middle": [],
                    "last": "Sun",
                    "suffix": ""
                },
                {
                    "first": "Y.",
                    "middle": [],
                    "last": "Wang",
                    "suffix": ""
                },
                {
                    "first": "Y.",
                    "middle": [],
                    "last": "Liu",
                    "suffix": ""
                }
            ],
            "year": 2007,
            "venue": "Acta Ecol. Sin.",
            "volume": "27",
            "issn": "",
            "pages": "3457-3464",
            "other_ids": {
                "DOI": [
                    "10.1016/S1872-2032(08)60011-6"
                ]
            }
        },
        "BIBREF17": {
            "title": "Effects of shading on chlorophyll content, chlorophyll fluorescence and photosynthesis of subterranean clover",
            "authors": [
                {
                    "first": "R.P.",
                    "middle": [],
                    "last": "Mauro",
                    "suffix": ""
                },
                {
                    "first": "A.",
                    "middle": [],
                    "last": "Occhipinti",
                    "suffix": ""
                },
                {
                    "first": "A.M.G.",
                    "middle": [],
                    "last": "Longo",
                    "suffix": ""
                },
                {
                    "first": "G.",
                    "middle": [],
                    "last": "Mauromicale",
                    "suffix": ""
                }
            ],
            "year": 2011,
            "venue": "J. Agron. Crop Sci.",
            "volume": "197",
            "issn": "",
            "pages": "57-66",
            "other_ids": {
                "DOI": [
                    "10.1111/j.1439-037X.2010.00436.x"
                ]
            }
        },
        "BIBREF18": {
            "title": "Chlorophyll fluorescence and chlorophyll content in field-grown potato as affected by nitrogen supply, genotype, and plant age",
            "authors": [
                {
                    "first": "G.",
                    "middle": [],
                    "last": "Mauromicale",
                    "suffix": ""
                },
                {
                    "first": "A.",
                    "middle": [],
                    "last": "Ierna",
                    "suffix": ""
                },
                {
                    "first": "M.",
                    "middle": [],
                    "last": "Marchese",
                    "suffix": ""
                }
            ],
            "year": 2006,
            "venue": "Photosynthetica",
            "volume": "44",
            "issn": "",
            "pages": "76-82",
            "other_ids": {
                "DOI": [
                    "10.1007/s11099-005-0161-4"
                ]
            }
        },
        "BIBREF19": {
            "title": "Growth and photosynthetic responses of three Lycoris species to levels of irradiance",
            "authors": [
                {
                    "first": "P.P.",
                    "middle": [],
                    "last": "Meng",
                    "suffix": ""
                },
                {
                    "first": "Y.",
                    "middle": [],
                    "last": "Ge",
                    "suffix": ""
                },
                {
                    "first": "Q.J.",
                    "middle": [],
                    "last": "Cao",
                    "suffix": ""
                }
            ],
            "year": 2008,
            "venue": "HortScience",
            "volume": "43",
            "issn": "",
            "pages": "134-137",
            "other_ids": {
                "DOI": []
            }
        },
        "BIBREF20": {
            "title": "Genome differentiation in Lycoris species (Amaryllidaceae) identified by genomic in situ hybridization",
            "authors": [
                {
                    "first": "T.",
                    "middle": [],
                    "last": "Ogawa",
                    "suffix": ""
                },
                {
                    "first": "I.",
                    "middle": [],
                    "last": "Tarumoto",
                    "suffix": ""
                },
                {
                    "first": "B.",
                    "middle": [],
                    "last": "Ma",
                    "suffix": ""
                },
                {
                    "first": "M.",
                    "middle": [],
                    "last": "Ueno",
                    "suffix": ""
                },
                {
                    "first": "S.",
                    "middle": [],
                    "last": "Kurita",
                    "suffix": ""
                }
            ],
            "year": 2005,
            "venue": "Breeding Sci.",
            "volume": "55",
            "issn": "",
            "pages": "265-269",
            "other_ids": {
                "DOI": [
                    "10.1270/jsbbs.55.265"
                ]
            }
        },
        "BIBREF21": {
            "title": "Light absorption by plants and its implications for photosynthesis",
            "authors": [
                {
                    "first": "B.A.",
                    "middle": [],
                    "last": "Osborne",
                    "suffix": ""
                },
                {
                    "first": "J.A.",
                    "middle": [],
                    "last": "Raven",
                    "suffix": ""
                }
            ],
            "year": 1986,
            "venue": "Biol. Rev.",
            "volume": "61",
            "issn": "",
            "pages": "1-61",
            "other_ids": {
                "DOI": [
                    "10.1111/j.1469-185X.1986.tb00425.x"
                ]
            }
        },
        "BIBREF22": {
            "title": "Photon yield of O2 evolution and chlorophyll fluorescence characteristics at 77 K among vascular plants of diverse origins",
            "authors": [
                {
                    "first": "O.",
                    "middle": [],
                    "last": "Bj\u00f6rkman",
                    "suffix": ""
                },
                {
                    "first": "B.",
                    "middle": [],
                    "last": "Demmig",
                    "suffix": ""
                }
            ],
            "year": 1987,
            "venue": "Planta",
            "volume": "170",
            "issn": "",
            "pages": "489-504",
            "other_ids": {
                "DOI": [
                    "10.1007/BF00402983"
                ]
            }
        },
        "BIBREF23": {
            "title": "Photoinhibition of photosynthesis induced by visible irradiance",
            "authors": [
                {
                    "first": "S.B.",
                    "middle": [],
                    "last": "Powles",
                    "suffix": ""
                }
            ],
            "year": 1984,
            "venue": "Annu. Rev. Plant Physiol.",
            "volume": "35",
            "issn": "",
            "pages": "15-44",
            "other_ids": {
                "DOI": [
                    "10.1146/annurev.pp.35.060184.000311"
                ]
            }
        },
        "BIBREF24": {
            "title": "Continuous recording of photochemical and non-photochemical chlorophyll fluorescence quenching with a new type of modulation fluorometer",
            "authors": [
                {
                    "first": "U.",
                    "middle": [],
                    "last": "Schreiber",
                    "suffix": ""
                },
                {
                    "first": "U.",
                    "middle": [],
                    "last": "Schliwa",
                    "suffix": ""
                },
                {
                    "first": "W.",
                    "middle": [],
                    "last": "Bilger",
                    "suffix": ""
                }
            ],
            "year": 1986,
            "venue": "Photosynth. Res.",
            "volume": "10",
            "issn": "",
            "pages": "51-62",
            "other_ids": {
                "DOI": [
                    "10.1007/BF00024185"
                ]
            }
        },
        "BIBREF25": {
            "title": "Phylogenetic relationships and possible hybrid origin of Lycoris species (Amaryllidaceae) revealed by ITS sequences",
            "authors": [
                {
                    "first": "S.D.",
                    "middle": [],
                    "last": "Shi",
                    "suffix": ""
                },
                {
                    "first": "Y.X.",
                    "middle": [],
                    "last": "Qiu",
                    "suffix": ""
                },
                {
                    "first": "E.X.",
                    "middle": [],
                    "last": "Li",
                    "suffix": ""
                },
                {
                    "first": "L.",
                    "middle": [],
                    "last": "Wu",
                    "suffix": ""
                },
                {
                    "first": "C.X.",
                    "middle": [],
                    "last": "Fu",
                    "suffix": ""
                }
            ],
            "year": 2006,
            "venue": "Biochem. Genet.",
            "volume": "44",
            "issn": "",
            "pages": "198-206",
            "other_ids": {
                "DOI": [
                    "10.1007/s10528-006-9023-4"
                ]
            }
        },
        "BIBREF26": {
            "title": "Interspecific variations of photochemical properties in a xerotherm grassland community",
            "authors": [
                {
                    "first": "S.",
                    "middle": [],
                    "last": "Veres",
                    "suffix": ""
                },
                {
                    "first": "O.",
                    "middle": [],
                    "last": "Mile",
                    "suffix": ""
                },
                {
                    "first": "R.",
                    "middle": [],
                    "last": "L\u00e1posi",
                    "suffix": ""
                },
                {
                    "first": "G.",
                    "middle": [
                        "y."
                    ],
                    "last": "Lakatos",
                    "suffix": ""
                },
                {
                    "first": "I.",
                    "middle": [],
                    "last": "M\u00e9sz\u00e1ros",
                    "suffix": ""
                }
            ],
            "year": 2002,
            "venue": "Acta Biol. Szegediensis",
            "volume": "46",
            "issn": "",
            "pages": "237-238",
            "other_ids": {
                "DOI": []
            }
        },
        "BIBREF27": {
            "title": "Effects of light acclimation on the photosynthesis, growth, and biomass allocation in American chestnut (Castanea dentata) seedlings",
            "authors": [
                {
                    "first": "G.G.",
                    "middle": [],
                    "last": "Wang",
                    "suffix": ""
                },
                {
                    "first": "W.L.",
                    "middle": [],
                    "last": "Bauerle",
                    "suffix": ""
                },
                {
                    "first": "B.T.",
                    "middle": [],
                    "last": "Mudder",
                    "suffix": ""
                }
            ],
            "year": 2006,
            "venue": "Forest Ecol. Manag.",
            "volume": "226",
            "issn": "",
            "pages": "173-180",
            "other_ids": {
                "DOI": [
                    "10.1016/j.foreco.2005.12.063"
                ]
            }
        },
        "BIBREF28": {
            "title": "[Determination of galanthamine in bulb of Lycoris radiata by RP-HPLC.]",
            "authors": [
                {
                    "first": "F.L.",
                    "middle": [],
                    "last": "Wu",
                    "suffix": ""
                },
                {
                    "first": "A.Z.",
                    "middle": [],
                    "last": "Li",
                    "suffix": ""
                },
                {
                    "first": "H.F.",
                    "middle": [],
                    "last": "Mao",
                    "suffix": ""
                }
            ],
            "year": 2005,
            "venue": "China J. Chin. Materia Med.",
            "volume": "30",
            "issn": "",
            "pages": "523-525",
            "other_ids": {
                "DOI": []
            }
        },
        "BIBREF29": {
            "title": "[Diurnal and seasonal variations of non-photochemical quenching of chlorophyll fluorescence in sweet Viburnum leaves.]",
            "authors": [
                {
                    "first": "H.",
                    "middle": [],
                    "last": "Wu",
                    "suffix": ""
                },
                {
                    "first": "S.Y.",
                    "middle": [],
                    "last": "Zhang",
                    "suffix": ""
                },
                {
                    "first": "D.Q.",
                    "middle": [],
                    "last": "Xu",
                    "suffix": ""
                },
                {
                    "first": "L.W.",
                    "middle": [],
                    "last": "Guo",
                    "suffix": ""
                },
                {
                    "first": "Y.G.",
                    "middle": [],
                    "last": "Shen",
                    "suffix": ""
                }
            ],
            "year": 1997,
            "venue": "Acta Phytophysiol. Sin.",
            "volume": "23",
            "issn": "",
            "pages": "145-150",
            "other_ids": {
                "DOI": []
            }
        },
        "BIBREF30": {
            "title": "[Some problems in stomatal limitation analysis of photosynthesis.]",
            "authors": [
                {
                    "first": "D.Q.",
                    "middle": [],
                    "last": "Xu",
                    "suffix": ""
                }
            ],
            "year": 1997,
            "venue": "Plant Physiol. Commun.",
            "volume": "33",
            "issn": "",
            "pages": "241-244",
            "other_ids": {
                "DOI": []
            }
        },
        "BIBREF31": {
            "title": "Photosynthetic performance of Lycoris radiata var. radiata to shade treatments",
            "authors": [
                {
                    "first": "S.B.",
                    "middle": [],
                    "last": "Zhou",
                    "suffix": ""
                },
                {
                    "first": "K.",
                    "middle": [],
                    "last": "Liu",
                    "suffix": ""
                },
                {
                    "first": "D.",
                    "middle": [],
                    "last": "Zhang",
                    "suffix": ""
                },
                {
                    "first": "Q.F.",
                    "middle": [],
                    "last": "Li",
                    "suffix": ""
                },
                {
                    "first": "G.P.",
                    "middle": [],
                    "last": "Zhu",
                    "suffix": ""
                }
            ],
            "year": 2010,
            "venue": "Photosynthetica",
            "volume": "48",
            "issn": "",
            "pages": "241-248",
            "other_ids": {
                "DOI": [
                    "10.1007/s11099-010-0030-7"
                ]
            }
        },
        "BIBREF32": {
            "title": "[Comparative anatomy of leaves in 12 species of Lycoris (Amaryllidaceae).]",
            "authors": [
                {
                    "first": "S.B.",
                    "middle": [],
                    "last": "Zhou",
                    "suffix": ""
                },
                {
                    "first": "Q.",
                    "middle": [],
                    "last": "Luo",
                    "suffix": ""
                },
                {
                    "first": "J.H.",
                    "middle": [],
                    "last": "Li",
                    "suffix": ""
                },
                {
                    "first": "Y.",
                    "middle": [],
                    "last": "Wang",
                    "suffix": ""
                }
            ],
            "year": 2006,
            "venue": "Acta Bot. Yunnan.",
            "volume": "28",
            "issn": "",
            "pages": "473-480",
            "other_ids": {
                "DOI": []
            }
        },
        "BIBREF33": {
            "title": "A new chromosome number and karyotype in L. radiata",
            "authors": [
                {
                    "first": "S.",
                    "middle": [],
                    "last": "Bose",
                    "suffix": ""
                }
            ],
            "year": 1963,
            "venue": "Nature",
            "volume": "197",
            "issn": "",
            "pages": "1229-1230",
            "other_ids": {
                "DOI": [
                    "10.1038/1971229b0"
                ]
            }
        },
        "BIBREF34": {
            "title": "Karyotypes of six populations of Lycoris radiata and discovery of the tetraploid",
            "authors": [
                {
                    "first": "S.B.",
                    "middle": [],
                    "last": "Zhou",
                    "suffix": ""
                },
                {
                    "first": "B.Q.",
                    "middle": [],
                    "last": "Yu",
                    "suffix": ""
                },
                {
                    "first": "Q.",
                    "middle": [],
                    "last": "Luo",
                    "suffix": ""
                },
                {
                    "first": "J.R.",
                    "middle": [],
                    "last": "Hu",
                    "suffix": ""
                },
                {
                    "first": "D.",
                    "middle": [],
                    "last": "Bi",
                    "suffix": ""
                }
            ],
            "year": 2007,
            "venue": "Acta Phytotaxon. Sin.",
            "volume": "45",
            "issn": "",
            "pages": "513-522",
            "other_ids": {
                "DOI": [
                    "10.1360/aps050108"
                ]
            }
        },
        "BIBREF35": {
            "title": "[Photosynthetic characteristics comparison between an invasive plant, Lantana camara L., and associated species]",
            "authors": [
                {
                    "first": "H.",
                    "middle": [],
                    "last": "Zhu",
                    "suffix": ""
                },
                {
                    "first": "R.J.",
                    "middle": [],
                    "last": "Ma",
                    "suffix": ""
                }
            ],
            "year": 2009,
            "venue": "Acta Ecol. Sin.",
            "volume": "29",
            "issn": "",
            "pages": "2701-2709",
            "other_ids": {
                "DOI": []
            }
        },
        "BIBREF36": {
            "title": "[Analysis of genetic diversity in Lycoris radiata using ISSR marker.]",
            "authors": [
                {
                    "first": "H.",
                    "middle": [],
                    "last": "Zuo",
                    "suffix": ""
                },
                {
                    "first": "Z.L.",
                    "middle": [],
                    "last": "Yang",
                    "suffix": ""
                },
                {
                    "first": "X.",
                    "middle": [],
                    "last": "Yang",
                    "suffix": ""
                },
                {
                    "first": "Z.F.",
                    "middle": [],
                    "last": "Tan",
                    "suffix": ""
                },
                {
                    "first": "H.H.",
                    "middle": [],
                    "last": "Yu",
                    "suffix": ""
                }
            ],
            "year": 2008,
            "venue": "Forest Res.",
            "volume": "21",
            "issn": "",
            "pages": "768-772",
            "other_ids": {
                "DOI": []
            }
        },
        "BIBREF37": {
            "title": "Notes on allozyme variation in Lycoris radiata (Amaryllidaceae) from Korea",
            "authors": [
                {
                    "first": "M.G.",
                    "middle": [],
                    "last": "Chung",
                    "suffix": ""
                }
            ],
            "year": 1999,
            "venue": "Bot. Bull. Acad. Sin.",
            "volume": "40",
            "issn": "",
            "pages": "227-230",
            "other_ids": {
                "DOI": []
            }
        },
        "BIBREF38": {
            "title": "[Study on leaf micro-morphological characteristics of Lycoris (Amaryllidaceae).]",
            "authors": [
                {
                    "first": "C.L.",
                    "middle": [],
                    "last": "Deng",
                    "suffix": ""
                },
                {
                    "first": "J.",
                    "middle": [],
                    "last": "Zhou",
                    "suffix": ""
                }
            ],
            "year": 2005,
            "venue": "Acta Bot. Boreal.-Occident. Sin.",
            "volume": "25",
            "issn": "",
            "pages": "355-362",
            "other_ids": {
                "DOI": []
            }
        },
        "BIBREF39": {
            "title": "[Microwave-assisted extractin of alkaloids in Lycoris radiata using ionic liquids solution.]",
            "authors": [
                {
                    "first": "F.Y.",
                    "middle": [],
                    "last": "Du",
                    "suffix": ""
                },
                {
                    "first": "X.H.",
                    "middle": [],
                    "last": "Xiao",
                    "suffix": ""
                },
                {
                    "first": "G.K.",
                    "middle": [],
                    "last": "Li",
                    "suffix": ""
                }
            ],
            "year": 2007,
            "venue": "Chinese J. Anal. Chem.",
            "volume": "11",
            "issn": "",
            "pages": "1570-1574",
            "other_ids": {
                "DOI": []
            }
        },
        "BIBREF40": {
            "title": "Stomatal conductance and photosynthesis",
            "authors": [
                {
                    "first": "G.D.",
                    "middle": [],
                    "last": "Farquhar",
                    "suffix": ""
                },
                {
                    "first": "T.D.",
                    "middle": [],
                    "last": "Sharkey",
                    "suffix": ""
                }
            ],
            "year": 1982,
            "venue": "Ann. Rev. Plant. Physiol.",
            "volume": "33",
            "issn": "",
            "pages": "317-345",
            "other_ids": {
                "DOI": [
                    "10.1146/annurev.pp.33.060182.001533"
                ]
            }
        },
        "BIBREF41": {
            "title": "[The photosynthesis physiology, cytology and cultural characteristics of Lycoris aurea Herb. and Lycoris radiata Herb.]",
            "authors": [
                {
                    "first": "Z.W.",
                    "middle": [],
                    "last": "Guo",
                    "suffix": ""
                },
                {
                    "first": "G.C.",
                    "middle": [],
                    "last": "Guo",
                    "suffix": ""
                },
                {
                    "first": "Y.F.",
                    "middle": [],
                    "last": "Xiong",
                    "suffix": ""
                },
                {
                    "first": "H.R.",
                    "middle": [],
                    "last": "Xiong",
                    "suffix": ""
                },
                {
                    "first": "S.X.",
                    "middle": [],
                    "last": "Yue",
                    "suffix": ""
                },
                {
                    "first": "Z.G.",
                    "middle": [],
                    "last": "Huang",
                    "suffix": ""
                }
            ],
            "year": 2007,
            "venue": "Acta Agric. Boreal-occident. Sin.",
            "volume": "16",
            "issn": "",
            "pages": "136-141",
            "other_ids": {
                "DOI": []
            }
        }
    }
}