{
    "paper_id": "47931ee3b584a1e47aa31715c9f6bc2775173198",
    "metadata": {
        "title": "ARBs and ACEIs in COVID-19 \u00a9 2020 Mayo Foundation for Medical Education and Research",
        "authors": [
            {
                "first": "Fabian",
                "middle": [],
                "last": "Sanchis-Gomar",
                "suffix": "",
                "affiliation": {},
                "email": ""
            },
            {
                "first": "Carl",
                "middle": [
                    "J"
                ],
                "last": "Lavie",
                "suffix": "",
                "affiliation": {},
                "email": ""
            },
            {
                "first": ";",
                "middle": [],
                "last": "Carme Perez-Quilis",
                "suffix": "",
                "affiliation": {},
                "email": ""
            },
            {
                "first": "Brandon",
                "middle": [
                    "M"
                ],
                "last": "Henry",
                "suffix": "",
                "affiliation": {},
                "email": ""
            },
            {
                "first": "Giuseppe",
                "middle": [],
                "last": "Lippi",
                "suffix": "",
                "affiliation": {},
                "email": ""
            }
        ]
    },
    "abstract": [],
    "body_text": [
        {
            "text": "March 30, 2020 HTN prevalence increases in parallel with aging, this pattern may represent the expected prevalence for the given age group. Therefore, although the number of fatal COVID-19 positive patients treated with ACEIs was more than twice the number of those treated with ARBs, one cannot definitely conclude risks or benefits of these therapies due to confounding variables of age, HTN, as well as the impact of yet unidentified comorbidities on outcome with the COVID-19 pandemic.",
            "cite_spans": [],
            "ref_spans": [],
            "section": "Mayo Clinic Proceedings"
        },
        {
            "text": "In a recent study, in which potential drugs targeting SARS-CoV-2 were evaluated, the authors reported that ARBs (e.g., irbesartan) may associate with some human coronaviruses-associated host proteins in the human interactome. 34 Irbesartan targets the SLC10A1 gene (solute carrier family 10 member 1), which interacts with C11orf74 gene, a potential transcriptional repressor that interacts with the non-structural protein 10 (NSP10) of SARS-CoV and participates in CoV replication fidelity. 35 Crackower and co-workers 36 reported that disruption of ACE2 results in increased Ang II levels and impaired cardiac function, whereas other authors showed that ACE2 overexpression reduced left ventricular hypertrophy and myocardial fibrosis in HTN rats. 37 Deshotels et al. 50 investigated the compensatory reduction of ACE2 expression and activity in response to Ang II-mediated HTN. Elevated levels of Ang II decreased ACE2 activity on the cell surface via an AT 1 Rdependent internalization mechanism. 50 Moreover, in vitro treatment of HEK293T cells with Ang II enhanced ACE2 ubiquitination also mediated by AT 1 R, which ultimately stimulates ACE2 lysosomal degradation (which might prevent interaction of the SARS-Co-V2 with ACE2 catalytic site). 50 This is reported to be prevented by AT 1 R antagonist losartan which may block internalization, proteolytic degradation and ubiquitination of ACE2. 50 As such, this latter pathway represents another mechanism by which ACEIs or ARBs could prevent COVID-19 viral entry. If the viral protein interaction with ACE2 is reduced in the presence of stabilized ACE2-AT 1 R complexes, then ARBs could prove beneficial by stabilizing ACE2-AT 1 R interaction and preventing viral protein-ACE2 interaction and internalization. Based on this mechanism of action, Gurwitz recently suggests ARBs (losartan and telmisartan) as a tentative therapy for COVID-19 patients prior to the development of ALI/acute respiratory failure. 51 However, it remains unknown whether preventing ACE2 internalization would be effective at attenuating infections by SARS coronaviruses, and further studies are urgently needed to clarify this mechanism.",
            "cite_spans": [
                {
                    "start": 226,
                    "end": 228,
                    "text": "34",
                    "ref_id": "BIBREF30"
                },
                {
                    "start": 492,
                    "end": 494,
                    "text": "35",
                    "ref_id": "BIBREF31"
                },
                {
                    "start": 520,
                    "end": 522,
                    "text": "36",
                    "ref_id": "BIBREF32"
                },
                {
                    "start": 750,
                    "end": 752,
                    "text": "37",
                    "ref_id": "BIBREF33"
                },
                {
                    "start": 770,
                    "end": 772,
                    "text": "50",
                    "ref_id": "BIBREF46"
                },
                {
                    "start": 1001,
                    "end": 1003,
                    "text": "50",
                    "ref_id": "BIBREF46"
                },
                {
                    "start": 1249,
                    "end": 1251,
                    "text": "50",
                    "ref_id": "BIBREF46"
                },
                {
                    "start": 1400,
                    "end": 1402,
                    "text": "50",
                    "ref_id": "BIBREF46"
                },
                {
                    "start": 1963,
                    "end": 1965,
                    "text": "51",
                    "ref_id": "BIBREF47"
                }
            ],
            "ref_spans": [],
            "section": "Mayo Clinic Proceedings"
        },
        {
            "text": "Interestingly, Liu et al. 52 reported serum Ang II levels were significantly higher in COVID-19 infected than non-infected individuals and linearly associated with viral load and lung damage. It is suspected that Ang II, via pulmonary vasoconstriction leading to decrease flow and ventilation/perfusion mismatch and via increased vascular permeability and its proinflammatory and pro-oxidative properties, may induce or perpetuate ARDS in a variety of pathologies. 53 The findings by Liu et al. 52 would support the hypothesis that elevated levels of Ang II may foster ARDS in COVID-19 patients. Nevertheless, this study has important limitations as it was performed in a limited sample and, as such, require confirmation. 52 The role of RAAS peptides in acute lung injury has been also investigated in other ARDS patients (diagnosed within 24 hours) by using a targeted metabolomics approach. 54 Ang I concentrations were significantly higher in non-survivors at study entry and at 72 hours, while ARDS survival was associated with lower Ang I levels but higher Ang 1-9 concentration (a precursor to Ang 1-7 significantly higher average Ang 1-9/Ang I and Ang 1-7/Ang I ratios, which suggests that ACE2 activity is higher in survivors than non-survivors. 54 Therefore, ACE2 activities seems to be reduced in patients who succumb from ARDS.",
            "cite_spans": [
                {
                    "start": 26,
                    "end": 28,
                    "text": "52",
                    "ref_id": "BIBREF48"
                },
                {
                    "start": 465,
                    "end": 467,
                    "text": "53",
                    "ref_id": "BIBREF49"
                },
                {
                    "start": 495,
                    "end": 497,
                    "text": "52",
                    "ref_id": "BIBREF48"
                },
                {
                    "start": 723,
                    "end": 725,
                    "text": "52",
                    "ref_id": "BIBREF48"
                },
                {
                    "start": 894,
                    "end": 896,
                    "text": "54",
                    "ref_id": "BIBREF50"
                },
                {
                    "start": 1255,
                    "end": 1257,
                    "text": "54",
                    "ref_id": "BIBREF50"
                }
            ],
            "ref_spans": [],
            "section": "Mayo Clinic Proceedings"
        },
        {
            "text": "Further downstream, high levels of Ang II, which may be due to attenuated ACE2, such as that potentially caused by the SARS-CoV-2 interaction with ACE2, stimulates increased production of aldosterone. Aldosterone in turn increases ACE activity inducing further production of Ang II, leading to a potentially vicious cycle which perpetuates ARDS. 55 Moreover, aldosterone decreases expression of the MasR, minimizing the antagonizing benefits of any Ang 1-7 produced by ACE2. As such, aldosterone receptor blockers or aldosterone synthase inhibitors may have a potential role in COVID-19 therapy;",
            "cite_spans": [
                {
                    "start": 346,
                    "end": 348,
                    "text": "55",
                    "ref_id": "BIBREF51"
                }
            ],
            "ref_spans": [],
            "section": "Mayo Clinic Proceedings"
        },
        {
            "text": "however, careful evaluation of any influence on corticosteroids synthesis and signaling is required. 55 Since SARS-CoV-2 invades alveolar epithelial cells, respiratory symptoms are often the most common reported, and is reported to be more severe in patients with CVD. 23 This might be associated with higher ACE2 levels, which has been suggested to be increased in patients maintained on RAAS inhibitors. 23 However, in a study conducted in rats by Xudong et al., 56 ACE2 expression dramatically decreased with age in both genders, while older male rats also had lower ACE2 concentrations than did older female rats.",
            "cite_spans": [
                {
                    "start": 101,
                    "end": 103,
                    "text": "55",
                    "ref_id": "BIBREF51"
                },
                {
                    "start": 269,
                    "end": 271,
                    "text": "23",
                    "ref_id": "BIBREF24"
                },
                {
                    "start": 406,
                    "end": 408,
                    "text": "23",
                    "ref_id": "BIBREF24"
                }
            ],
            "ref_spans": [],
            "section": "Mayo Clinic Proceedings"
        },
        {
            "text": "Whether such altered profiles of ACE2 are similarly observed in humans, or if ACE2 expression is altered in disease, requires further investigation.",
            "cite_spans": [],
            "ref_spans": [],
            "section": "Mayo Clinic Proceedings"
        },
        {
            "text": "It has also been recently demonstrated that recombinant ACE2 administration in mice with ARDS protects from development of ALI and severe lung disease, thus strongly suggesting that ACE2 mediates a cytoprotective role in ALI; 57 whether such effects are also observed in ARDS caused by COVID-19 is unknown at this time Thus extrapolating from these and previously discussed findings, one may speculate that the administration of recombinant ACE2 or its product Ang 1-7, which directly opposes Ang II, may offer potentially beneficial effects in SARS-CoV-2-associated ARDS. 57 Moreover, specifically with SARS- ARDS. Such an approach in preclinical studies of ARDS specifically due to COVID-19 is especially important and timely.",
            "cite_spans": [],
            "ref_spans": [],
            "section": "Mayo Clinic Proceedings"
        },
        {
            "text": "SARS-CoV-2 binding to ACE2 may attenuate residual ACE2 activity, further tipping the ACE/ACE2",
            "cite_spans": [],
            "ref_spans": [],
            "section": "CONCLUSIONS AND POTENTIAL RECOMMENDATIONS"
        },
        {
            "text": "balance to a predominant ACE/AngII/AT1 axis signaling, in which AngII may then foster pulmonary vasoconstriction, and inflammatory and oxidative organ damage, ultimately progressing towards ALI/ARDS. 53 We speculate that RAAS dysregulation may play a central role in the pathophysiology of (Table 1 ). In this article, we review the evidence on the relationship between the Renin-Angiotensin-Aldosterone system (RAAS) and COVID-19 infection.",
            "cite_spans": [
                {
                    "start": 200,
                    "end": 202,
                    "text": "53",
                    "ref_id": "BIBREF49"
                }
            ],
            "ref_spans": [
                {
                    "start": 290,
                    "end": 298,
                    "text": "(Table 1",
                    "ref_id": null
                }
            ],
            "section": "CONCLUSIONS AND POTENTIAL RECOMMENDATIONS"
        },
        {
            "text": "Healthcare professionals, physicians, researchers, and patients are actively debating the potential influence of J o u r n a l P r e -P r o o f interstitial pneumonia and ARDS) and lymphopenia. Moreover, ACE2 is observed on the surface of many other cell types, such as those of the heart, kidney, liver, gastrointestinal tract (especially esophagus, stomach, colon, ileum, rectum) and bladder (Figure 1 ). 9-11",
            "cite_spans": [],
            "ref_spans": [
                {
                    "start": 394,
                    "end": 403,
                    "text": "(Figure 1",
                    "ref_id": "FIGREF1"
                }
            ],
            "section": "SPECULATION"
        },
        {
            "text": "Kuba et al. 12 first showed that ACE2 is essential for SARS-CoV infection, acting as its effective host receptor in vivo. SARS-CoV infection, through binding of viral S protein to ACE2, seems to reduce receptor expression. Injecting SARS-CoV Spike into mice induces acute lung injury (ALI) in vivo, which can be mitigated by blocking the RAAS. Wrapp et al. 13 have recently reported that SARS-CoV-2 binds to ACE2",
            "cite_spans": [
                {
                    "start": 12,
                    "end": 14,
                    "text": "12",
                    "ref_id": "BIBREF13"
                },
                {
                    "start": 357,
                    "end": 359,
                    "text": "13",
                    "ref_id": "BIBREF14"
                }
            ],
            "ref_spans": [],
            "section": "SPECULATION"
        },
        {
            "text": "with 10-to 20-fold higher affinity compared to SARS-CoV. Specifically, the S protein of SARS-CoV-2 virus binds to the catalytic domain of ACE2 inducing internalization of the virus by the cell.",
            "cite_spans": [],
            "ref_spans": [],
            "section": "SPECULATION"
        },
        {
            "text": "In brief, the RAAS is the central regulatory system for BP control. 14 Additionally, RAAS activation plays a crucial pathogenic role in HTN, through hemodynamic actions and cytokines and intracellular signaling pathways, which ultimately promote many adverse cellular processes implicated in systemic damage. 14 In the RAAS, Angiotensin I (Ang I) is converted to angiotensin II (Ang II) by ACE. Ang II mediates vasoconstrictive, pro-inflammatory and pro-oxidative effects through agonism at Ang II type 1 receptor (AT 1 R). 15 ACE2 converts Ang II to angiotensin 1-7 (Ang1-7), which finally binds to Mas receptor (MasR) and mediates many beneficial actions, including vasodilation and anti-inflammatory, anti-oxidant and antiapoptotic effects. 15 Thus, ACE2/Ang1-7/MasR axis has opposite actions to ACE/AngII/AT 1 R axis ( Figure   2 ).",
            "cite_spans": [
                {
                    "start": 744,
                    "end": 746,
                    "text": "15",
                    "ref_id": "BIBREF16"
                }
            ],
            "ref_spans": [
                {
                    "start": 823,
                    "end": 833,
                    "text": "Figure   2",
                    "ref_id": "FIGREF2"
                }
            ],
            "section": "SPECULATION"
        },
        {
            "text": "ACE2, a homologue of ACE, is an integral cell membrane protein with a catalytic domain on the extracellular surface exposed to vasoactive peptides. 16 ACE2 is a monocarboxypeptidase whose major role is converting Ang II to Ang 1-7, 16 with vasodilatory and antifibrotic actions 17 when it activates MasR. 18 Moreover, ACE2 also converts Ang I to Ang 1-9 which can be further converted by ACE into Ang 1-7.",
            "cite_spans": [
                {
                    "start": 148,
                    "end": 150,
                    "text": "16",
                    "ref_id": "BIBREF17"
                },
                {
                    "start": 232,
                    "end": 234,
                    "text": "16",
                    "ref_id": "BIBREF17"
                },
                {
                    "start": 305,
                    "end": 307,
                    "text": "18",
                    "ref_id": "BIBREF19"
                }
            ],
            "ref_spans": [],
            "section": "SPECULATION"
        },
        {
            "text": "Thus, ACE2 limits the adverse vasoconstrictor and profibrotic effects of Ang II through its degradation and by counteracting its actions through the formation of Ang 1-7. The high expression of ACE2 in heart, type II ",
            "cite_spans": [],
            "ref_spans": [],
            "section": "SPECULATION"
        },
        {
            "text": "It has been hypothesized that increased levels of ACE2 may facilitate COVID-19 infection, such that administering ARBs or ACEIs might increase the risk of developing severe and fatal COVID-19. [24] [25] [26] As discussed later in this section, this premise is based in part on the findings in some, but not all, studies that ARBs and ACEIs may increase ACE2 levels. According to the most recent studies on COVID-19, it appears that HTN is one of the most important factors associated with poor prognosis at an early stage of COVID-19",
            "cite_spans": [
                {
                    "start": 193,
                    "end": 197,
                    "text": "[24]",
                    "ref_id": "BIBREF25"
                },
                {
                    "start": 198,
                    "end": 202,
                    "text": "[25]",
                    "ref_id": null
                },
                {
                    "start": 203,
                    "end": 207,
                    "text": "[26]",
                    "ref_id": null
                }
            ],
            "ref_spans": [],
            "section": "DELETERIOUS OR BENEFICIAL?"
        },
        {
            "text": "infection. 27-32 HTN, however, has also been found to be associated with decreased baseline levels of ACE2 expression. Unfortunately, most of these early COVID-19 studies have not been adjusted for age or other co- In a recent study, in which potential drugs targeting SARS-CoV-2 were evaluated, the authors reported that ARBs (e.g., irbesartan) may associate with some human coronaviruses-associated host proteins in the human interactome. 34 Irbesartan targets the SLC10A1 gene (solute carrier family 10 member 1), which interacts with C11orf74 gene, a potential transcriptional repressor that interacts with the non-structural protein 10 (NSP10) of SARS-CoV and participates in CoV replication fidelity. 35 Crackower and co-workers 36 Deshotels et al. 50 investigated the compensatory reduction of ACE2 expression and activity in response to Ang II-mediated HTN. Elevated levels of Ang II decreased ACE2 activity on the cell surface via an AT 1 Rdependent internalization mechanism. 50 Moreover, in vitro treatment of HEK293T cells with Ang II enhanced ACE2 ubiquitination also mediated by AT 1 R, which ultimately stimulates ACE2 lysosomal degradation (which might prevent interaction of the SARS-Co-V2 with ACE2 catalytic site). 50 This is reported to be prevented by AT 1 R antagonist losartan which may block internalization, proteolytic degradation and ubiquitination of ACE2. 50 As such, this latter pathway represents another mechanism by which ACEIs or ARBs could prevent COVID-19 viral entry. If the viral protein interaction with ACE2 is reduced in the presence of stabilized ACE2-AT 1 R complexes, then ARBs could prove beneficial by stabilizing ACE2-AT 1 R interaction and preventing viral protein-ACE2 interaction and internalization. Based on this mechanism of action, Gurwitz recently suggests ARBs (losartan and telmisartan) as a tentative therapy for COVID-19 patients prior to the development of ALI/acute respiratory failure. 51 However, it remains unknown whether preventing ACE2 internalization would be effective at attenuating infections by SARS coronaviruses, and further studies are urgently needed to clarify this mechanism.",
            "cite_spans": [
                {
                    "start": 441,
                    "end": 443,
                    "text": "34",
                    "ref_id": "BIBREF30"
                },
                {
                    "start": 707,
                    "end": 709,
                    "text": "35",
                    "ref_id": "BIBREF31"
                },
                {
                    "start": 735,
                    "end": 737,
                    "text": "36",
                    "ref_id": "BIBREF32"
                },
                {
                    "start": 755,
                    "end": 757,
                    "text": "50",
                    "ref_id": "BIBREF46"
                },
                {
                    "start": 986,
                    "end": 988,
                    "text": "50",
                    "ref_id": "BIBREF46"
                },
                {
                    "start": 1234,
                    "end": 1236,
                    "text": "50",
                    "ref_id": "BIBREF46"
                },
                {
                    "start": 1385,
                    "end": 1387,
                    "text": "50",
                    "ref_id": "BIBREF46"
                },
                {
                    "start": 1948,
                    "end": 1950,
                    "text": "51",
                    "ref_id": "BIBREF47"
                }
            ],
            "ref_spans": [],
            "section": "DELETERIOUS OR BENEFICIAL?"
        },
        {
            "text": "Interestingly, Liu et al. 52 reported serum Ang II levels were significantly higher in COVID-19 infected than non-infected individuals and linearly associated with viral load and lung damage. It is suspected that Ang II, via pulmonary vasoconstriction leading to decrease flow and ventilation/perfusion mismatch and via increased vascular permeability and its proinflammatory and pro-oxidative properties, may induce or perpetuate ARDS in a variety of pathologies. 53 The findings by Liu et al. 52 would support the hypothesis that elevated levels of Ang II may foster ARDS in COVID-19 patients. Nevertheless, this study has important limitations as it was performed in a limited sample and, as such, require confirmation. 52 The role of RAAS peptides in acute lung injury has been also investigated in other ARDS patients (diagnosed within 24 hours) by using a targeted metabolomics approach. 54 Ang I concentrations were significantly higher in non-survivors at study entry and at 72 hours, while ARDS survival was associated with lower Ang I levels but higher Ang 1-9 concentration (a precursor to Ang 1-7). Survivors showed a",
            "cite_spans": [
                {
                    "start": 26,
                    "end": 28,
                    "text": "52",
                    "ref_id": "BIBREF48"
                },
                {
                    "start": 465,
                    "end": 467,
                    "text": "53",
                    "ref_id": "BIBREF49"
                },
                {
                    "start": 495,
                    "end": 497,
                    "text": "52",
                    "ref_id": "BIBREF48"
                },
                {
                    "start": 723,
                    "end": 725,
                    "text": "52",
                    "ref_id": "BIBREF48"
                },
                {
                    "start": 894,
                    "end": 896,
                    "text": "54",
                    "ref_id": "BIBREF50"
                }
            ],
            "ref_spans": [],
            "section": "DELETERIOUS OR BENEFICIAL?"
        },
        {
            "text": "SARS-CoV-2 binding to ACE2 may attenuate residual ACE2 activity, further tipping the ACE/ACE2",
            "cite_spans": [],
            "ref_spans": [],
            "section": "CONCLUSIONS AND POTENTIAL RECOMMENDATIONS"
        },
        {
            "text": "balance to a predominant ACE/AngII/AT1 axis signaling, in which AngII may then foster pulmonary vasoconstriction, and inflammatory and oxidative organ damage, ultimately progressing towards ALI/ARDS. 53 We speculate that RAAS dysregulation may play a central role in the pathophysiology of COVID-19 associated ALI/ARDS, but definitive studies that address this issue are needed. Whether RAAS modulation may have a beneficial effect in selected patients with severe COVID-19 at risk for ALI/ARDS is entirely unknown at the present time. Moreover, the effects of other agents that may interrupt the RAAS by inhibiting renin, such as renin inhibitors and beta-blockers, would also be of interest regarding their effects on COVID-19 and attendant ALI.",
            "cite_spans": [
                {
                    "start": 200,
                    "end": 202,
                    "text": "53",
                    "ref_id": "BIBREF49"
                }
            ],
            "ref_spans": [],
            "section": "CONCLUSIONS AND POTENTIAL RECOMMENDATIONS"
        },
        {
            "text": "In agreement with current guidelines, patients with HTN should continue taking anti-HTN medications as prescribed without interruption. Current evidence shows that RAAS inhibitors, i.e., ACEIs and ARBs, significantly reduce mortality in CVD, reduce the progression of CKD, and are the cornerstone of HF and HTN treatment. ACEIs or ARBs therapy should be maintained or initiated, as indicated, in patients with HF, HTN, or myocardial infarction, regardless of SARS-CoV-2. No differences exist between ARBs and ACEIs in terms of efficacy to decrease BP and improve other outcomes, such as all-cause mortality, CVD mortality, myocardial infarction, HF, stroke, and end-stage renal disease. 58 ACEIs are associated with cough secondary to accumulation of bradykinin and angioedema, while withdrawal rates due to adverse events are lower with ARBs. 58 Given the equal efficacy but fewer adverse events, ARBs could potentially be a more favorable treatment option in COVID-19 patients at higher risk of developing severe forms of disease ( ",
            "cite_spans": [],
            "ref_spans": [],
            "section": "CONCLUSIONS AND POTENTIAL RECOMMENDATIONS"
        }
    ],
    "bib_entries": {
        "BIBREF0": {
            "ref_id": "b0",
            "title": "Guide to Understanding the 2019 Novel Coronavirus",
            "authors": [
                {
                    "first": "A",
                    "middle": [],
                    "last": "Shah",
                    "suffix": ""
                },
                {
                    "first": "R",
                    "middle": [],
                    "last": "Kashyap",
                    "suffix": ""
                },
                {
                    "first": "P",
                    "middle": [],
                    "last": "Tosh",
                    "suffix": ""
                },
                {
                    "first": "P",
                    "middle": [],
                    "last": "Sampathkumar",
                    "suffix": ""
                },
                {
                    "first": "O",
                    "middle": [],
                    "last": "Horo",
                    "suffix": ""
                },
                {
                    "first": "J",
                    "middle": [
                        "C"
                    ],
                    "last": "",
                    "suffix": ""
                }
            ],
            "year": 2020,
            "venue": "Mayo Clin Proc",
            "volume": "",
            "issn": "",
            "pages": "",
            "other_ids": {
                "DOI": [
                    "10.1016/j.mayocp.2020.02.003"
                ]
            }
        },
        "BIBREF1": {
            "ref_id": "b1",
            "title": "Covid-19: WHO declares pandemic because of \"alarming levels\" of spread, severity, and inaction",
            "authors": [
                {
                    "first": "E",
                    "middle": [],
                    "last": "Mahase",
                    "suffix": ""
                }
            ],
            "year": 2020,
            "venue": "BMJ",
            "volume": "368",
            "issn": "",
            "pages": "",
            "other_ids": {}
        },
        "BIBREF2": {
            "ref_id": "b2",
            "title": "Coronavirus disease 2019 (COVID-19): the portrait of a perfect storm",
            "authors": [
                {
                    "first": "G",
                    "middle": [],
                    "last": "Lippi",
                    "suffix": ""
                },
                {
                    "first": "F",
                    "middle": [],
                    "last": "Sanchis-Gomar",
                    "suffix": ""
                },
                {
                    "first": "B",
                    "middle": [
                        "M"
                    ],
                    "last": "Henry",
                    "suffix": ""
                }
            ],
            "year": 2020,
            "venue": "Ann Transl Med",
            "volume": "",
            "issn": "",
            "pages": "",
            "other_ids": {
                "DOI": [
                    "10.21037/atm.2020.03.157"
                ]
            }
        },
        "BIBREF3": {
            "ref_id": "b3",
            "title": "World Health Organization. Coronavirus disease 2019 (COVID-19) Situation Report -62",
            "authors": [],
            "year": 2020,
            "venue": "",
            "volume": "",
            "issn": "",
            "pages": "",
            "other_ids": {}
        },
        "BIBREF4": {
            "ref_id": "b4",
            "title": "Characteristics of and important lessons from the coronavirus disease 2019 (COVID-19) outbreak in China: Summary of a report of 72314 cases from the Chinese Center for Disease Control and Prevention",
            "authors": [
                {
                    "first": "Z",
                    "middle": [],
                    "last": "Wu",
                    "suffix": ""
                },
                {
                    "first": "J",
                    "middle": [
                        "M"
                    ],
                    "last": "Mcgoogan",
                    "suffix": ""
                }
            ],
            "year": null,
            "venue": "JAMA",
            "volume": "2020",
            "issn": "",
            "pages": "",
            "other_ids": {
                "DOI": [
                    "10.1001/jama.2020.2648"
                ]
            }
        },
        "BIBREF5": {
            "ref_id": "b5",
            "title": "Fair Allocation of Scarce Medical Resources in the Time of Covid-19",
            "authors": [
                {
                    "first": "E",
                    "middle": [
                        "J"
                    ],
                    "last": "Emanuel",
                    "suffix": ""
                },
                {
                    "first": "G",
                    "middle": [],
                    "last": "Persad",
                    "suffix": ""
                },
                {
                    "first": "R",
                    "middle": [],
                    "last": "Upshur",
                    "suffix": ""
                }
            ],
            "year": 2020,
            "venue": "",
            "volume": "",
            "issn": "",
            "pages": "",
            "other_ids": {}
        },
        "BIBREF6": {
            "ref_id": "b6",
            "title": "Guide to Understanding the 2019 Novel Coronavirus",
            "authors": [
                {
                    "first": "A",
                    "middle": [],
                    "last": "Shah",
                    "suffix": ""
                },
                {
                    "first": "R",
                    "middle": [],
                    "last": "Kashyap",
                    "suffix": ""
                },
                {
                    "first": "P",
                    "middle": [],
                    "last": "Tosh",
                    "suffix": ""
                },
                {
                    "first": "P",
                    "middle": [],
                    "last": "Sampathkumar",
                    "suffix": ""
                },
                {
                    "first": "O",
                    "middle": [],
                    "last": "Horo",
                    "suffix": ""
                },
                {
                    "first": "J",
                    "middle": [
                        "C"
                    ],
                    "last": "",
                    "suffix": ""
                }
            ],
            "year": 2020,
            "venue": "Mayo Clin Proc",
            "volume": "",
            "issn": "",
            "pages": "",
            "other_ids": {
                "DOI": [
                    "10.1016/j.mayocp.2020.02.003"
                ]
            }
        },
        "BIBREF7": {
            "ref_id": "b7",
            "title": "Covid-19: WHO declares pandemic because of \"alarming levels\" of spread, severity, and inaction",
            "authors": [
                {
                    "first": "E",
                    "middle": [],
                    "last": "Mahase",
                    "suffix": ""
                }
            ],
            "year": 2020,
            "venue": "BMJ",
            "volume": "368",
            "issn": "",
            "pages": "",
            "other_ids": {}
        },
        "BIBREF8": {
            "ref_id": "b8",
            "title": "Coronavirus disease 2019 (COVID-19): the portrait of a perfect storm",
            "authors": [
                {
                    "first": "G",
                    "middle": [],
                    "last": "Lippi",
                    "suffix": ""
                },
                {
                    "first": "F",
                    "middle": [],
                    "last": "Sanchis-Gomar",
                    "suffix": ""
                },
                {
                    "first": "B",
                    "middle": [
                        "M"
                    ],
                    "last": "Henry",
                    "suffix": ""
                }
            ],
            "year": 2020,
            "venue": "Ann Transl Med",
            "volume": "",
            "issn": "",
            "pages": "",
            "other_ids": {
                "DOI": [
                    "10.21037/atm.2020.03.157"
                ]
            }
        },
        "BIBREF9": {
            "ref_id": "b9",
            "title": "World Health Organization. Coronavirus disease 2019 (COVID-19) Situation Report -62",
            "authors": [],
            "year": 2020,
            "venue": "",
            "volume": "",
            "issn": "",
            "pages": "",
            "other_ids": {}
        },
        "BIBREF10": {
            "ref_id": "b10",
            "title": "Characteristics of and important lessons from the coronavirus disease 2019 (COVID-19) outbreak in China: Summary of a report of 72314 cases from the Chinese Center for Disease Control and Prevention",
            "authors": [
                {
                    "first": "Z",
                    "middle": [],
                    "last": "Wu",
                    "suffix": ""
                },
                {
                    "first": "J",
                    "middle": [
                        "M"
                    ],
                    "last": "Mcgoogan",
                    "suffix": ""
                }
            ],
            "year": null,
            "venue": "JAMA",
            "volume": "2020",
            "issn": "",
            "pages": "",
            "other_ids": {
                "DOI": [
                    "10.1001/jama.2020.2648"
                ]
            }
        },
        "BIBREF11": {
            "ref_id": "b11",
            "title": "Fair Allocation of Scarce Medical Resources in the Time of Covid-19",
            "authors": [
                {
                    "first": "E",
                    "middle": [
                        "J"
                    ],
                    "last": "Emanuel",
                    "suffix": ""
                },
                {
                    "first": "G",
                    "middle": [],
                    "last": "Persad",
                    "suffix": ""
                },
                {
                    "first": "R",
                    "middle": [],
                    "last": "Upshur",
                    "suffix": ""
                }
            ],
            "year": 2020,
            "venue": "",
            "volume": "",
            "issn": "",
            "pages": "",
            "other_ids": {}
        },
        "BIBREF12": {
            "ref_id": "b12",
            "title": "SARS-CoV2: should inhibitors of the renin-angiotensin system be withdrawn in patients with COVID-19?",
            "authors": [
                {
                    "first": "G",
                    "middle": [
                        "M"
                    ],
                    "last": "Kuster",
                    "suffix": ""
                },
                {
                    "first": "O",
                    "middle": [],
                    "last": "Pfister",
                    "suffix": ""
                },
                {
                    "first": "T",
                    "middle": [],
                    "last": "Burkard",
                    "suffix": ""
                }
            ],
            "year": 2020,
            "venue": "Eur Heart J",
            "volume": "",
            "issn": "",
            "pages": "",
            "other_ids": {}
        },
        "BIBREF13": {
            "ref_id": "b13",
            "title": "A crucial role of angiotensin converting enzyme 2 (ACE2) in SARS coronavirus-induced lung injury",
            "authors": [
                {
                    "first": "K",
                    "middle": [],
                    "last": "Kuba",
                    "suffix": ""
                },
                {
                    "first": "Y",
                    "middle": [],
                    "last": "Imai",
                    "suffix": ""
                },
                {
                    "first": "S",
                    "middle": [],
                    "last": "Rao",
                    "suffix": ""
                }
            ],
            "year": 2005,
            "venue": "Nat Med",
            "volume": "11",
            "issn": "",
            "pages": "875--879",
            "other_ids": {}
        },
        "BIBREF14": {
            "ref_id": "b14",
            "title": "Cryo-EM structure of the 2019-nCoV spike in the prefusion conformation",
            "authors": [
                {
                    "first": "D",
                    "middle": [],
                    "last": "Wrapp",
                    "suffix": ""
                },
                {
                    "first": "N",
                    "middle": [],
                    "last": "Wang",
                    "suffix": ""
                },
                {
                    "first": "K",
                    "middle": [
                        "S"
                    ],
                    "last": "Corbett",
                    "suffix": ""
                }
            ],
            "year": 2020,
            "venue": "Science",
            "volume": "367",
            "issn": "",
            "pages": "1260--1263",
            "other_ids": {}
        },
        "BIBREF15": {
            "ref_id": "b15",
            "title": "Angiotensin converting enzyme 2 and diminazene: role in cardiovascular and blood pressure regulation",
            "authors": [
                {
                    "first": "E",
                    "middle": [],
                    "last": "Velkoska",
                    "suffix": ""
                },
                {
                    "first": "S",
                    "middle": [
                        "K"
                    ],
                    "last": "Patel",
                    "suffix": ""
                },
                {
                    "first": "L",
                    "middle": [
                        "M"
                    ],
                    "last": "Burrell",
                    "suffix": ""
                }
            ],
            "year": 2016,
            "venue": "Curr Opin Nephrol Hypertens",
            "volume": "25",
            "issn": "",
            "pages": "384--395",
            "other_ids": {}
        },
        "BIBREF16": {
            "ref_id": "b16",
            "title": "Angiotensin-Converting Enzyme 2 (ACE2) Is a Key Modulator of the Renin Angiotensin System in Health and Disease",
            "authors": [
                {
                    "first": "C",
                    "middle": [],
                    "last": "Tikellis",
                    "suffix": ""
                },
                {
                    "first": "M",
                    "middle": [
                        "C"
                    ],
                    "last": "Thomas",
                    "suffix": ""
                }
            ],
            "year": 2012,
            "venue": "Int J Pept",
            "volume": "",
            "issn": "",
            "pages": "",
            "other_ids": {}
        },
        "BIBREF17": {
            "ref_id": "b17",
            "title": "A novel angiotensin-converting enzyme-related carboxypeptidase (ACE2) converts angiotensin I to angiotensin 1-9",
            "authors": [
                {
                    "first": "M",
                    "middle": [],
                    "last": "Donoghue",
                    "suffix": ""
                },
                {
                    "first": "F",
                    "middle": [],
                    "last": "Hsieh",
                    "suffix": ""
                },
                {
                    "first": "E",
                    "middle": [],
                    "last": "Baronas",
                    "suffix": ""
                }
            ],
            "year": 2000,
            "venue": "Circ Res",
            "volume": "87",
            "issn": "",
            "pages": "1--9",
            "other_ids": {}
        },
        "BIBREF18": {
            "ref_id": "b18",
            "title": "Molecular mechanisms of inhibition of vascular growth by angiotensin-(1-7)",
            "authors": [
                {
                    "first": "E",
                    "middle": [
                        "A"
                    ],
                    "last": "Tallant",
                    "suffix": ""
                },
                {
                    "first": "M",
                    "middle": [
                        "A"
                    ],
                    "last": "Clark",
                    "suffix": ""
                }
            ],
            "year": 2003,
            "venue": "Hypertension",
            "volume": "42",
            "issn": "",
            "pages": "574--579",
            "other_ids": {}
        },
        "BIBREF19": {
            "ref_id": "b19",
            "title": "Angiotensin-(1-7) is an endogenous ligand for the G protein-coupled receptor Mas",
            "authors": [
                {
                    "first": "R",
                    "middle": [
                        "A"
                    ],
                    "last": "Santos",
                    "suffix": ""
                },
                {
                    "first": "A",
                    "middle": [
                        "C"
                    ],
                    "last": "Simoes E Silva",
                    "suffix": ""
                },
                {
                    "first": "C",
                    "middle": [],
                    "last": "Maric",
                    "suffix": ""
                }
            ],
            "year": 2003,
            "venue": "Proc Natl Acad Sci",
            "volume": "100",
            "issn": "",
            "pages": "8258--8263",
            "other_ids": {}
        },
        "BIBREF20": {
            "ref_id": "b20",
            "title": "Tissue distribution of ACE2 protein, the functional receptor for SARS coronavirus. A first step in understanding SARS pathogenesis",
            "authors": [
                {
                    "first": "I",
                    "middle": [],
                    "last": "Hamming",
                    "suffix": ""
                },
                {
                    "first": "W",
                    "middle": [],
                    "last": "Timens",
                    "suffix": ""
                },
                {
                    "first": "M",
                    "middle": [
                        "L"
                    ],
                    "last": "Bulthuis",
                    "suffix": ""
                },
                {
                    "first": "A",
                    "middle": [
                        "T"
                    ],
                    "last": "Lely",
                    "suffix": ""
                },
                {
                    "first": "G",
                    "middle": [],
                    "last": "Navis",
                    "suffix": ""
                },
                {
                    "first": "H",
                    "middle": [],
                    "last": "Van Goor",
                    "suffix": ""
                }
            ],
            "year": 2004,
            "venue": "J Pathol",
            "volume": "203",
            "issn": "",
            "pages": "631--637",
            "other_ids": {}
        },
        "BIBREF21": {
            "ref_id": "b21",
            "title": "ACE2: from vasopeptidase to SARS virus receptor",
            "authors": [
                {
                    "first": "A",
                    "middle": [
                        "J"
                    ],
                    "last": "Turner",
                    "suffix": ""
                },
                {
                    "first": "J",
                    "middle": [
                        "A"
                    ],
                    "last": "Hiscox",
                    "suffix": ""
                },
                {
                    "first": "N",
                    "middle": [
                        "M"
                    ],
                    "last": "Hooper",
                    "suffix": ""
                }
            ],
            "year": 2004,
            "venue": "Trends Pharmacol Sci",
            "volume": "25",
            "issn": "",
            "pages": "291--294",
            "other_ids": {}
        },
        "BIBREF22": {
            "ref_id": "b22",
            "title": "SARS-CoV-2 Cell Entry Depends on ACE2 and TMPRSS2 and Is Blocked by a Clinically Proven Protease Inhibitor",
            "authors": [
                {
                    "first": "M",
                    "middle": [],
                    "last": "Hoffmann",
                    "suffix": ""
                },
                {
                    "first": "H",
                    "middle": [],
                    "last": "Kleine-Weber",
                    "suffix": ""
                },
                {
                    "first": "S",
                    "middle": [],
                    "last": "Schroeder",
                    "suffix": ""
                }
            ],
            "year": 2020,
            "venue": "Cell",
            "volume": "",
            "issn": "",
            "pages": "",
            "other_ids": {}
        },
        "BIBREF23": {
            "ref_id": "b23",
            "title": "Enhanced isolation of SARS-CoV-2 by TMPRSS2-expressing cells",
            "authors": [
                {
                    "first": "S",
                    "middle": [],
                    "last": "Matsuyama",
                    "suffix": ""
                },
                {
                    "first": "N",
                    "middle": [],
                    "last": "Nao",
                    "suffix": ""
                },
                {
                    "first": "K",
                    "middle": [],
                    "last": "Shirato",
                    "suffix": ""
                }
            ],
            "year": null,
            "venue": "Proc Natl Acad Sci",
            "volume": "",
            "issn": "",
            "pages": "",
            "other_ids": {}
        },
        "BIBREF24": {
            "ref_id": "b24",
            "title": "COVID-19 and the cardiovascular system",
            "authors": [
                {
                    "first": "Y",
                    "middle": [
                        "Y"
                    ],
                    "last": "Zheng",
                    "suffix": ""
                },
                {
                    "first": "Y",
                    "middle": [
                        "T"
                    ],
                    "last": "Ma",
                    "suffix": ""
                },
                {
                    "first": "J",
                    "middle": [
                        "Y"
                    ],
                    "last": "Zhang",
                    "suffix": ""
                },
                {
                    "first": "X",
                    "middle": [],
                    "last": "Xie",
                    "suffix": ""
                }
            ],
            "year": 2020,
            "venue": "Nat Rev Cardiol",
            "volume": "",
            "issn": "",
            "pages": "",
            "other_ids": {}
        },
        "BIBREF25": {
            "ref_id": "b25",
            "title": "Are patients with hypertension and diabetes mellitus at increased risk for COVID-19 infection? The Lancet Respiratory Medicine",
            "authors": [
                {
                    "first": "L",
                    "middle": [],
                    "last": "Fang",
                    "suffix": ""
                },
                {
                    "first": "G",
                    "middle": [],
                    "last": "Karakiulakis",
                    "suffix": ""
                },
                {
                    "first": "M",
                    "middle": [],
                    "last": "Roth",
                    "suffix": ""
                }
            ],
            "year": 2020,
            "venue": "",
            "volume": "",
            "issn": "",
            "pages": "",
            "other_ids": {}
        },
        "BIBREF26": {
            "ref_id": "b26",
            "title": "Clinical features of patients infected with 2019 novel coronavirus in Wuhan",
            "authors": [
                {
                    "first": "C",
                    "middle": [],
                    "last": "Huang",
                    "suffix": ""
                },
                {
                    "first": "Y",
                    "middle": [],
                    "last": "Wang",
                    "suffix": ""
                },
                {
                    "first": "X",
                    "middle": [],
                    "last": "Li",
                    "suffix": ""
                }
            ],
            "year": 2020,
            "venue": "China. Lancet",
            "volume": "395",
            "issn": "",
            "pages": "497--506",
            "other_ids": {}
        },
        "BIBREF27": {
            "ref_id": "b27",
            "title": "Clinical Characteristics of 138 Hospitalized Patients With 2019 Novel Coronavirus-Infected Pneumonia in Wuhan",
            "authors": [
                {
                    "first": "D",
                    "middle": [],
                    "last": "Wang",
                    "suffix": ""
                },
                {
                    "first": "B",
                    "middle": [],
                    "last": "Hu",
                    "suffix": ""
                },
                {
                    "first": "C",
                    "middle": [],
                    "last": "Hu",
                    "suffix": ""
                }
            ],
            "year": 2020,
            "venue": "",
            "volume": "",
            "issn": "",
            "pages": "",
            "other_ids": {}
        },
        "BIBREF28": {
            "ref_id": "b28",
            "title": "Clinical characteristics of 140 patients infected with SARS-CoV-2 in Wuhan",
            "authors": [
                {
                    "first": "J",
                    "middle": [
                        "J"
                    ],
                    "last": "Zhang",
                    "suffix": ""
                },
                {
                    "first": "X",
                    "middle": [],
                    "last": "Dong",
                    "suffix": ""
                },
                {
                    "first": "Y",
                    "middle": [
                        "Y"
                    ],
                    "last": "Cao",
                    "suffix": ""
                }
            ],
            "year": 2020,
            "venue": "China. Allergy",
            "volume": "",
            "issn": "",
            "pages": "",
            "other_ids": {}
        },
        "BIBREF29": {
            "ref_id": "b29",
            "title": "Risk Factors Associated With Acute Respiratory Distress Syndrome and Death in Patients With Coronavirus Disease 2019 Pneumonia in Wuhan, China",
            "authors": [
                {
                    "first": "C",
                    "middle": [],
                    "last": "Wu",
                    "suffix": ""
                },
                {
                    "first": "X",
                    "middle": [],
                    "last": "Chen",
                    "suffix": ""
                },
                {
                    "first": "Y",
                    "middle": [],
                    "last": "Cai",
                    "suffix": ""
                }
            ],
            "year": 2020,
            "venue": "JAMA Intern Med. 2020",
            "volume": "33",
            "issn": "",
            "pages": "",
            "other_ids": {}
        },
        "BIBREF30": {
            "ref_id": "b30",
            "title": "Network-based drug repurposing for novel coronavirus 2019-nCoV/SARS-CoV-2",
            "authors": [
                {
                    "first": "Y",
                    "middle": [],
                    "last": "Zhou",
                    "suffix": ""
                },
                {
                    "first": "Y",
                    "middle": [],
                    "last": "Hou",
                    "suffix": ""
                },
                {
                    "first": "J",
                    "middle": [],
                    "last": "Shen",
                    "suffix": ""
                },
                {
                    "first": "Y",
                    "middle": [],
                    "last": "Huang",
                    "suffix": ""
                },
                {
                    "first": "W",
                    "middle": [],
                    "last": "Martin",
                    "suffix": ""
                },
                {
                    "first": "F",
                    "middle": [],
                    "last": "Cheng",
                    "suffix": ""
                }
            ],
            "year": 2020,
            "venue": "Cell Discovery",
            "volume": "6",
            "issn": "",
            "pages": "",
            "other_ids": {}
        },
        "BIBREF31": {
            "ref_id": "b31",
            "title": "Identification of a novel transcriptional repressor (HEPIS) that interacts with nsp-10 of SARS coronavirus",
            "authors": [
                {
                    "first": "M",
                    "middle": [],
                    "last": "Hong",
                    "suffix": ""
                },
                {
                    "first": "W",
                    "middle": [],
                    "last": "Li",
                    "suffix": ""
                },
                {
                    "first": "L",
                    "middle": [],
                    "last": "Wang",
                    "suffix": ""
                }
            ],
            "year": 2008,
            "venue": "Viral Immunol",
            "volume": "21",
            "issn": "",
            "pages": "153--162",
            "other_ids": {}
        },
        "BIBREF32": {
            "ref_id": "b32",
            "title": "Angiotensin-converting enzyme 2 is an essential regulator of heart function",
            "authors": [
                {
                    "first": "M",
                    "middle": [
                        "A"
                    ],
                    "last": "Crackower",
                    "suffix": ""
                },
                {
                    "first": "R",
                    "middle": [],
                    "last": "Sarao",
                    "suffix": ""
                },
                {
                    "first": "G",
                    "middle": [
                        "Y"
                    ],
                    "last": "Oudit",
                    "suffix": ""
                }
            ],
            "year": 2002,
            "venue": "Nature",
            "volume": "417",
            "issn": "",
            "pages": "822--828",
            "other_ids": {}
        },
        "BIBREF33": {
            "ref_id": "b33",
            "title": "ACE2 gene transfer attenuates hypertensionlinked pathophysiological changes in the SHR",
            "authors": [
                {
                    "first": "C",
                    "middle": [],
                    "last": "Diez-Freire",
                    "suffix": ""
                },
                {
                    "first": "J",
                    "middle": [],
                    "last": "Vazquez",
                    "suffix": ""
                },
                {
                    "first": "M",
                    "middle": [
                        "F"
                    ],
                    "last": "Correa De Adjounian",
                    "suffix": ""
                }
            ],
            "year": 2006,
            "venue": "Physiol Genomics",
            "volume": "27",
            "issn": "",
            "pages": "12--19",
            "other_ids": {}
        },
        "BIBREF34": {
            "ref_id": "b34",
            "title": "Angiotensin-converting enzyme 2 activation protects against hypertension-induced cardiac fibrosis involving extracellular signal-regulated kinases",
            "authors": [
                {
                    "first": "A",
                    "middle": [
                        "J"
                    ],
                    "last": "Ferreira",
                    "suffix": ""
                },
                {
                    "first": "V",
                    "middle": [],
                    "last": "Shenoy",
                    "suffix": ""
                },
                {
                    "first": "Y",
                    "middle": [],
                    "last": "Qi",
                    "suffix": ""
                }
            ],
            "year": 2011,
            "venue": "Exp Physiol",
            "volume": "96",
            "issn": "",
            "pages": "287--294",
            "other_ids": {}
        },
        "BIBREF35": {
            "ref_id": "b35",
            "title": "Interaction of diabetes and ACE2 in the pathogenesis of cardiovascular disease in experimental diabetes",
            "authors": [
                {
                    "first": "C",
                    "middle": [],
                    "last": "Tikellis",
                    "suffix": ""
                },
                {
                    "first": "R",
                    "middle": [],
                    "last": "Pickering",
                    "suffix": ""
                },
                {
                    "first": "D",
                    "middle": [],
                    "last": "Tsorotes",
                    "suffix": ""
                }
            ],
            "year": 2012,
            "venue": "Clin Sci (Lond)",
            "volume": "123",
            "issn": "",
            "pages": "519--529",
            "other_ids": {}
        },
        "BIBREF36": {
            "ref_id": "b36",
            "title": "Angiotensin II induced proteolytic cleavage of myocardial ACE2 is mediated by TACE/ADAM-17: a positive feedback mechanism in the RAS",
            "authors": [
                {
                    "first": "V",
                    "middle": [
                        "B"
                    ],
                    "last": "Patel",
                    "suffix": ""
                },
                {
                    "first": "N",
                    "middle": [],
                    "last": "Clarke",
                    "suffix": ""
                },
                {
                    "first": "Z",
                    "middle": [],
                    "last": "Wang",
                    "suffix": ""
                }
            ],
            "year": 2014,
            "venue": "J Mol Cell Cardiol",
            "volume": "66",
            "issn": "",
            "pages": "167--176",
            "other_ids": {}
        },
        "BIBREF37": {
            "ref_id": "b37",
            "title": "Effect of angiotensin-converting enzyme inhibition and angiotensin II receptor blockers on cardiac angiotensin-converting enzyme 2",
            "authors": [
                {
                    "first": "C",
                    "middle": [
                        "M"
                    ],
                    "last": "Ferrario",
                    "suffix": ""
                },
                {
                    "first": "J",
                    "middle": [],
                    "last": "Jessup",
                    "suffix": ""
                },
                {
                    "first": "M",
                    "middle": [
                        "C"
                    ],
                    "last": "Chappell",
                    "suffix": ""
                }
            ],
            "year": 2005,
            "venue": "ARBs and ACEIs",
            "volume": "111",
            "issn": "",
            "pages": "2605--2610",
            "other_ids": {}
        },
        "BIBREF38": {
            "ref_id": "b38",
            "title": "\u00a9 2020 Mayo Foundation for Medical Education and Research",
            "authors": [],
            "year": 2006,
            "venue": "Mayo Clin Proc",
            "volume": "95",
            "issn": "6",
            "pages": "572--578",
            "other_ids": {}
        },
        "BIBREF39": {
            "ref_id": "b39",
            "title": "Upregulation of angiotensin-converting enzyme 2 after myocardial infarction by blockade of angiotensin II receptors",
            "authors": [
                {
                    "first": "Y",
                    "middle": [],
                    "last": "Ishiyama",
                    "suffix": ""
                },
                {
                    "first": "P",
                    "middle": [
                        "E"
                    ],
                    "last": "Gallagher",
                    "suffix": ""
                },
                {
                    "first": "D",
                    "middle": [
                        "B"
                    ],
                    "last": "Averill",
                    "suffix": ""
                },
                {
                    "first": "E",
                    "middle": [
                        "A"
                    ],
                    "last": "Tallant",
                    "suffix": ""
                },
                {
                    "first": "K",
                    "middle": [
                        "B"
                    ],
                    "last": "Brosnihan",
                    "suffix": ""
                },
                {
                    "first": "C",
                    "middle": [
                        "M"
                    ],
                    "last": "Ferrario",
                    "suffix": ""
                }
            ],
            "year": 2004,
            "venue": "Hypertension",
            "volume": "43",
            "issn": "",
            "pages": "970--976",
            "other_ids": {}
        },
        "BIBREF40": {
            "ref_id": "b40",
            "title": "Localization of ACE2 in the renal vasculature: amplification by angiotensin II type 1 receptor blockade using telmisartan",
            "authors": [
                {
                    "first": "M",
                    "middle": [
                        "J"
                    ],
                    "last": "Soler",
                    "suffix": ""
                },
                {
                    "first": "M",
                    "middle": [],
                    "last": "Ye",
                    "suffix": ""
                },
                {
                    "first": "J",
                    "middle": [],
                    "last": "Wysocki",
                    "suffix": ""
                },
                {
                    "first": "J",
                    "middle": [],
                    "last": "William",
                    "suffix": ""
                },
                {
                    "first": "J",
                    "middle": [],
                    "last": "Lloveras",
                    "suffix": ""
                },
                {
                    "first": "D",
                    "middle": [],
                    "last": "Batlle",
                    "suffix": ""
                }
            ],
            "year": 2009,
            "venue": "Am J Physiol Renal Physiol",
            "volume": "296",
            "issn": "",
            "pages": "398--405",
            "other_ids": {}
        },
        "BIBREF41": {
            "ref_id": "b41",
            "title": "Perinatally administered losartan augments renal ACE2 expression but not cardiac or renal Mas receptor in spontaneously hypertensive rats",
            "authors": [
                {
                    "first": "J",
                    "middle": [],
                    "last": "Klimas",
                    "suffix": ""
                },
                {
                    "first": "M",
                    "middle": [],
                    "last": "Olvedy",
                    "suffix": ""
                },
                {
                    "first": "K",
                    "middle": [],
                    "last": "Ochodnicka-Mackovicova",
                    "suffix": ""
                }
            ],
            "year": 2015,
            "venue": "J Cell Mol Med",
            "volume": "19",
            "issn": "",
            "pages": "1965--1974",
            "other_ids": {}
        },
        "BIBREF42": {
            "ref_id": "b42",
            "title": "Combination renin-angiotensin system blockade and angiotensin-converting enzyme 2 in experimental myocardial infarction: implications for future therapeutic directions",
            "authors": [
                {
                    "first": "L",
                    "middle": [
                        "J"
                    ],
                    "last": "Burchill",
                    "suffix": ""
                },
                {
                    "first": "E",
                    "middle": [],
                    "last": "Velkoska",
                    "suffix": ""
                },
                {
                    "first": "R",
                    "middle": [
                        "G"
                    ],
                    "last": "Dean",
                    "suffix": ""
                },
                {
                    "first": "K",
                    "middle": [],
                    "last": "Griggs",
                    "suffix": ""
                },
                {
                    "first": "S",
                    "middle": [
                        "K"
                    ],
                    "last": "Patel",
                    "suffix": ""
                },
                {
                    "first": "L",
                    "middle": [
                        "M"
                    ],
                    "last": "Burrell",
                    "suffix": ""
                }
            ],
            "year": 2012,
            "venue": "Clin Sci (Lond)",
            "volume": "123",
            "issn": "",
            "pages": "649--658",
            "other_ids": {}
        },
        "BIBREF43": {
            "ref_id": "b43",
            "title": "Myocardial infarction increases ACE2 expression in rat and humans",
            "authors": [
                {
                    "first": "L",
                    "middle": [
                        "M"
                    ],
                    "last": "Burrell",
                    "suffix": ""
                },
                {
                    "first": "J",
                    "middle": [],
                    "last": "Risvanis",
                    "suffix": ""
                },
                {
                    "first": "E",
                    "middle": [],
                    "last": "Kubota",
                    "suffix": ""
                }
            ],
            "year": 2005,
            "venue": "Eur Heart J",
            "volume": "26",
            "issn": "",
            "pages": "322--364",
            "other_ids": {}
        },
        "BIBREF44": {
            "ref_id": "b44",
            "title": "Angiotensin converting enzyme 2 activity and human atrial fibrillation: increased plasma angiotensin converting enzyme 2 activity is associated with atrial fibrillation and more advanced left atrial structural remodelling",
            "authors": [
                {
                    "first": "T",
                    "middle": [
                        "E"
                    ],
                    "last": "Walters",
                    "suffix": ""
                },
                {
                    "first": "J",
                    "middle": [
                        "M"
                    ],
                    "last": "Kalman",
                    "suffix": ""
                },
                {
                    "first": "S",
                    "middle": [
                        "K"
                    ],
                    "last": "Patel",
                    "suffix": ""
                },
                {
                    "first": "M",
                    "middle": [],
                    "last": "Mearns",
                    "suffix": ""
                },
                {
                    "first": "E",
                    "middle": [],
                    "last": "Velkoska",
                    "suffix": ""
                },
                {
                    "first": "L",
                    "middle": [
                        "M"
                    ],
                    "last": "Burrell",
                    "suffix": ""
                }
            ],
            "year": 2017,
            "venue": "Europace",
            "volume": "19",
            "issn": "",
            "pages": "1280--1287",
            "other_ids": {}
        },
        "BIBREF45": {
            "ref_id": "b45",
            "title": "Elevated plasma angiotensin converting enzyme 2 activity is an independent predictor of major adverse cardiac events in patients with obstructive coronary artery disease",
            "authors": [
                {
                    "first": "J",
                    "middle": [],
                    "last": "Ramchand",
                    "suffix": ""
                },
                {
                    "first": "S",
                    "middle": [
                        "K"
                    ],
                    "last": "Patel",
                    "suffix": ""
                },
                {
                    "first": "P",
                    "middle": [
                        "M"
                    ],
                    "last": "Srivastava",
                    "suffix": ""
                },
                {
                    "first": "O",
                    "middle": [],
                    "last": "Farouque",
                    "suffix": ""
                },
                {
                    "first": "L",
                    "middle": [
                        "M"
                    ],
                    "last": "Burrell",
                    "suffix": ""
                }
            ],
            "year": 2018,
            "venue": "PLoS One",
            "volume": "13",
            "issn": "",
            "pages": "",
            "other_ids": {}
        },
        "BIBREF46": {
            "ref_id": "b46",
            "title": "Angiotensin II mediates angiotensin converting enzyme type 2 internalization and degradation through an angiotensin II type I receptordependent mechanism",
            "authors": [
                {
                    "first": "M",
                    "middle": [
                        "R"
                    ],
                    "last": "Deshotels",
                    "suffix": ""
                },
                {
                    "first": "H",
                    "middle": [],
                    "last": "Xia",
                    "suffix": ""
                },
                {
                    "first": "S",
                    "middle": [],
                    "last": "Sriramula",
                    "suffix": ""
                },
                {
                    "first": "E",
                    "middle": [],
                    "last": "Lazartigues",
                    "suffix": ""
                },
                {
                    "first": "C",
                    "middle": [
                        "M"
                    ],
                    "last": "Filipeanu",
                    "suffix": ""
                }
            ],
            "year": 2014,
            "venue": "Hypertension",
            "volume": "64",
            "issn": "",
            "pages": "1368--1375",
            "other_ids": {}
        },
        "BIBREF47": {
            "ref_id": "b47",
            "title": "Angiotensin receptor blockers as tentative SARS-CoV-2 therapeutics",
            "authors": [
                {
                    "first": "D",
                    "middle": [],
                    "last": "Gurwitz",
                    "suffix": ""
                }
            ],
            "year": 2020,
            "venue": "Drug Dev Res",
            "volume": "",
            "issn": "",
            "pages": "",
            "other_ids": {}
        },
        "BIBREF48": {
            "ref_id": "b48",
            "title": "Clinical and biochemical indexes from 2019-nCoV infected patients linked to viral loads and lung injury",
            "authors": [
                {
                    "first": "Y",
                    "middle": [],
                    "last": "Liu",
                    "suffix": ""
                },
                {
                    "first": "Y",
                    "middle": [],
                    "last": "Yang",
                    "suffix": ""
                },
                {
                    "first": "C",
                    "middle": [],
                    "last": "Zhang",
                    "suffix": ""
                }
            ],
            "year": 2020,
            "venue": "Sci China Life Sci",
            "volume": "63",
            "issn": "",
            "pages": "364--374",
            "other_ids": {}
        },
        "BIBREF49": {
            "ref_id": "b49",
            "title": "Recombinant human ACE2: acing out angiotensin II in ARDS therapy",
            "authors": [
                {
                    "first": "H",
                    "middle": [],
                    "last": "Zhang",
                    "suffix": ""
                },
                {
                    "first": "A",
                    "middle": [],
                    "last": "Baker",
                    "suffix": ""
                }
            ],
            "year": 2017,
            "venue": "Crit Care",
            "volume": "21",
            "issn": "",
            "pages": "",
            "other_ids": {}
        },
        "BIBREF50": {
            "ref_id": "b50",
            "title": "Circulating angiotensin peptides levels in Acute Respiratory Distress Syndrome correlate with clinical outcomes: A pilot study",
            "authors": [
                {
                    "first": "R",
                    "middle": [],
                    "last": "Reddy",
                    "suffix": ""
                },
                {
                    "first": "I",
                    "middle": [],
                    "last": "Asante",
                    "suffix": ""
                },
                {
                    "first": "S",
                    "middle": [],
                    "last": "Liu",
                    "suffix": ""
                }
            ],
            "year": 2019,
            "venue": "PLoS One",
            "volume": "14",
            "issn": "",
            "pages": "",
            "other_ids": {}
        },
        "BIBREF51": {
            "ref_id": "b51",
            "title": "Both aldosterone and spironolactone can modulate the intracellular ACE/ANG II/AT1 and ACE2/ANG (1-7)/MAS receptor axes in human mesangial cells",
            "authors": [
                {
                    "first": "D",
                    "middle": [],
                    "last": "Stoll",
                    "suffix": ""
                },
                {
                    "first": "R",
                    "middle": [],
                    "last": "Yokota",
                    "suffix": ""
                },
                {
                    "first": "D",
                    "middle": [],
                    "last": "Sanches Aragao",
                    "suffix": ""
                },
                {
                    "first": "D",
                    "middle": [
                        "E"
                    ],
                    "last": "Casarini",
                    "suffix": ""
                }
            ],
            "year": 2019,
            "venue": "Physiol Rep",
            "volume": "7",
            "issn": "",
            "pages": "",
            "other_ids": {}
        },
        "BIBREF54": {
            "ref_id": "b54",
            "title": "Here is the permission to use table 1 (see below). The authors would prefer we cite it as",
            "authors": [
                {
                    "first": "\u2022",
                    "middle": [],
                    "last": "Nath",
                    "suffix": ""
                },
                {
                    "first": "Karl",
                    "middle": [
                        "A"
                    ],
                    "last": "",
                    "suffix": ""
                },
                {
                    "first": "M",
                    "middle": [
                        "D"
                    ],
                    "last": "Sparks",
                    "suffix": ""
                },
                {
                    "first": "M",
                    "middle": [
                        "A"
                    ],
                    "last": "Hiremath",
                    "suffix": ""
                },
                {
                    "first": "S",
                    "middle": [],
                    "last": "",
                    "suffix": ""
                }
            ],
            "year": null,
            "venue": "The Coronavirus Conundrum: ACE2 and Hypertension Edition",
            "volume": "",
            "issn": "",
            "pages": "",
            "other_ids": {}
        }
    },
    "ref_entries": {
        "FIGREF0": {
            "text": "Figure legends",
            "latex": null,
            "type": "figure"
        },
        "FIGREF1": {
            "text": "Localization of ACE2 protein in human organs and tissues.",
            "latex": null,
            "type": "figure"
        },
        "FIGREF2": {
            "text": "Scheme of Renin-Angiotensin-Aldosterone system and SARS-CoV-2 infection mechanism.INTRODUCTIONThe global public-health crisis triggered by coronavirus disease 2019 (abbreviated \"COVID-19\"), caused by the Severe Acute Respiratory Syndrome Coronavirus 2 (SARS-CoV-2), 1 is being defined as the worst pandemic disease of modern times.2, 3  According to the recent statistics from the World Health Organization, this novel coronavirus has already infected nearly 340,000 people worldwide, causing nearly 15,000 deaths.4    Alarmingly, between 15-20% (\u223c10-15% severe and \u223c3-5% critical) of SARS-CoV-2 positive individuals are likely to progress towards a severe form of disease, characterized by interstitial pneumonia, with the potential to evolve into acute respiratory distress syndrome (ARDS), systemic inflammatory response syndrome (SIRS), and death.5  The high numbers of patients requiring sub-intensive or intensive care can overwhelm many health care infrastructures, even in highly developed countries.6    The exponential growth of the contagion around the world has contributed to heightened speculations and concerns over whether two commonly used anti-hypertensive (HTN) drugs, namely, angiotensin-converting enzyme (ACE) inhibitors (ACEIs) and angiotensin receptor blockers (ARBs), also used for cardiovascular (CV) diseases (CVD) and chronic kidney disease (CKD), may exert either deleterious or beneficial effects in COVID-19 patients compared with other drugs used to reduce blood pressure (BP) or to treat heart failure (HF).7 Several professional health organizations have published position papers stating that there is no evidence to change the use of ACEIs or ARBs for the management of elevated BP in the context of avoiding or treating COVID-19 infection",
            "latex": null,
            "type": "figure"
        },
        "FIGREF3": {
            "text": "Foundation for Medical Education and Research. Mayo Clin Proc. 2020;95(6):xx-xx.alveolar cells (AT2), capillary endothelium19 and enterocytes, 20 demonstrates its essential role in CV and immune systems,20 being principally involved in heart function and the development of HTN and complications of diabetes mellitus (DM).As previously discussed, SARS-CoV-2 penetrates the cell through ACE2, but also necessitates type II transmembrane serine proteases (TMPRSS2) for effective priming of viral Spike (S) protein. The binding of coronavirus S protein to ACE2 triggers a conformational change in the S protein, allowing for proteolytic digestion by TMPRSS2, which enables viral and cell membrane fusion.21 This was recently confirmed by the evidence that camostat mesylate, a protease TMPRSS2 inhibitor, blocks viral entry and may be a promising drug for SARS-CoV-2 infection.21,22 As ACE2 is a functional receptor for SARS-CoV-2, many healthcare professionals have begun to reconsider the safety and effects of anti-HTN therapy with ACEIs or ARBs in patients during the COVID-19 outbreak-; and, despite statements by medical organizations, they began to question whether patients with COVID-19 and HTN maintained on ACEIs or ARBs to decrease BP values (or for other conditions such as CVD and CKD) should change to another anti-HTN pharmacological agent.23 Such considerations contributed to the current controversy.",
            "latex": null,
            "type": "figure"
        },
        "FIGREF4": {
            "text": "morbidities. The last report on the characteristics of deceased COVID-19 positive patients in Italy officially released on March 20, 2020 by the Italian Ministry of Health through the National Institute of Health Foundation for Medical Education and Research. Mayo Clin Proc. 2020;95(6):xx-xx.",
            "latex": null,
            "type": "figure"
        },
        "FIGREF5": {
            "text": "Istituto Superiore di Sanit\u00e0; ISS) showed that the most common concurrent medical co-morbidities observed were arterial HTN (73.8%; 355 of 481), DM (33.9%; 163 of 481), ischemic cardiopathy (30.1%; 145 of 481), and atrial fibrillation (22%; 106 of 481). 33 Prior to hospitalization, 36% (173 of 481) of fatal COVID-19patients were on treatment with ACEIs, while 16% (77 of 481) were on treatment with ARBs (odds ratio, 2.26; 95% confidence interval, 95% CI, 1.66-3.09; p<0.001). Nevertheless, these numbers are preliminary and may not precisely reflect adjusted differences in risk. It is virtually impossible to precisely identify all medical therapies before admission from medical records 33 . Moreover, patients with elevated BP on admission may be noted to have a history of chronic HTN in their medical record, and such coding may reflect provider biases from the current infectious illness. The median age of SARS-CoV-2 positive patients who died was 78.5 years (median: 80 years; range: 31-103 years; interquartile range, 73-85 years). Since HTN prevalence increases in parallel with aging, this pattern may represent the expected prevalence for the given age group. Therefore, although the number of fatal COVID-19 positive patients treated with ACEIs was more than twice the number of those treated with ARBs, one cannot definitely conclude risks or benefits of these therapies due to confounding variables of age, HTN, as well as the impact of yet unidentified comorbidities on outcome with the COVID-19 pandemic.",
            "latex": null,
            "type": "figure"
        },
        "TABREF1": {
            "text": "Lower cardiac ACE2 concentrations are observed in HTN, 37, 38 CVD associated with DM,39 and Ang II-induced cardiac dysfunction,40 suggesting that augmenting ACE2 could have beneficial therapeutic effects on the CV system. In numerous studies carried out in animal models, both ACEIs and ARBs may increase ACE2 expression or levels,[41][42][43][44][45] though other authors failed to observe such increases.46,47 Importantly, no studies have reported an increase in circulating ACE2 levels March 30, 2020 and/or expression thus far48,49 and increased expression would not necessarily imply increased risk of infection or disease severity.",
            "latex": null,
            "type": "table"
        },
        "TABREF4": {
            "text": "COVID-19 associated ALI/ARDS, but definitive studies that address this issue are needed. Whether RAAS modulation may have a beneficial effect in selected patients with severe COVID-19 at risk for ALI/ARDS is entirely unknown at the present time. Moreover, the effects of other agents that may interrupt the RAAS by inhibiting renin, such as renin inhibitors and beta-blockers, would also be of interest regarding their effects on COVID-19 and attendant ALI.In agreement with current guidelines, patients with HTN should continue taking anti-HTN medications as prescribed without interruption. Current evidence shows that RAAS inhibitors, i.e., ACEIs and ARBs, significantly reduce mortality in CVD, reduce the progression of CKD, and are the cornerstone of HF and HTN treatment. ACEIs or ARBs therapy should be maintained or initiated, as indicated, in patients with HF, HTN, or myocardial infarction, regardless of SARS-CoV-2. No differences exist between ARBs and ACEIs in terms of efficacy to decrease BP and improve other outcomes, such as all-cause mortality, CVD mortality, myocardial infarction, HF, stroke, and end-stage renal disease. 58 ACEIs are associated with cough secondary to accumulation of bradykinin and angioedema, while withdrawal rates due to adverse events are lower with ARBs. 58 Given the equal efficacy but fewer adverse events, ARBs could potentially be a more favorable treatment option in COVID-19 patients at higher risk of developing severe forms of disease(Table 2). To further evaluate the role of RAAS modulation in COVID-19, datasets should be analyzed to investigate if use of ACEIs and ARBs on admission could be associated with ALI/ARDS and/or survival/mortality in patients with DM, HTN and CVD.46. Burchill LJ, Velkoska E, Dean RG, Griggs K, Patel SK, Burrell LM. Combination renin-angiotensin system blockade and angiotensin-converting enzyme 2 in experimental myocardial infarction: implications for future therapeutic directions. Clin Sci (Lond). 2012;123:649-658. 47. Burrell LM, Risvanis J, Kubota E, et al. Myocardial infarction increases ACE2 expression in rat and humans. Eur Heart J. 2005;26:369-375; discussion 322-364. 48. Walters TE, Kalman JM, Patel SK, Mearns M, Velkoska E, Burrell LM. Angiotensin converting enzyme 2 activity and human atrial fibrillation: increased plasma angiotensin converting enzyme 2 activity is associated with atrial fibrillation and more advanced left atrial structural remodelling. Europace. 2017;19:1280-1287. 49. Ramchand J, Patel SK, Srivastava PM, Farouque O, Burrell LM. Elevated plasma angiotensin converting enzyme 2 activity is an independent predictor of major adverse cardiac events in patients with obstructive coronary artery disease. PLoS One. 2018;13:e0198144. 50. Deshotels MR, Xia H, Sriramula S, Lazartigues E, Filipeanu CM. Angiotensin II mediates angiotensin converting enzyme type 2 internalization and degradation through an angiotensin II type I receptordependent mechanism. Hypertension. 2014;64:1368-1375. 51. Gurwitz D. Angiotensin receptor blockers as tentative SARS-CoV-2 therapeutics. Drug Dev Res. 2020.",
            "latex": null,
            "type": "table"
        },
        "TABREF6": {
            "text": "and/or expression thus far48,49 and increased expression would not necessarily imply increased risk of infection or disease severity.",
            "latex": null,
            "type": "table"
        },
        "TABREF7": {
            "text": ". To further evaluate the role of RAAS modulation in COVID-19, datasets should be analyzed to investigate if use of ACEIs and ARBs on admission could be associated with ALI/ARDS and/or survival/mortality in patients with DM, HTN and CVD.",
            "latex": null,
            "type": "table"
        }
    },
    "back_matter": []
}