{
    "paper_id": "PMC7120777",
    "metadata": {
        "title": "4 Infectieziekten",
        "authors": [
            {
                "first": "J.H.",
                "middle": [],
                "last": "Vrijenhoek",
                "suffix": "",
                "email": null,
                "affiliation": {}
            }
        ]
    },
    "body_text": [
        {
            "text": "In het vorige hoofdstuk hebben we gezien dat de mens zich tegen velerlei soorten prikkels kan beschermen door middel van ontstekings- of immuunreacties. In dit hoofdstuk wordt besproken welke veranderingen in het lichaam plaatshebben indien de noxe bestaat uit micro-organismen.",
            "cite_spans": [],
            "section": "4.1 Inleiding",
            "ref_spans": []
        },
        {
            "text": "De wetenschap die zich bezighoudt met de bestudering van de bouw en levensverrichtingen van micro-organismen, is de microbiologie. Micro-organismen zijn organismen die men niet met het blote oog kan waarnemen. Deze organismen kunnen infectieziekten veroorzaken en we zullen nader ingaan op enkele van deze infectieziekten.",
            "cite_spans": [],
            "section": "4.1 Inleiding",
            "ref_spans": []
        },
        {
            "text": "Bacteri\u00ebn zijn de kleinste levende wezens. Ze zijn eencellig en kernloos en kunnen zichtbaar gemaakt worden met de lichtmicroscoop. Tot de bacteri\u00ebn behoren (zie afb. 4.1):",
            "cite_spans": [],
            "section": "4.2.1 Bacteri\u00ebn ::: 4.2 Oorzaken infectieziekten",
            "ref_spans": [
                {
                    "start": 162,
                    "end": 170,
                    "mention": "afb. 4.1",
                    "ref_id": null
                }
            ]
        },
        {
            "text": "\n\n",
            "cite_spans": [],
            "section": "4.2.1 Bacteri\u00ebn ::: 4.2 Oorzaken infectieziekten",
            "ref_spans": []
        },
        {
            "text": "\nbolvormige kokken\n",
            "cite_spans": [],
            "section": "4.2.1 Bacteri\u00ebn ::: 4.2 Oorzaken infectieziekten",
            "ref_spans": []
        },
        {
            "text": "\nde bolvormige kokken zoals de:\n* Diplococcus, bijvoorbeeld Neisseria gonorrhoeae (in de volksmond een druiper) en de Streptococcus pneumoniae, de veroorzaker van een longontsteking,* Staphylococcus, deze veroorzaakt een steenpuist (furunkel),* Streptococcus, deze veroorzaakt een keelontsteking (angina),\n",
            "cite_spans": [],
            "section": "4.2.1 Bacteri\u00ebn ::: 4.2 Oorzaken infectieziekten",
            "ref_spans": []
        },
        {
            "text": "\nbacillen\n",
            "cite_spans": [],
            "section": "4.2.1 Bacteri\u00ebn ::: 4.2 Oorzaken infectieziekten",
            "ref_spans": []
        },
        {
            "text": "\nbacillen, de staafvormige bacteri\u00ebn, zoals de:\n* bacil van Koch, de veroorzaker van tuberculose,* Clostridium tetani, de veroorzaker van tetanus en de Clostridium botulinum die het botulisme veroorzaakt,\n",
            "cite_spans": [],
            "section": "4.2.1 Bacteri\u00ebn ::: 4.2 Oorzaken infectieziekten",
            "ref_spans": []
        },
        {
            "text": "\nspirocheten\n",
            "cite_spans": [],
            "section": "4.2.1 Bacteri\u00ebn ::: 4.2 Oorzaken infectieziekten",
            "ref_spans": []
        },
        {
            "text": "\nspirocheten, deze hebben de structuur van een kurkentrekker, zoals de:\n* Treponema pallidum, de veroorzaker van de geslachtsziekte syfilis (lues).\n",
            "cite_spans": [],
            "section": "4.2.1 Bacteri\u00ebn ::: 4.2 Oorzaken infectieziekten",
            "ref_spans": []
        },
        {
            "text": "Elke bacterie heeft twee namen. De eerste is de geslachtsnaam, bijvoorbeeld Staphylococcus, en de tweede naam is specifiek voor de bacterie, bijvoorbeeld Staphylococcus aureus.",
            "cite_spans": [],
            "section": "4.2.1 Bacteri\u00ebn ::: 4.2 Oorzaken infectieziekten",
            "ref_spans": []
        },
        {
            "text": "\nsporen\n",
            "cite_spans": [],
            "section": "4.2.2 Schimmels ::: 4.2 Oorzaken infectieziekten",
            "ref_spans": []
        },
        {
            "text": "Een schimmel bestaat uit een verzameling lange draden (hyfen). Deze draden vormen een netwerk (mycelium). Aan het mycelium worden sporen gevormd die voor de voortplanting zorgen, omdat de sporen kunnen uitgroeien tot hyfen en later tot een mycelium (zie afb. 4.2).",
            "cite_spans": [],
            "section": "4.2.2 Schimmels ::: 4.2 Oorzaken infectieziekten",
            "ref_spans": [
                {
                    "start": 254,
                    "end": 262,
                    "mention": "afb. 4.2",
                    "ref_id": null
                }
            ]
        },
        {
            "text": "\n\n",
            "cite_spans": [],
            "section": "4.2.2 Schimmels ::: 4.2 Oorzaken infectieziekten",
            "ref_spans": []
        },
        {
            "text": "Gistcellen planten zich voort door middel van spruiting of knopvorming. Gisten zorgen voor de omzetting van suikers in alcohol en laten deeg rijzen. Een ander voorbeeld is de Candida albicans, die onder andere vaginale afscheiding kan veroorzaken of spruw, een mondinfectie.",
            "cite_spans": [],
            "section": "4.2.3 Gisten ::: 4.2 Oorzaken infectieziekten",
            "ref_spans": []
        },
        {
            "text": "Protozoa zijn eencelligen die zich soms voortbewegen door dunne zweepdraden (bijvoorbeeld de flagellaten). Een voorbeeld is Trichomonas vaginalis, die een seksueel overdraagbare aandoening (soa) veroorzaakt.",
            "cite_spans": [],
            "section": "4.2.4 Protozoa ::: 4.2 Oorzaken infectieziekten",
            "ref_spans": []
        },
        {
            "text": "Deze micro-organismen zitten op de grens van levend en niet-levend. Als een virus een gastheer binnendringt, brengt het zijn eigen erfelijk materiaal mee. Dit dringt de cel binnen waardoor de celstofwisseling gestoord raakt en de cel meestal doodgaat. Ondertussen hebben de virusdeeltjes zich wel kunnen vermeerderen.",
            "cite_spans": [],
            "section": "4.2.5 Virussen ::: 4.2 Oorzaken infectieziekten",
            "ref_spans": []
        },
        {
            "text": "Virussen zijn goed te zien met een elektronenmicroscoop.",
            "cite_spans": [],
            "section": "4.2.5 Virussen ::: 4.2 Oorzaken infectieziekten",
            "ref_spans": []
        },
        {
            "text": "Virusziekten zijn onder andere: mazelen, waterpokken, griep, verkoudheid, poliomyelitis anterior acuta.",
            "cite_spans": [],
            "section": "4.2.5 Virussen ::: 4.2 Oorzaken infectieziekten",
            "ref_spans": []
        },
        {
            "text": "Sinds enige jaren is bekend dat ook eiwitten infectieus kunnen zijn. Deze infectieuze eiwitten worden prionen genoemd. Een voorbeeld is de ziekte van Creutzfeldt-Jakob, een ziekte waarbij lijders dementeren met allerlei motorische verschijnselen (ongeco\u00f6rdineerde bewegingen, spiertrekkingen enzovoort). Na hun dood bleek dat de hersenen van deze pati\u00ebnten sponsachtig waren aangetast (spongiforme encefalopathie).",
            "cite_spans": [],
            "section": "4.2.6 Prionen ::: 4.2 Oorzaken infectieziekten",
            "ref_spans": []
        },
        {
            "text": "In Engeland openbaarde zich in de jaren tachtig de \u2018gekkekoeienziekte\u2019 (boviene spongiforme encefalopathie of bse). Het bleek dat deze uitsluitend voorkwam bij koeien die slachtafval van schapen in het veevoer kregen. Met name in Engeland is het aantal gevallen van de ziekte van Creutzfeldt-Jakob toegenomen en er zijn plotseling ook jonge mensen aan deze aandoening overleden. Er is nog maar weinig bekend over deze aandoeningen, maar op de een of andere manier kunnen prionen bij het binnendringen in hersen- en ruggenmergweefsel lichaamseigen eiwitten vervormen tot nieuwe prionen die weer andere eiwitten vervormen enzovoort. Het betreft hier vooral eiwitten die een steunende functie hebben. Zo verliest het zenuwweefsel stevigheid en vallen er gaten in.",
            "cite_spans": [],
            "section": "4.2.6 Prionen ::: 4.2 Oorzaken infectieziekten",
            "ref_spans": []
        },
        {
            "text": "Blijkbaar zijn deze prionen overdraagbaar van schaap via rund naar mens, maar hoe de besmettingsweg precies verloopt, is onbekend. De infectieuze eiwitten zijn ongevoelig voor bevriezen, verhitten, doorstralen en andere methoden om voedsel bacterievrij te maken. Duidelijk is dat het eten van hersenen en ruggenmerg van besmette koeien gevaarlijk is voor de mens.",
            "cite_spans": [],
            "section": "4.2.6 Prionen ::: 4.2 Oorzaken infectieziekten",
            "ref_spans": []
        },
        {
            "text": "De Infectieziektewet verplicht de arts die de diagnose stelt, om hiervan binnen 24 uur melding te doen aan de directeur van de ggd (art. 4 Infectieziektewet). In de praktijk betreft het vaak relatief zeldzame aandoeningen waardoor melding in de drukte van alledag nogal eens vergeten wordt. Tevens is de melding soms tijdrovend en kunnen in de hectiek prioriteiten anders gelegd worden.",
            "cite_spans": [],
            "section": "Meldingsplicht ::: 4.3.1 Epidemie, pandemie en endemie ::: 4.3 Verloop infectieziekten",
            "ref_spans": []
        },
        {
            "text": "Om bovenvermelde problemen te ondervangen is in overleg met medisch microbiologen, juristen en de igz gezocht naar manieren om de administratieve belasting van de melding te verminderen en de kans dat deze daardoor vergeten wordt, te verkleinen. Het lijkt logisch om te onderzoeken in hoeverre de arts-microbioloog, die immers nauw betrokken is bij de diagnostiek van vele van de in dit kader relevante infectieziekten, bij het proces betrokken kan worden. De meldingsplicht kent de volgende infectieziekten:",
            "cite_spans": [],
            "section": "Meldingsplicht ::: 4.3.1 Epidemie, pandemie en endemie ::: 4.3 Verloop infectieziekten",
            "ref_spans": []
        },
        {
            "text": "\nBacillaire dysenterieBotulismeBrucelloseBuiktyphusCholeraCreutzfeld-Jacob\u2019s Disease \u2013 KlassiekCreutzfeld-Jacob\u2019s Disease \u2013 VariantDifterieEnterohemorragische E.coliFebris recurrensGele koortsHepatitis AHepatitis BHepatitis C AcuutHepatitis C Acuut en DragerHondsdolheidKinderverlammingKinkhoestLegionelloseLeptospiroseMalariaMazelenMeningokokkoseMiltvuurOrnithose/psittacoseParatyphus AParatyphus BParatyphus CPestQ-koortsRodehondsars (Severe Acute Respiratory Syndrome)TrichinoseTuberculoseVirale hemorrhagische koortsVlektyphusVoedselvergiftiging of voedselinfectie\n",
            "cite_spans": [],
            "section": "Meldingsplicht ::: 4.3.1 Epidemie, pandemie en endemie ::: 4.3 Verloop infectieziekten",
            "ref_spans": []
        },
        {
            "text": "Bron: www.rivm.nl/isis/ggd/openbaar/diag/index.html",
            "cite_spans": [],
            "section": "Meldingsplicht ::: 4.3.1 Epidemie, pandemie en endemie ::: 4.3 Verloop infectieziekten",
            "ref_spans": []
        },
        {
            "text": "Verspreiding van besmettelijke ziekten kan plaatsvinden door:",
            "cite_spans": [],
            "section": "4.3.2 Verspreiding ::: 4.3 Verloop infectieziekten",
            "ref_spans": []
        },
        {
            "text": "\ndirect contact, van mens op mens via sputum, speeksel (druppelinfectie), urine, feces, pus en huidschilfers,indirect contact, via eetgerei, beddengoed, voedsel en vliegen.\n",
            "cite_spans": [],
            "section": "4.3.2 Verspreiding ::: 4.3 Verloop infectieziekten",
            "ref_spans": []
        },
        {
            "text": "Soms is er een tussengastheer nodig om de besmetting van mens op mens mogelijk te maken. De tussengastheer wordt dan niet ziek. Zo wordt de malariaparasiet van de ene mens naar de andere overgebracht door een mug.",
            "cite_spans": [],
            "section": "4.3.2 Verspreiding ::: 4.3 Verloop infectieziekten",
            "ref_spans": []
        },
        {
            "text": "Ook kunnen vliegen aan hun harige poten allerlei ongerechtigheden meenemen en overbrengen op het voedsel.",
            "cite_spans": [],
            "section": "4.3.2 Verspreiding ::: 4.3 Verloop infectieziekten",
            "ref_spans": []
        },
        {
            "text": "Tegenwoordig hoort en leest men veel over de ziekte van Lyme, overgebracht door teken die besmet zijn met een spirocheet (Borrelia) en die zich vooral in bosrijk gebied ophouden. Wordt een mens gestoken door een besmette teek dan ontstaat er een rode, zich uitbreidende kring (die na enige dagen verdwijnt) gevolgd door koorts, koude rillingen, vermoeidheid en hoofdpijn. De herstelperiode kan vele weken, zo niet maanden, in beslag nemen. Sinds kort is er een vaccin ontwikkeld om risocogroepen mee in te enten.",
            "cite_spans": [],
            "section": "4.3.2 Verspreiding ::: 4.3 Verloop infectieziekten",
            "ref_spans": []
        },
        {
            "text": "\nsymptomen\n",
            "cite_spans": [],
            "section": "Verloop ::: 4.3.3 Besmetting ::: 4.3 Verloop infectieziekten",
            "ref_spans": []
        },
        {
            "text": "\nincubatietijd\n",
            "cite_spans": [],
            "section": "Verloop ::: 4.3.3 Besmetting ::: 4.3 Verloop infectieziekten",
            "ref_spans": []
        },
        {
            "text": "Na een besmetting ontstaat er een infectiehaard hetgeen gepaard gaat met een plaatselijke en/of algemene reactie; er komen ziekteverschijnselen, de symptomen. Deze symptomen treden pas op enige tijd nadat de besmetting heeft plaatsgevonden. De tijd tussen de besmetting en het uitbreken van symptomen is de incubatietijd. Soms gaat het uitbreken van symptomen vooraf door een periode van algehele malaise: niet lekker zijn, hangerig, moe, eetlustgebrek. Dit heet een prodromaal stadium en het wordt dus gevolgd door de ziekte (bijvoorbeeld uitslag en koorts). Na een ziekteperiode volgt een korte of langere herstelfase, de reconvalescentieperiode.",
            "cite_spans": [],
            "section": "Verloop ::: 4.3.3 Besmetting ::: 4.3 Verloop infectieziekten",
            "ref_spans": []
        },
        {
            "text": "\nreconvalescentie-periode\n",
            "cite_spans": [],
            "section": "Verloop ::: 4.3.3 Besmetting ::: 4.3 Verloop infectieziekten",
            "ref_spans": []
        },
        {
            "text": "Zoals reeds eerder opgemerkt krijgt men de meeste infectieziekten slechts eenmaal, omdat het lichaam specifieke antilichamen maakt tegen het micro-organisme. Zijn er voldoende antistoffen in het bloed en weefsels aanwezig, dan is men immuun voor die bepaalde ziekte. Een volgende besmetting leidt dan niet meer tot het uitbreken van die ziekte.",
            "cite_spans": [],
            "section": "4.3.4 Immuniteit ::: 4.3 Verloop infectieziekten",
            "ref_spans": []
        },
        {
            "text": "Er zijn echter verschillende manieren om aan deze antilichamen te komen, namelijk (zie afb. 4.3.):",
            "cite_spans": [],
            "section": "4.3.4 Immuniteit ::: 4.3 Verloop infectieziekten",
            "ref_spans": [
                {
                    "start": 87,
                    "end": 95,
                    "mention": "afb. 4.3",
                    "ref_id": null
                }
            ]
        },
        {
            "text": "\n\n",
            "cite_spans": [],
            "section": "4.3.4 Immuniteit ::: 4.3 Verloop infectieziekten",
            "ref_spans": []
        },
        {
            "text": "\nactief\n",
            "cite_spans": [],
            "section": "4.3.4 Immuniteit ::: 4.3 Verloop infectieziekten",
            "ref_spans": []
        },
        {
            "text": "\nActief: hierbij maakt het lichaam de antistoffen zelf aan na een contact met een antigeen, dus na een besmetting of inenting. Deze vorm van immuniteit wordt derhalve actief verkregen en is vaak langdurend.\n",
            "cite_spans": [],
            "section": "4.3.4 Immuniteit ::: 4.3 Verloop infectieziekten",
            "ref_spans": []
        },
        {
            "text": "\npassief\n",
            "cite_spans": [],
            "section": "4.3.4 Immuniteit ::: 4.3 Verloop infectieziekten",
            "ref_spans": []
        },
        {
            "text": "\nPassief: hierbij maakt het lichaam de antistoffen niet zelf, maar krijgt ze kant-en-klaar aangeboden via een injectie (gammaglobulinen = immunoglobulinen = Ig) of (als ongeboren baby) via de moeder. Deze vorm van immuniteit wordt derhalve passief verkregen en duurt niet lang. De antistoffen worden afgebroken en niet opnieuw aangemaakt, omdat er geen contact met het antigeen is geweest.\n",
            "cite_spans": [],
            "section": "4.3.4 Immuniteit ::: 4.3 Verloop infectieziekten",
            "ref_spans": []
        },
        {
            "text": "Vaak bestaat de behandeling van infectieziekten eerder uit het bestrijden van de symptomen dan dat men de ziekte geneest. Veelal dient een ziekte uitgeziekt te worden en is de aandoening \u2018self-limiting\u2019. Dit wil zeggen dat de ziekte vanzelf verdwijnt omdat de mens een weerstand heeft opgebouwd. Soms is behandeling mogelijk met chemotherapeutica of antibiotica. Chemotherapeutica worden in de fabriek chemisch gefabriceerd en antibiotica worden door micro-organismen geproduceerd.",
            "cite_spans": [],
            "section": "4.3.5 Behandeling ::: 4.3 Verloop infectieziekten",
            "ref_spans": []
        },
        {
            "text": "Virussen zijn niet gevoelig voor chemotherapeutica of antibiotica, bacteri\u00ebn meestal wel. Natuurlijk zijn de antibiotica een zegen voor de mensheid, maar overmatig of onjuist gebruik kan aanleiding geven tot de vorming van resistente bacteri\u00ebn. Dat wil zeggen dat die bacteri\u00ebn ongevoelig zijn geworden voor een antibioticum, soms voor een hele groep antibiotica (bijvoorbeeld penicilline). Dit kan, met name in ziekenhuizen, tot grote problemen aanleiding geven.",
            "cite_spans": [],
            "section": "4.3.5 Behandeling ::: 4.3 Verloop infectieziekten",
            "ref_spans": []
        },
        {
            "text": "\nmazelen\n",
            "cite_spans": [],
            "section": "4.4.1 Infectieziekten met uitslag ::: 4.4 Indeling infectieziekten",
            "ref_spans": []
        },
        {
            "text": "Veel van de infectieziekten met uitslag zijn virale kinderziekten. De meeste ziekten verlopen zonder complicaties. Met name bij mazelen (morbilli) worden echter complicaties gezien die ernstige gevolgen kunnen hebben. De complicaties zijn: otitis media (middenoorontsteking), tracheobronchitis en encefalitis (hersenontsteking). Derhalve wordt tegenwoordig iedere peuter in de 14e maand inge\u00ebnt met de bmr-vaccinatie (bof, mazelen, rodehond).",
            "cite_spans": [],
            "section": "4.4.1 Infectieziekten met uitslag ::: 4.4 Indeling infectieziekten",
            "ref_spans": []
        },
        {
            "text": "\nrodehond\n",
            "cite_spans": [],
            "section": "4.4.1 Infectieziekten met uitslag ::: 4.4 Indeling infectieziekten",
            "ref_spans": []
        },
        {
            "text": "Het rodehondvirus (rubella) kan schade toebrengen aan de foetus in de eerste drie maanden van de zwangerschap. Vandaar ook dat rodehond in de bmr-vaccinatie is opgenomen.",
            "cite_spans": [],
            "section": "4.4.1 Infectieziekten met uitslag ::: 4.4 Indeling infectieziekten",
            "ref_spans": []
        },
        {
            "text": "\nwaterpokken\n",
            "cite_spans": [],
            "section": "4.4.1 Infectieziekten met uitslag ::: 4.4 Indeling infectieziekten",
            "ref_spans": []
        },
        {
            "text": "Waterpokken komt veelal voor bij kinderen en gordelroos veelal bij ouderen; deze beide ziekten worden door hetzelfde virus veroorzaakt, namelijk het herpes-zostervirus.",
            "cite_spans": [],
            "section": "4.4.1 Infectieziekten met uitslag ::: 4.4 Indeling infectieziekten",
            "ref_spans": []
        },
        {
            "text": "\n5e en 6e ziekte\n",
            "cite_spans": [],
            "section": "4.4.1 Infectieziekten met uitslag ::: 4.4 Indeling infectieziekten",
            "ref_spans": []
        },
        {
            "text": "De 5e en 6e ziekte behoren eveneens tot de virale infectieziekten met uitslag.",
            "cite_spans": [],
            "section": "4.4.1 Infectieziekten met uitslag ::: 4.4 Indeling infectieziekten",
            "ref_spans": []
        },
        {
            "text": "\nroodvonk\n",
            "cite_spans": [],
            "section": "4.4.1 Infectieziekten met uitslag ::: 4.4 Indeling infectieziekten",
            "ref_spans": []
        },
        {
            "text": "Roodvonk (scarlatina) wordt door een streptokok veroorzaakt en geeft naast een huiduitslag ook keelontsteking en koorts. Roodvonk kan de nieren, het hart en de hersenen aantasten.",
            "cite_spans": [],
            "section": "4.4.1 Infectieziekten met uitslag ::: 4.4 Indeling infectieziekten",
            "ref_spans": []
        },
        {
            "text": "Een verkoudheid kan zeer lastig zijn, maar bij de griep of influenza is men echt ziek met koorts, hoofdpijn, hoesten en koude rillingen. Vooral mensen met minder weerstand, zoals cara- en diabetespati\u00ebnten en bejaarden, krijgen dan vaak longcomplicaties, bijvoorbeeld een longontsteking (pneumonie). Vandaar dat deze groep risicopati\u00ebnten zich in november kan laten vaccineren tegen het te verwachten virus. Andere infecties van de luchtwegen zijn voorts tuberculose en kinkhoest (pertussis).",
            "cite_spans": [],
            "section": "4.4.2 Infectieziekten van de luchtwegen ::: 4.4 Indeling infectieziekten",
            "ref_spans": []
        },
        {
            "text": "\nklierkoorts\n",
            "cite_spans": [],
            "section": "4.4.3 Infectieziekten van de lymfeklieren ::: 4.4 Indeling infectieziekten",
            "ref_spans": []
        },
        {
            "text": "De klierkoorts van Pfeiffer (mononucleosis infectiosa) wordt ook wel een \u2018kissing disease\u2019 genoemd. De ziekte treedt vooral op bij adolescenten (15-25 jaar) die een verlaagde weerstand hebben. Het Epstein-Barr-virus (ebv)hepatitis;Epstein-Barr-virusebv, zie hepatitis, Epstein-Barr is verantwoordelijk voor de keelpijn, koorts en de algehele lymfeklierzwelling in het lichaam. Ook andere organen kunnen in het proces betrokken raken, zoals de milt, longen, nieren enzovoort. Een maandenlang durende vermoeidheid wordt waarschijnlijk veroorzaakt doordat de lever aangetast wordt.",
            "cite_spans": [],
            "section": "4.4.3 Infectieziekten van de lymfeklieren ::: 4.4 Indeling infectieziekten",
            "ref_spans": []
        },
        {
            "text": "Immunologisch gezien worden de B-lymfocyten door het ebv ge\u00efnfecteerd. Ze vormen membraanantigenen waarop als antwoord killercellen (T-lymfocyten) geproduceerd worden in het lymfatische weefsel in het gehele lichaam.",
            "cite_spans": [],
            "section": "4.4.3 Infectieziekten van de lymfeklieren ::: 4.4 Indeling infectieziekten",
            "ref_spans": []
        },
        {
            "text": "\ntoxoplasmose\n",
            "cite_spans": [],
            "section": "4.4.3 Infectieziekten van de lymfeklieren ::: 4.4 Indeling infectieziekten",
            "ref_spans": []
        },
        {
            "text": "Toxoplasmose is voor gezonde kinderen en volwassenen onschuldig, maar de ongeboren vrucht kan ernstig worden beschadigd (hart, ogen en hersenen). De ziekte ontstaat door het eten van (te) rauw vlees en wordt ook vaak overgebracht door de huiskat.",
            "cite_spans": [],
            "section": "4.4.3 Infectieziekten van de lymfeklieren ::: 4.4 Indeling infectieziekten",
            "ref_spans": []
        },
        {
            "text": "\nhepatitis A hepatitis B ziekte van Weil\n",
            "cite_spans": [],
            "section": "4.4.4 Infectieziekten met geelzucht ::: 4.4 Indeling infectieziekten",
            "ref_spans": []
        },
        {
            "text": "Het hepatitis-A-virus wordt voornamelijk via de feces overgedragen, het hepatitis-B-virus via het bloed, speeksel, sperma en vaginaalvocht (soa).",
            "cite_spans": [],
            "section": "4.4.4 Infectieziekten met geelzucht ::: 4.4 Indeling infectieziekten",
            "ref_spans": []
        },
        {
            "text": "De ziekte van Weil wordt veroorzaakt door contact met water, besmet door rattenurine waarin een spirocheet zit.",
            "cite_spans": [],
            "section": "4.4.4 Infectieziekten met geelzucht ::: 4.4 Indeling infectieziekten",
            "ref_spans": []
        },
        {
            "text": "\ntetanus\n",
            "cite_spans": [],
            "section": "4.4.5 Infectieziekten van het centrale zenuwstelsel ::: 4.4 Indeling infectieziekten",
            "ref_spans": []
        },
        {
            "text": "Door vieze straatwonden kan men tetanus oplopen. Deze bacterie scheidt een toxine af die schadelijk is voor het zenuwstelsel. Er kunnen ernstige krampen ontstaan. Kinderen worden via de dktp tegen tetanus inge\u00ebnt. Loopt men binnen vijftien jaar een vieze wond op, dan kan een herhalingsinjectie (booster) met antilichamen gegeven worden. Na vijftien jaar moeten er weer actief antilichamen gemaakt worden. In dat geval wordt een vaccin met verzwakte toxinen gegeven.",
            "cite_spans": [],
            "section": "4.4.5 Infectieziekten van het centrale zenuwstelsel ::: 4.4 Indeling infectieziekten",
            "ref_spans": []
        },
        {
            "text": "\nhondsdolheid\n",
            "cite_spans": [],
            "section": "4.4.5 Infectieziekten van het centrale zenuwstelsel ::: 4.4 Indeling infectieziekten",
            "ref_spans": []
        },
        {
            "text": "Hondsdolheid (rabi\u00ebs) wordt veroorzaakt door het rabi\u00ebsvirus. Er ontstaat na de incubatietijd van 1-6 maanden een dodelijke encefalitis.",
            "cite_spans": [],
            "section": "4.4.5 Infectieziekten van het centrale zenuwstelsel ::: 4.4 Indeling infectieziekten",
            "ref_spans": []
        },
        {
            "text": "\nmeningitis\n",
            "cite_spans": [],
            "section": "4.4.5 Infectieziekten van het centrale zenuwstelsel ::: 4.4 Indeling infectieziekten",
            "ref_spans": []
        },
        {
            "text": "Meningitis (nekkramp) is een ontsteking van de hersen- en ruggenmergsvliezen. Een meningitis kan veroorzaakt worden door een virus of door bacteri\u00ebn.",
            "cite_spans": [],
            "section": "4.4.5 Infectieziekten van het centrale zenuwstelsel ::: 4.4 Indeling infectieziekten",
            "ref_spans": []
        },
        {
            "text": "\npolio\n",
            "cite_spans": [],
            "section": "4.4.5 Infectieziekten van het centrale zenuwstelsel ::: 4.4 Indeling infectieziekten",
            "ref_spans": []
        },
        {
            "text": "Poliomyelitis anterior acuta, kortweg polio genaamd, ontstaat doordat na enterale besmetting (buikgriep) het virus via de zenuwbanen in het ruggenmerg terechtkomt. Dit geeft aanleiding tot spierverlammingen (zie 10.1007/978-90-368-1602-1_16). Ook hiertegen worden kinderen via de dktp gevaccineerd.",
            "cite_spans": [],
            "section": "4.4.5 Infectieziekten van het centrale zenuwstelsel ::: 4.4 Indeling infectieziekten",
            "ref_spans": []
        },
        {
            "text": "Vroeger gebruikte men voor deze groep aandoeningen de term geslachtsziekten. Ook andere organen dan de geslachtsorganen zijn echter bij deze aandoeningen betrokken, zoals de mond en het rectum. Seksueel overdraagbare aandoeningen (soa) zijn onder andere: gonorroe, herpesgenitalis, Chlamydia, lues en trichomoniasis.",
            "cite_spans": [],
            "section": "4.4.6 Seksueel overdraagbare aandoeningen ::: 4.4 Indeling infectieziekten",
            "ref_spans": []
        },
        {
            "text": "\naids\n",
            "cite_spans": [],
            "section": "4.4.7 Infectieziekten van het immuunapparaat ::: 4.4 Indeling infectieziekten",
            "ref_spans": []
        },
        {
            "text": "Aids betekent Acquired ImmunoDeficiency Syndrome. Dit ziektebeeld is reeds in 10.1007/978-90-368-1602-1_3 beschreven.",
            "cite_spans": [],
            "section": "4.4.7 Infectieziekten van het immuunapparaat ::: 4.4 Indeling infectieziekten",
            "ref_spans": []
        },
        {
            "text": "\nbof\n",
            "cite_spans": [],
            "section": "4.4.8 Andere infectieziekten ::: 4.4 Indeling infectieziekten",
            "ref_spans": []
        },
        {
            "text": "Iedere peuter wordt door middel van de bmr-vaccinatie in de 14e levensmaand inge\u00ebnt tegen de bof (parotitis epidemica). De inenting tegen de bof is vooral vanwege de complicatie die deze ziekte met zich meebrengt, namelijk een ontsteking van de testikels, waardoor ongewenste steriliteit kan optreden.",
            "cite_spans": [],
            "section": "4.4.8 Andere infectieziekten ::: 4.4 Indeling infectieziekten",
            "ref_spans": []
        },
        {
            "text": "\nmalaria\n",
            "cite_spans": [],
            "section": "4.4.8 Andere infectieziekten ::: 4.4 Indeling infectieziekten",
            "ref_spans": []
        },
        {
            "text": "Malaria wordt overgebracht via de malariamug. Tijdens het steken besmet de vrouwtjesmug de mens door de malariaparasiet in de bloedbaan te brengen. Hierdoor ontstaan hoge koortsen en worden rode bloedlichaampjes vernietigd. Op den duur ontstaat er bloedarmoede. Iedereen die naar een gebied gaat waar malaria heerst, moet daarom malariaprofylaxe innemen.",
            "cite_spans": [],
            "section": "4.4.8 Andere infectieziekten ::: 4.4 Indeling infectieziekten",
            "ref_spans": []
        },
        {
            "text": "\n\n",
            "cite_spans": [],
            "section": "4.5 Toets",
            "ref_spans": []
        }
    ],
    "ref_entries": {},
    "back_matter": [],
    "bib_entries": {}
}