{
    "paper_id": "PMC7121957",
    "metadata": {
        "title": "24 Longaandoeningen",
        "authors": [
            {
                "first": "A.M.L.",
                "middle": [],
                "last": "Van Gompel",
                "suffix": "",
                "email": null,
                "affiliation": {}
            },
            {
                "first": "G.J.B.",
                "middle": [],
                "last": "Sonder",
                "suffix": "",
                "email": null,
                "affiliation": {}
            },
            {
                "first": "M.",
                "middle": [],
                "last": "Keuter",
                "suffix": "",
                "email": null,
                "affiliation": {}
            },
            {
                "first": "J.",
                "middle": [],
                "last": "van den Hombergh",
                "suffix": "",
                "email": null,
                "affiliation": {}
            }
        ]
    },
    "body_text": [
        {
            "text": "Longproblemen tijdens of na een verblijf in de tropen kunnen acuut (zoals\nLegionella-pneumonie) of chronisch van aard zijn (longtuberculose). Reizigers die longklachten hebben, zullen meestal eerst naar de huisarts gaan. Deze kan verwijzen naar een internist of longarts, een kliniek met expertise in tropische ziekten of (voor onderzoek op tuberculose) een GGD in Nederland, of een VRGT-polikliniek in Vlaanderen.",
            "cite_spans": [],
            "section": "1 Inleiding",
            "ref_spans": []
        },
        {
            "text": "Er zijn grote verschillen tussen de incidenties van de ziektebeelden die in dit hoofdstuk besproken worden. Sommige aandoeningen zijn erg zeldzaam; een aantal komt vooral voor bij pati\u00ebnten met gestoorde immuniteit (zoals strongyloidiasis en histoplasmose). Bronchospasme, gepaard gaand met eosinofilie en vluchtige r\u00f6ntgenologische longafwijkingen, kan wijzen op longpassage van wormen of op het katayamasyndroom. Sommige longinfecties, zoals echinokokkose, komen vrijwel uitsluitend bij allochtonen voor. We zullen nu vanuit de praktijk een aantal longaandoeningen bespreken.",
            "cite_spans": [],
            "section": "1 Inleiding",
            "ref_spans": []
        },
        {
            "text": "Ab de Gier (42), die tot nu toe altijd gezond is geweest, bezocht Burkina Faso voor een ontwikkelingsproject. Na een week van vergaderingen in de hoofdstad (in een goed hotel) bezocht hij twee weken het platteland. Malariaprofylaxe nam hij eerst wel, maar daarna was zijn tas gestolen en gebruikte hij alleen muggenolie en \u2019s nachts een net. Vijf dagen na terugkeer in Nederland kreeg hij koorts (39,1 \u00b0C), hoofdpijn, spierpijn en diarree. Na telefonisch advies van zijn huisarts nam hij zo nodig paracetamol, maar drie dagen later werd hij nog zieker: hij was af en toe verward, hoestte wat en werd toenemend kortademig. Bij onderzoek was de temperatuur 38,8 \u00b0C, er was een tachypneu (32/min.) en beiderzijds was er crepiteren achteronder. Hij werd nu met spoed opgenomen onder verdenking van pneumonie. Op de afdeling intensive care was hij in shock en bleek hij nierinsuffici\u00ebntie te hebben. De r\u00f6ntgenfoto toonde beiderzijds vlekkige infiltraten. In de dikke druppel werd\nP. falciparum gezien, parasitemie 20%. Met kinine i.v. in combinatie met doxycycline i.v. en wisseltransfusies was hij in vijf dagen parasitologisch negatief, maar de ernstige orgaancomplicaties met een vochtretentie van ruim 40 kg vergden vier weken intensieve zorgbehandeling. In het beloop hiervan maakte hij bacteri\u00ebmie door met\nCandida en\nEnterobacter. Hij herstelde echter volledig.",
            "cite_spans": [],
            "section": "Casus 1 ::: 2.1 Malaria tropica (P. falciparum) ::: 2 Koorts met acute longklachten (hoest, versnelde ademhaling) (tabel #!start#24.1#!sep#Tab1#!sep#table#!end#)",
            "ref_spans": []
        },
        {
            "text": "Bij koorts na terugkeer uit de tropen moet altijd aan malaria worden gedacht, tenzij men zeker weet dat de reiziger niet in een transmissiegebied is geweest. Er had dus al bij het eerste telefonische contact onmiddellijk een malariaonderzoek (dikkedruppeltest of QBC) moeten plaatsvinden. In het geval van Ab de Gier gold dit des te meer omdat hij West-Afrika had bezocht (met een zeer hoge transmissie-intensiteit) \u00e9n omdat hij gestopt was met malariaprofylaxe. Falciparummalaria is mogelijk tot drie maanden na verlaten van het endemische gebied en kan in enkele dagen leiden tot ernstige complicaties, zoals cerebrale malaria en nierinsuffici\u00ebntie. Ook kan een\ncapillary leak-syndroom ontstaan met shock, vochtretentie en longoedeem respectievelijk ARDS (adult respiratory distress syndrome). De behandeling in deze fase van de ziekte kan alleen op een ICU plaatsvinden en bestaat enerzijds uit bestrijding van de\nP. falciparum-infectie zelf (primair met i.v. kinine of een van de nieuwe artimisininepreparaten; bovendien dient in principe wisseltransfusie overwogen te worden bij parasitemie > 10-15%, zeker als er orgaanafwijkingen zijn), anderzijds uit bestrijding van shock, nierinsuffici\u00ebntie, longoedeem, hypoglykemie, acidose en andere complicaties. Met het inmiddels verkrijgbare intraveneuze artesunaat zullen wisseltransfusies waarschijnlijk niet meer nodig zijn.",
            "cite_spans": [],
            "section": "Casus 1 ::: 2.1 Malaria tropica (P. falciparum) ::: 2 Koorts met acute longklachten (hoest, versnelde ademhaling) (tabel #!start#24.1#!sep#Tab1#!sep#table#!end#)",
            "ref_spans": []
        },
        {
            "text": "Twijfelt u aan het watersysteem? Laat dan het koude en warme water een minuut stromen. Het beste kunt u de douchekop onderdompelen in een emmer water of het sproeistuk eraf draaien. Is dit niet mogelijk? Houd dan de douchekop dicht bij het afvoerputje. Ventileer of verlaat voor de zekerheid de ruimte. Bron\nwww.vrom.nl/legionella zoekterm \u201cAntwoord op de meest gestelde vragen (editie feb. 2010).",
            "cite_spans": [],
            "section": "Preventie voor reizigers ::: 2.2 Bacteri\u00eble en virale verwekkers ::: 2 Koorts met acute longklachten (hoest, versnelde ademhaling) (tabel #!start#24.1#!sep#Tab1#!sep#table#!end#)",
            "ref_spans": []
        },
        {
            "text": "Q-koorts (verwekker:\nCoxiella burnetii, lijkt op de\nRickettsiae), een bij de mens zeldzame zo\u00f6nose, dankt zijn naam aan een epidemie in Australi\u00eb in 1935, waarvan destijds de verwekker onbekend was (Q voor\nquery). Het is een wereldwijd verspreide infectie van melkvee, slachtvee, huisdieren en wilde dieren. De transmissie van dier tot dier vindt plaats door teken, naar de mens echter aerogeen. De bacterie kan zich bevinden in placentaweefsel en amnionvocht, maar ook in melk. Het was vooral een beroepsziekte van slachters en veterinaire werkers. Vanaf 2008 en 2009 werd in Nederland steeds meer Q-koorts gezien door de opkomst van geitenboerderijen, waardoor het niet meer als importziekte gezien wordt. De incubatietijd is twee dagen tot drie weken. Het klinisch beeld is dat van een atypische pneumonie met koorts, meestal een droge hoest en geen afwijkingen bij auscultatie. Ook een diffuse pneumonitis en leverafwijkingen zijn mogelijk. De diagnose kan met PCR op een keeluitstrijk of op EDTA-bloed gesteld worden en kan serologisch bevestigd worden. In minder dan 10% van de gevallen kan de infectie chronisch worden, soms met als complicatie endocarditis of een mycotisch aneurysma. Behandeling: doxycycline of een macrolide antibioticum. Chronische Q-koorts wordt langdurig met hydroxychloroquine en doxycycline behandeld.",
            "cite_spans": [],
            "section": "Preventie voor reizigers ::: 2.2 Bacteri\u00eble en virale verwekkers ::: 2 Koorts met acute longklachten (hoest, versnelde ademhaling) (tabel #!start#24.1#!sep#Tab1#!sep#table#!end#)",
            "ref_spans": []
        },
        {
            "text": "Bij buiktyfus in de acute fase van de ziekte ontstaat vaak een droge hoest. Bij onderzoek zijn er veelal droge, piepende rhonchi. Later, als het beloop van de ziekte gecompliceerd is, kan een pneumonie ontstaan met klinisch en r\u00f6ntgenologisch een infiltraat. De verwekker kan in deze laatste situatie\nS. typhi zijn, maar is meestal een van de bacteri\u00ebn die nosocomiale pneumonie verwekken. Buiktyfus is tegenwoordig bijna altijd een importziekte. Bij de behandeling moet men rekening houden met resistentie tegen chlooramfenicol, ampicilline en cotrimoxazol; een van de fluorochinolonen of ceftriaxone is een goede keus.",
            "cite_spans": [],
            "section": "Preventie voor reizigers ::: 2.2 Bacteri\u00eble en virale verwekkers ::: 2 Koorts met acute longklachten (hoest, versnelde ademhaling) (tabel #!start#24.1#!sep#Tab1#!sep#table#!end#)",
            "ref_spans": []
        },
        {
            "text": "Leptospirose kan zich zeer verschillend presenteren, van een zeer mild ziektebeeld tot de bedreigende leptospirosis icterohaemorrhagica (ziekte van Weil). Leptospirose komt in Nederland voor bij mensen die aan wildwatervaren hebben gedaan in Zuidoost-Azi\u00eb. Overigens werd in Nederland de gediagnosticeerde leptospirose in de helft van de gevallen in Nederland zelf opgelopen. Ernstige leptospirose gaat gepaard met multipel orgaanfalen, nierinsuffici\u00ebntie, icterus, soms meningitis en longoedeem. Epidemie\u00ebn in Nicaragua en in Peru lieten veel longbloedingen zien bij de pati\u00ebnten. Door de erbij voorkomende bloedingsneiging kan als zeldzame complicatie hemopto\u00eb ontstaan. Deze pati\u00ebnten hebben een behandeling op de ICU nodig. Leptospirose kan behandeld worden met penicilline of tetracyclinen. Ceftriaxon is ook gebleken zeer effectief te zijn.",
            "cite_spans": [],
            "section": "Preventie voor reizigers ::: 2.2 Bacteri\u00eble en virale verwekkers ::: 2 Koorts met acute longklachten (hoest, versnelde ademhaling) (tabel #!start#24.1#!sep#Tab1#!sep#table#!end#)",
            "ref_spans": []
        },
        {
            "text": "Een amoebenabces van de lever gelokaliseerd dicht onder het diafragma kan gepaard gaan met longafwijkingen in de vorm van diafragmahoogstand, infiltratieve afwijkingen in de rechteronderkwab of pleuravocht. De pati\u00ebnt heeft koorts, pijn in de leverstreek, drukpijn lateraal tussen de ribben en vaak een droge hoest. Ernstige pleuropulmonale complicaties ontstaan bij doorbraak van het abces naar pleuraholte of longen. De pati\u00ebnt hoest dan in typische gevallen chocoladekleurige pus op. De diagnose wordt klinisch gesteld, aangevuld door serologisch onderzoek. De bloedbezinking is flink verhoogd en er bestaat leukocytose met linksverschuiving. Behandeling is primair medicamenteus (een van de imidazolen in hoge dosering \u2013 metronidazol \u2013 gedurende 5-10 dagen), maar drainage kan nodig zijn om verdere verspreiding te voorkomen. De respons op medicamenteuze therapie is meestal binnen enkele dagen zichtbaar (daling van lichaamstemperatuur en leukocyten in het bloed).",
            "cite_spans": [],
            "section": "2.3 Zeldzame oorzaken ::: 2 Koorts met acute longklachten (hoest, versnelde ademhaling) (tabel #!start#24.1#!sep#Tab1#!sep#table#!end#)",
            "ref_spans": []
        },
        {
            "text": "Het hantavirus is een zeldzame verwekker van het\nhantavirus pulmonary syndrome, bekend sinds 1993 en eerst alleen beschreven in de Verenigde Staten, later ook in Canada en Zuid-Amerika. Het is een snel progressieve ziekte die zich bij doorgaans gezonde personen voordoet met koorts, spierpijn, hoest, dyspneu en misselijkheid of braken. Binnen enkele dagen ontstaat progressief niet-cardiogeen longoedeem (ARDS) met bilaterale infiltraten op de thoraxfoto en hypotensie. Er is alleen symptomatische behandeling op een ICU mogelijk. De mortaliteit is rond 50%. In Europa zijn ook pulmonale complicaties beschreven bij hantavirus (Puumala).",
            "cite_spans": [],
            "section": "2.3 Zeldzame oorzaken ::: 2 Koorts met acute longklachten (hoest, versnelde ademhaling) (tabel #!start#24.1#!sep#Tab1#!sep#table#!end#)",
            "ref_spans": []
        },
        {
            "text": "Bij van oorsprong allochtone kinderen met sikkelcelziekte komt het\nacute chest syndrome voor. De presentatie is met pijn op de borst gebonden aan de ademhaling, koorts en hoest. Dit beeld kan enerzijds worden veroorzaakt door infarcten in de longen of in de ribben veroorzaakt door vaatocclusieve crises, en anderzijds berusten op een pneumonie door pneumokokken, met name als het kind geen pneumokokkenvaccinatie heeft gehad (deze is ge\u00efndiceerd in verband met de functionele asplenie als gevolg van herhaalde miltinfarcten). Soms is er sprake van een pneumonie door andere verwekkers zoals\nMycoplasma pneumoniae.",
            "cite_spans": [],
            "section": "2.3 Zeldzame oorzaken ::: 2 Koorts met acute longklachten (hoest, versnelde ademhaling) (tabel #!start#24.1#!sep#Tab1#!sep#table#!end#)",
            "ref_spans": []
        },
        {
            "text": "Tularemie is een zo\u00f6nose, overgebracht door geleedpotigen (onder meer teken), vooral voorkomend in Noord-Amerika en Europa, maar ook in China, Japan en Mexico bij herders, boeren en anderen die met dieren omgaan. De verwekkende bacterie is\nFrancisella tularensis. Vanuit een ulcererende huidlaesie ontstaat regionale lymfadenopathie. Via een bacteri\u00ebmie of direct door inademing van het organisme kunnen longafwijkingen ontstaan. De pati\u00ebnt heeft een meestal droge hoest en pleurapijn; r\u00f6ntgenologisch is er een infiltraat met granulomen. Uit sputum of materiaal van laesies kan de bacterie slechts op aparte voedingsbodems gekweekt worden. Er bestaat een serologische test die overigens niet in Nederland of Belgi\u00eb beschikbaar is.",
            "cite_spans": [],
            "section": "2.3 Zeldzame oorzaken ::: 2 Koorts met acute longklachten (hoest, versnelde ademhaling) (tabel #!start#24.1#!sep#Tab1#!sep#table#!end#)",
            "ref_spans": []
        },
        {
            "text": "Antrax (verwekker\nBacillus anthracis) komt met name voor bij personen die werken met (huiden van) besmette dieren. Het is primair een huidziekte (eschar met zwart centrum, in typische gevallen omgeven door een vesikelkrans en een opvallende oedeemwal). Door inhalatie van de bacteri\u00ebn kan sporadisch een aspecifiek maar zeer fulminant beeld van bovenste- of ondersteluchtweginfectie ontstaan.",
            "cite_spans": [],
            "section": "2.3 Zeldzame oorzaken ::: 2 Koorts met acute longklachten (hoest, versnelde ademhaling) (tabel #!start#24.1#!sep#Tab1#!sep#table#!end#)",
            "ref_spans": []
        },
        {
            "text": "Longpest (door\nYersinia pestis) wordt sporadisch beschreven in ontwikkelingslanden. De kans deze aandoening als importziekte tegen te komen is vrijwel nihil.",
            "cite_spans": [],
            "section": "2.3 Zeldzame oorzaken ::: 2 Koorts met acute longklachten (hoest, versnelde ademhaling) (tabel #!start#24.1#!sep#Tab1#!sep#table#!end#)",
            "ref_spans": []
        },
        {
            "text": "Melioidosis veroorzaakt door\nBurkholderia pseudomallei kan een acute pneumonie geven na met name watercontact in Zuidoost-Azi\u00eb, hoewel het ook beschreven is in Zuid-Amerika. Ceftazidime of meropenem zijn de antibiotica van keuze.",
            "cite_spans": [],
            "section": "2.3 Zeldzame oorzaken ::: 2 Koorts met acute longklachten (hoest, versnelde ademhaling) (tabel #!start#24.1#!sep#Tab1#!sep#table#!end#)",
            "ref_spans": []
        },
        {
            "text": "Bert Uilenburg, 27 jaar, reisde acht maanden door Azi\u00eb (India, Nepal en Bangladesh) en vertoefde veel onder de lokale bevolking. V\u00f3\u00f3r de reis was hij gezond en werd hij gevaccineerd tegen difterie, tetanus, polio, hepatitis A en buiktyfus, maar hij zag af van BCG-vaccinatie; wel liet hij een mantouxtest doen, die negatief was. Twee maanden na terugkeer meldde hij zich, zoals geadviseerd was, op de GGD voor een controlemantoux: deze was positief met 20 mm induratie. Hij hoestte niet, maar was wel wat moe. Lichamelijk onderzoek was normaal, ook van de longen. De thoraxfoto toonde een onregelmatig begrensde verdichting in de linkerbovenkwab. De bezinking was 5 mm na 1 uur. Na een week kon hij met moeite \u2019s morgens tweemaal wat sputum ophoesten; de ziehl-neelsenkleuring was negatief, tuberculosekweken werden ingezet. Met een atypische pneumonie in de differentiaaldiagnose werd hij gedurende tien dagen met doxycycline behandeld. Bij controle na twee weken was de r\u00f6ntgenfoto onveranderd. Nadat opnieuw twee sputumkweken waren ingezet op tuberculose (ziehl-neelsenkleuring bij beide weer negatief) werd gestart met vier tuberculostatica. Vier weken hierna liet de thoraxfoto een afname van de afwijkingen zien. Uit de eerste kweken werd nu\nMycobacterium tuberculosis gekweekt. Gelukkig bleken er geen resistenties te bestaan tegen de meest gebruikte tuberculostatica. De behandeling met tuberculostatica werd in totaal zes maanden voortgezet. De hoest en de afwijkingen op de thoraxfoto verdwenen en de pati\u00ebnt werd uit controle ontslagen.",
            "cite_spans": [],
            "section": "Casus 2 ::: 3.1 Tuberculose ::: 3 Chronische hoest en andere longklachten bij normale immuniteit (tabel #!start#24.1#!sep#Tab1#!sep#table#!end#)",
            "ref_spans": []
        },
        {
            "text": "Terwijl de incidentie van tuberculose in Nederland gedaald is tot ruim onder de 10 per 100.000, is in een groot aantal populaire reisbestemmingen de incidentie hoger dan 50 per 100.000. Deze hoogendemische landen bevinden zich met name in Afrika en Azi\u00eb, maar ook in Oost-Europa. Het risico op tuberculose voor reizigers naar hoogendemische landen hangt af van de reisduur en de mate van contact met de lokale bevolking.",
            "cite_spans": [],
            "section": "Casus 2 ::: 3.1 Tuberculose ::: 3 Chronische hoest en andere longklachten bij normale immuniteit (tabel #!start#24.1#!sep#Tab1#!sep#table#!end#)",
            "ref_spans": []
        },
        {
            "text": "Een onderzoek in 1994-1996 heeft bij Nederlandse reizigers uitgewezen dat het risico op infectie met\nM. tuberculosis tijdens een reis van drie tot twaalf maanden naar hoogendemische landen 1,7 % is (3,5 per 1000 maanden). Deze casus bevestigt dit risico en laat zien dat een actieve tuberculose aanvankelijk weinig tot geen klachten hoeft te geven. Een latente infectie met\nM. tuberculosis geeft nooit klachten, is niet op een thoraxfoto te zien en kan alleen met een mantouxtest worden vastgesteld. Overigens is tuberculose tijdens een buitenlandse reis opgelopen niet altijd het gevolg van tuberculose onder de plaatselijke bevolking. Zo werd ooit een aantal Nederlandse passagiers met\nM. tuberculosis ge\u00efnfecteerd tijdens een busreis door Thailand. Enkele weken na terugkeer bleek de bron een hoestende Nederlandse reisgenoot te zijn, wiens sputum sterk positief was. Infectie met\nM. tuberculosis tijdens een vliegreis is wel beschreven, maar de kans is wellicht niet groter dan in veel andere omstandigheden.",
            "cite_spans": [],
            "section": "Casus 2 ::: 3.1 Tuberculose ::: 3 Chronische hoest en andere longklachten bij normale immuniteit (tabel #!start#24.1#!sep#Tab1#!sep#table#!end#)",
            "ref_spans": []
        },
        {
            "text": "De groei van het aantal reizigers naar landen waar tuberculose veel voorkomt en zelfs nog toeneemt, heeft geleid tot nieuwe aanbevelingen. Hierbij wordt onderscheid gemaakt tussen korte (< 3 maanden) en langere reizen (> 3 maanden). Het beleid wordt daarnaast bepaald door de omstandigheden tijdens de reis.",
            "cite_spans": [],
            "section": "Nederlands beleid voor mantouxtest en BCG bij buitenlandse reizen anno 2010 ::: 3.1 Tuberculose ::: 3 Chronische hoest en andere longklachten bij normale immuniteit (tabel #!start#24.1#!sep#Tab1#!sep#table#!end#)",
            "ref_spans": []
        },
        {
            "text": "\nReis- of verblijfsduur korter dan drie maanden\n",
            "cite_spans": [],
            "section": "Nederlands beleid voor mantouxtest en BCG bij buitenlandse reizen anno 2010 ::: 3.1 Tuberculose ::: 3 Chronische hoest en andere longklachten bij normale immuniteit (tabel #!start#24.1#!sep#Tab1#!sep#table#!end#)",
            "ref_spans": []
        },
        {
            "text": "In principe zijn geen maatregelen nodig, tenzij er een bijzonder risico op tuberculose bestaat (zie verderop). Alleen in dat geval wordt een mantouxtest aanbevolen voor vertrek en acht weken na terugkeer. Omdat bij personen geboren voor 1-1-1945 grote kans bestaat op een positieve mantouxreactie, wordt bij hen deze test nagelaten. De test is niet goed te interpreteren bij hen die in het verleden BCG hebben gehad of die bekend zijn met een positieve mantouxreactie.",
            "cite_spans": [],
            "section": "Nederlands beleid voor mantouxtest en BCG bij buitenlandse reizen anno 2010 ::: 3.1 Tuberculose ::: 3 Chronische hoest en andere longklachten bij normale immuniteit (tabel #!start#24.1#!sep#Tab1#!sep#table#!end#)",
            "ref_spans": []
        },
        {
            "text": "\nReis- of verblijfsduur langer dan drie maanden\n",
            "cite_spans": [],
            "section": "Nederlands beleid voor mantouxtest en BCG bij buitenlandse reizen anno 2010 ::: 3.1 Tuberculose ::: 3 Chronische hoest en andere longklachten bij normale immuniteit (tabel #!start#24.1#!sep#Tab1#!sep#table#!end#)",
            "ref_spans": []
        },
        {
            "text": "In principe wordt een mantouxtest aanbevolen v\u00f3\u00f3r vertrek en acht weken na terugkeer, tenzij er een bijzonder risico op tuberculose bestaat (zie verderop). In dat geval is BCG-vaccinatie ge\u00efndiceerd. Voor kinderen tot twaalf jaar dient altijd BCG-vaccinatie overwogen te worden. De belangrijkste overweging hierbij is de aangetoonde beschermende werking tegen de ernstige postprimaire vormen van tuberculose, met name meningitis tuberculosa en miliaire tuberculose. Bovendien heeft de ziekte bij kinderen vaak snel een ernstig beloop.",
            "cite_spans": [],
            "section": "Nederlands beleid voor mantouxtest en BCG bij buitenlandse reizen anno 2010 ::: 3.1 Tuberculose ::: 3 Chronische hoest en andere longklachten bij normale immuniteit (tabel #!start#24.1#!sep#Tab1#!sep#table#!end#)",
            "ref_spans": []
        },
        {
            "text": "Er is sprake van een bijzonder tuberculoserisico in landen waar veel tuberculose voorkomt:",
            "cite_spans": [],
            "section": "Nederlands beleid voor mantouxtest en BCG bij buitenlandse reizen anno 2010 ::: 3.1 Tuberculose ::: 3 Chronische hoest en andere longklachten bij normale immuniteit (tabel #!start#24.1#!sep#Tab1#!sep#table#!end#)",
            "ref_spans": []
        },
        {
            "text": "\nbij intensief gebruik van lokaal vervoer (overvolle bussen en treinen);als meermalen onderdak wordt gevonden bij de plaatselijke bevolking;als er pati\u00ebntencontacten in de gezondheidszorg plaatsvinden;bij intensieve beroepsmatige contacten met de lokale bevolking;in geval van jonge kinderen: als deze verzorgd worden door lokaal personeel.\n",
            "cite_spans": [],
            "section": "Nederlands beleid voor mantouxtest en BCG bij buitenlandse reizen anno 2010 ::: 3.1 Tuberculose ::: 3 Chronische hoest en andere longklachten bij normale immuniteit (tabel #!start#24.1#!sep#Tab1#!sep#table#!end#)",
            "ref_spans": []
        },
        {
            "text": "Goede uitleg voorafgaand aan de reis is onontbeerlijk, waarbij met name het belang van de mantouxtest na terugkeer benadrukt moet worden (in de praktijk blijkt ongeveer 50% niet hiervoor terug te komen).",
            "cite_spans": [],
            "section": "Nederlands beleid voor mantouxtest en BCG bij buitenlandse reizen anno 2010 ::: 3.1 Tuberculose ::: 3 Chronische hoest en andere longklachten bij normale immuniteit (tabel #!start#24.1#!sep#Tab1#!sep#table#!end#)",
            "ref_spans": []
        },
        {
            "text": "Na BCG-vaccinatie zal de mantouxtest in bijna alle gevallen positief zijn, zodat hij voor 5-10 jaar minder betrouwbaar wordt voor het vaststellen van infectie. Bij personen die niet in aanmerking komen voor een mantouxtest kan, als er groot risico is geweest, een r\u00f6ntgenonderzoek van de thorax (niet eerder dan twee maanden na terugkeer) gemaakt worden om actieve tuberculose uit te sluiten (latente infectie is hiermee niet uit te sluiten). Primair moet hierbij worden gedacht aan gezondheidswerkers en andere expats die in direct contact zijn geweest met pati\u00ebnten met (besmettelijke) longtuberculose.",
            "cite_spans": [],
            "section": "Nederlands beleid voor mantouxtest en BCG bij buitenlandse reizen anno 2010 ::: 3.1 Tuberculose ::: 3 Chronische hoest en andere longklachten bij normale immuniteit (tabel #!start#24.1#!sep#Tab1#!sep#table#!end#)",
            "ref_spans": []
        },
        {
            "text": "\naEr is geen indicatie voor BCG-vaccinatie voor de gewone reizigers.bBCG-vaccinatie van kinderen van migranten tot vijf jaar die (jaarlijks) reizen naar familie in het land van herkomst is ernstig te overwegen \u2013 minstens acht weken voor vertrek.cDe WHO stelt dat BCG-vaccinatie kan overwogen worden voor kinderen en jongvolwassenen afkomstig uit landen waar tbc erg zeldzaam is en die voor langere tijd (minstens enkele maanden) terug in endemisch gebied zullen verblijven. Bij kinderen in de leeftijdsgroep tot vijf jaar is het uitvoeren van BCG te verdedigen (of niet te ontraden), indien het blootstellingsrisico belangrijk is (langdurig verblijf in derdewereldland, veel nauw contact met de inlandse bevolking, gebruikmakend van openbaar vervoer, overnachtend in\nlocal guesthouses, in een gebied met hoge tbc-prevalentie) en de medische infrastructuur ter plaatse van een zeer laag peil is. Hetzelfde geldt voor ontwikkelingswerkers (vooral als ze in de gezondheidssector werken). Vaccinatie wordt ook vereist door bepaalde Franse lycea in overzeese gebieden.dBij de overige personen wordt in de praktijk de volgende houding aangenomen.\nTuberculinehuidtest negatief v\u00f3\u00f3r vertrek + verblijf van minimaal zes maanden in een derdewereldland: tuberculinehuidtest twee maanden na terugkeer.Tuberculinehuidtest negatief v\u00f3\u00f3r vertrek + hoogrisicoverblijf in een derdewereldland (bijvoorbeeld medisch personeel, sociale werkers, in sommige gevallen ook kinderen jonger dan vijf jaar): BCG-vaccinatie overwegen, minstens acht weken voor vertrek.\n\n",
            "cite_spans": [],
            "section": "Belgisch beleid voor mantouxtest en BCG bij buitenlandse reizen anno 2010 ::: 3.1 Tuberculose ::: 3 Chronische hoest en andere longklachten bij normale immuniteit (tabel #!start#24.1#!sep#Tab1#!sep#table#!end#)",
            "ref_spans": []
        },
        {
            "text": "Een reis zal vaker tot actieve tuberculose dan tot een latente infectie aanleiding geven. Een mantouxtest voorafgaand aan de reis dient als uitgangswaarde. Was de test tevoren negatief en is hij na de reis positief, dan is er sprake van een mantouxomslag, hetgeen wijst op een recente infectie (zie kaders Beleid). De interferon-gamma release assay (IGRA ) -, of quantiFERON-TB-, of ELISpottest maakt gebruik van de interferon-gammaproductie van de T-cellen van de pati\u00ebnt gestimuleerd met TB-antigenen. Het is een betere maat gebleken dan de mantouxtest om recente en latente tuberculosebesmetting vast te stellen. Binnenkort wordt deze routinematig toegepast in GGD-settings. De kans op progressie van een latente infectie tot actieve tuberculose is bij normale immuniteit ongeveer 10% gedurende de resterende levensjaren, maar daarvan vindt ongeveer 50% plaats binnen twee jaar. Is aan de hand van een thoraxfoto, en zo nodig nader onderzoek, actieve tuberculose uitgesloten, dan is er sprake van een latente infectie en is behandeling met isoniazide gedurende zes maanden ge\u00efndiceerd. Bij een contra-indicatie of overgevoeligheid voor isoniazide kan volstaan worden met halfjaarlijks een thoraxfoto gedurende een periode van twee jaar. Bij pati\u00ebnten met longklachten na een reis van meer dan enkele maanden naar landen waar veel tuberculose voorkomt, moet tuberculose hoog in de differentiaaldiagnostiek staan. Was de mantouxtest voor de reis negatief, dan moet een nieuwe test worden uitgevoerd. Bij mantouxomslag is een thoraxfoto ge\u00efndiceerd en zo mogelijk sputumonderzoek (direct preparaat en kweek op\nM. tuberculosis). Op de afdeling tuberculosebestrijding van de GGD (Nederland) en in de polikliniek van het VRGT (Vlaanderen) kan snel en drempelvrij tuberculoseonderzoek plaatsvinden.",
            "cite_spans": [],
            "section": "Belgisch beleid voor mantouxtest en BCG bij buitenlandse reizen anno 2010 ::: 3.1 Tuberculose ::: 3 Chronische hoest en andere longklachten bij normale immuniteit (tabel #!start#24.1#!sep#Tab1#!sep#table#!end#)",
            "ref_spans": []
        },
        {
            "text": "Naast tuberculose (door\nM. tuberculosis) zijn klinisch en r\u00f6ntgenologisch hierop lijkende longafwijkingen mogelijk door atypische mycobacteri\u00ebn, zoals\nM. kansasii, M. scrophulaceum en\nM. fortuitum. Infecties door sommige andere atypische mycobacteri\u00ebn, zoals\nM. avium intracellulare, worden vooral gezien bij pati\u00ebnten met verlaagde cellulaire immuniteit, zoals door hiv-infectie. Kweek en resistentiebepaling van de verwekker zijn essentieel om effectieve therapie te kunnen instellen.",
            "cite_spans": [],
            "section": "Belgisch beleid voor mantouxtest en BCG bij buitenlandse reizen anno 2010 ::: 3.1 Tuberculose ::: 3 Chronische hoest en andere longklachten bij normale immuniteit (tabel #!start#24.1#!sep#Tab1#!sep#table#!end#)",
            "ref_spans": []
        },
        {
            "text": "Bij pati\u00ebnten met chronische hoest en andere longklachten na verblijf in de tropen moet, naast tuberculose, aan andere granulomateuze longafwijkingen worden gedacht (bijvoorbeeld als longmanifestatie van schistosomiasis, paragonimiasis of brucellose) en aan enkele andere infectieziekten die samenhangen met het verblijf. Enkele van deze zeldzamere aandoeningen die zijn veroorzaakt door parasieten of bacteri\u00ebn, worden hieronder besproken. Er kan natuurlijk ook sprake zijn van een bestaande longafwijking zoals COPD, en een latente astma kan manifest worden.",
            "cite_spans": [],
            "section": "Belgisch beleid voor mantouxtest en BCG bij buitenlandse reizen anno 2010 ::: 3.1 Tuberculose ::: 3 Chronische hoest en andere longklachten bij normale immuniteit (tabel #!start#24.1#!sep#Tab1#!sep#table#!end#)",
            "ref_spans": []
        },
        {
            "text": "Bij schistosomiasis kunnen persisterende longafwijkingen berusten op depositie van schistosoma-eieren. Deze zeer zeldzame chronische cardiopulmonale schistosomiasis wordt alleen gezien bij allochtone pati\u00ebnten, opgegroeid in hoogendemische gebieden (met daardoor een zeer hoge\nwormload) en \u2013 in het geval van darm-leverschistosomiasis door\nS. mansoni\nof\nS. japonicum \u2013 leveraantasting door hepatoli\u00ebnale schistosomiasis met symmersfibrose (pijpensteelfibrose), splenomegalie en ascites. Door de leverfibrose ontstaat shunting van portabloed naar de longen, waardoor de eieren ook in de arteri\u00eble longcapillairen terechtkomen. Ofschoon bij blaas-nierschistosomiasis door\nS. haematobium de eieren direct via de v. cava in de longen kunnen worden gedeponeerd, komen bij deze vorm (cardio)pulmonale complicaties minder voor. Rond de eieren ontstaat eerst een granuloom, later fibrose. Bij massale infecties wordt door de pulmonale fibrose de bloedstroom vanaf het rechterhart belemmerd, met als gevolg pulmonale hypertensie en cor pulmonale. In dit eindstadium van de ziekte is alleen symptomatische therapie mogelijk.",
            "cite_spans": [],
            "section": "3.2 Parasitaire oorzaken ::: 3 Chronische hoest en andere longklachten bij normale immuniteit (tabel #!start#24.1#!sep#Tab1#!sep#table#!end#)",
            "ref_spans": []
        },
        {
            "text": "Infectie met\nParagonimus westermanni\nwordt vrijwel alleen opgelopen in Azi\u00eb (China, India, Myanmar en andere landen in Zuidoost-Azi\u00eb), maar er zijn ook haarden in Afrika en Latijns-Amerika. Besmetting vindt plaats door het eten van ongekookte zoetwaterkrabben of andere waterdieren. Larven van\nParagonimus\npenetreren de darmwand en migreren naar de longen, waar ze als volwassen wormen twee aan twee leven in gedilateerde bronchioli (hierdoor ontstaat het beeld van een pseudocyste) en waar zij eieren produceren. De symptomen zijn hoest, soms met bloed erbij en pleuraprikkeling. R\u00f6ntgenologisch worden granulomen gezien en als cysten uitziende afwijkingen die op tuberculose lijken. Evenals bij tuberculose treedt later fibrose op en ten slotte ontstaan verkalkingen in de longlaesies. De eieren zijn in het sputum (en door inslikken ook in de feces) aantoonbaar; de gevoeligheid van deze test is niet hoog.",
            "cite_spans": [],
            "section": "3.2 Parasitaire oorzaken ::: 3 Chronische hoest en andere longklachten bij normale immuniteit (tabel #!start#24.1#!sep#Tab1#!sep#table#!end#)",
            "ref_spans": []
        },
        {
            "text": "Echinokokkose is de ziekte veroorzaakt door infectie met het larvenstadium van\nEchinococcus granulosus, een kleine hondenlintworm. Na perorale besmetting kunnen zich in allerlei organen cysten ontwikkelen met een karakteristiek beeld (in typische gevallen een cyste met schotten en dochtercysten) op echo of CT. De meest voorkomende lokalisaties zijn die in lever en longen, maar cysten kunnen overal in het lichaam gelokaliseerd zijn (botten, hersenen). Longlokalisatie kan bestaan zonder longsymptomen; soms is er chronische hoest met opgeven van cysteuze structuren (dochtercysten of flarden van de wand van de moedercyste). Behalve cysteuze afwijkingen zijn op de thoraxfoto ook vage verdichtingen mogelijk. De diagnose berust vooral op het klinische beeld en beeldvormend onderzoek. Serologische tests zijn soms negatief (sensitiviteit meestal rond de 80%) en eosinofilie ontbreekt, tenzij lekkage van cyste-inhoud plaatsvindt. Behandeling kan medicamenteus met albendazolkuren van drie maanden. Gezien de hoge recidiefpercentages zijn vaak langere of meerdere kuren nodig. Na behandeling blijven langdurig afwijkingen bij r\u00f6ntgenonderzoek zichtbaar. Eventueel is resectie van het aangedane longdeel een mogelijkheid. Anders dan bij levercysten verkalken longcysten van echinokokkose meestal niet.",
            "cite_spans": [],
            "section": "3.2 Parasitaire oorzaken ::: 3 Chronische hoest en andere longklachten bij normale immuniteit (tabel #!start#24.1#!sep#Tab1#!sep#table#!end#)",
            "ref_spans": []
        },
        {
            "text": "Brucellose is een zo\u00f6nose van melkvee, meestal via melk overgedragen, soms direct van dier op mens. Het is vooral een beroepsziekte van veeartsen en slachters. Door het drinken van ongekookte melk of eten van verse melkproducten zoals zachte kaas kunnen ook toeristen besmet worden. De symptomen zijn intermitterende koorts, malaise en hoofdpijn. Bij brucellose kunnen afwijkingen in allerlei organen voorkomen, onder andere botten, lymfeklieren, lever en longen, waar granulomen of pleuravocht de manifestatie kunnen zijn. De bacterie is uit bloed of weefsels te isoleren; de ziekte kan ook serologisch worden aangetoond.",
            "cite_spans": [],
            "section": "3.3 Bacteri\u00eble infecties: brucellose en melioidosis ::: 3 Chronische hoest en andere longklachten bij normale immuniteit (tabel #!start#24.1#!sep#Tab1#!sep#table#!end#)",
            "ref_spans": []
        },
        {
            "text": "Melioidosis wordt veroorzaakt door de bacterie\nBurkholderia (vroeger\nPseudomonas)\npseudomallei, die in natte grond en water voorkomt en via huidwondjes kan penetreren; er bestaat mogelijk ook aerogene besmetting. De ziekte, die hoofdzakelijk voorkomt in Zuidoost-Azi\u00eb, maar ook in Noord-Australi\u00eb en delen van het Midden-Oosten, Afrika en Noord- en Zuid-Amerika, is betrekkelijk zeldzaam, hoewel importgevallen regelmatig beschreven worden. Het ziektebeeld varieert in ernst van asymptomatische tot foudroyante infectie in de vorm van een necrotiserende pneumonie of sepsis met strooihaarden in onder andere huid, longen, lever en botten. Het beloop is meestal chronisch, maar kan acuut zijn. In de longlaesies ontstaan cavernen, zodat verwarring met tuberculose mogelijk is. Een ander vergelijkingspunt met deze laatste ziekte is dat de ziekte eerst latent kan blijven en later kan opflakkeren bij pati\u00ebnten met chronische ziekten zoals diabetes mellitus of nierinsuffici\u00ebntie. De bacterie kan uit laesies of sputum ge\u00efsoleerd worden; ook is serologische diagnostiek mogelijk. Behandeling geschiedt met hoge doses ceftazidime in combinatie met cotrimoxazol, doxycycline of macroliden. Antibiotische therapie moet maandenlang voortgezet worden.",
            "cite_spans": [],
            "section": "3.3 Bacteri\u00eble infecties: brucellose en melioidosis ::: 3 Chronische hoest en andere longklachten bij normale immuniteit (tabel #!start#24.1#!sep#Tab1#!sep#table#!end#)",
            "ref_spans": []
        },
        {
            "text": "Cor Gans, 53 jaar, had sinds enkele maanden last van dyspneu en hoest met opgeven van wit, schuimend sputum. Salbutamol had nauwelijks geholpen. Ook had hij diarree (2-5 maal per dag, dun en brijig, zonder bloed erbij). Recent kreeg hij pijn op de borst en koorts tot 38 \u00b0C. De pati\u00ebnt is bekend met periarteriitis nodosa (PAN), waarvoor hij prednison 40 mg eenmaal daags en azathioprine 50 mg driemaal daags gebruikt. In 1979 had hij een\nS. typhimurium-bacteri\u00ebmie en in 1982 diarree met in de feces\nStrongyloides stercoralis, behandeld met tiabendazol gedurende twee dagen. In diezelfde periode maakte hij een bacteri\u00eble meningitis e.c.i. door. De pati\u00ebnt woonde van zijn 8e tot zijn 24e levensjaar in Brazili\u00eb. Bij lichamelijk onderzoek werden piepende rhonchi met verlengd exspirium en rechts achter-onder crepitaties gehoord. De buik was opgezet maar verder normaal. Aanvullend onderzoek: de thoraxfoto was normaal. Bezinking 37 mm na 1 uur. Leukocyten 9,6 109/l met 15% eosinofielen. In feces en sputum werden larven van\nStrongyloides stercoralis gezien. Ook de\nStrongyloides-serologie was positief. Pati\u00ebnt werd destijds behandeld met thiabendazol 1500 mg tweemaal daags oraal gedurende twee weken (voor het huidige behandeladvies: zie verderop). De prednison- en azathioprinemedicatie werd geleidelijk verminderd en uiteindelijk gestopt. Na revisie kon de diagnose PAN niet bevestigd worden. Voor gewrichts- en spierklachten gebruikt hij nu alleen naproxen, zo nodig. Herhaald onderzoek op\nStrongyloides\nin de feces was negatief en na een halfjaar de serologie eveneens.",
            "cite_spans": [],
            "section": "Casus 3 ::: 4.1 Strongyloidiasis ::: 4 Chronische longklachten bij pati\u00ebnten met immunosuppressie (tabel #!start#24.1#!sep#Tab1#!sep#table#!end#)",
            "ref_spans": []
        },
        {
            "text": "Infectie met\nStrongyloides stercoralis wordt vrijwel alleen in de tropen opgelopen. Bij fysiek contact van de huid (meestal blote voeten) met grond besmet met filariforme (L3-)larven dringen deze door de intacte huid naar binnen. Na longpassage groeien de larven in de dunne darm uit tot volwassen wormen die eieren produceren, waar al in de darm rhabditiforme (L1-)larven uitkomen. Deze zijn in staat de darmmucosa of, na passeren van de anus, de perineale huid te penetreren en zo dezelfde gastheer opnieuw te infecteren, waarna de cyclus opnieuw begint. Deze auto-infectiecyclus gaat ook na het verlaten van de tropen door. Dit komt alleen bij deze nematode voor en verklaart hoe het komt dat de infectie vele, ook tientallen jaren na het verlaten van de tropen blijft bestaan (zoals bij deze pati\u00ebnt). Naast maag-darmklachten, die soms lijken op gastritisklachten, maar ook diarree (zonder bloed erbij), bestaan de symptomen uit urticari\u00eble huidafwijkingen, hoest met tekenen van bronchospasme en bij laboratoriumonderzoek een matige eosinofilie. De larven zijn in de feces te vinden, maar zelfs bij driemaal of vaker herhaald onderzoek met gebruik van de concentratiemethode volgens Baermann is de sensitiviteit nog maar 50-85%. Sinds enkele jaren bestaat ook een serologische test die het gevoeligst is bij chronische infecties. Voor behandeling van pati\u00ebnten met normale immuniteit wordt ivermectine 200 \u00b5g/kg eenmaal daags, 1-2 dagen, of albendazol 400 mg eenmaal daags, 3 dagen, geadviseerd. Thiabendazol is in Nederland en Belgi\u00eb niet meer in de handel.",
            "cite_spans": [],
            "section": "Casus 3 ::: 4.1 Strongyloidiasis ::: 4 Chronische longklachten bij pati\u00ebnten met immunosuppressie (tabel #!start#24.1#!sep#Tab1#!sep#table#!end#)",
            "ref_spans": []
        },
        {
            "text": "Strongyloidiasis kan bij pati\u00ebnten met verlaagde cellulaire immuniteit (bijvoorbeeld als gevolg van prednisongebruik \u2013 casus 3 \u2013, immunosuppressieve medicatie na niertransplantatie, een maligne lymfoom, hiv-infectie) een gedissemineerde infectie (hyperinfectie) worden. Hierbij treedt massale vermeerdering van de larven in de darm op (met soms ernstige enteritis/colitis), maar tevens verspreidt de infectie zich naar andere organen, zoals de longen. Anders dan bij longpassage ontstaat nu een pneumonie waarbij in het sputum larven van\nStrongyloides stercoralis aantoonbaar zijn. R\u00f6ntgenologisch is er soms een infiltraat. Ook kunnen, als gevolg van de heftige ontsteking van de darmwand, darmbacteri\u00ebn elders in het lichaam secundaire bacteri\u00eble infecties geven (mogelijk was dit het geval in casus 3 in 1982). Een gedissemineerde infectie verloopt nogal eens letaal. De behandeling bestaat uit dezelfde middelen als genoemd, maar de medicatie wordt langer voortgezet: ivermectine minstens drie dagen en albendazol twee weken. Vervolgens wordt maandelijks tot zesmaandelijks een korte behandeling zoals bij gewone infectie gegeven, zolang immunosuppressie bestaat.",
            "cite_spans": [],
            "section": "Casus 3 ::: 4.1 Strongyloidiasis ::: 4 Chronische longklachten bij pati\u00ebnten met immunosuppressie (tabel #!start#24.1#!sep#Tab1#!sep#table#!end#)",
            "ref_spans": []
        },
        {
            "text": "Bij pati\u00ebnten met immunosuppressie die chronische longklachten hebben en in de tropen geweest zijn moet, behalve aan gedissemineerde infectie met\nStrongyloides stercoralis ook aan de al besproken pleuropulmonale complicaties van een amoebenabces gedacht worden. Daarnaast zijn een diepe mycose van de longen en bij pati\u00ebnten met hiv-infectie meerdere specifieke opportunistische infecties mogelijk.",
            "cite_spans": [],
            "section": "4.2 Amoebiasis en mycosen  ::: 4 Chronische longklachten bij pati\u00ebnten met immunosuppressie (tabel #!start#24.1#!sep#Tab1#!sep#table#!end#)",
            "ref_spans": []
        },
        {
            "text": "Bij pati\u00ebnten met verminderde weerstand die verre reizen gemaakt hebben en chronische longklachten hebben, kan een diepe mycose door\nHistoplasma capsulatum (komt voor in Noord-Amerika, in Afrika:\nH. duboisii),\nCoccidioides immitis, blastomycose (komt voor in Noord-, Midden- en Zuid-Amerika) of\nParacoccidioides brasiliensis (komt alleen voor in Latijns-Amerika) de verklaring zijn. De primaire infectie treedt in de longen op. Na soms langere tijd kan bij immunosuppressie disseminatie optreden. Hierbij komen, naast secundaire longlokalisaties, vaak ook lokalisaties voor in botten, huid, orofarynx (daar met ulceraties), hersenen, lever en milt. De longklachten zijn niet specifiek (hoest, koorts, soms pleurapijn) en er is ook gewichtsverlies, koorts, hepatosplenomegalie, lymfadenopathie en pancytopenie. R\u00f6ntgenologisch worden vlekkige infiltraten gezien, soms interstiti\u00eble, fijn-nodulaire afwijkingen met vergrote hilusklieren en soms pleuravocht. In de longlaesies kan holtevorming en calcificatie optreden. Behandeling geschiedt met itraconazol oraal of amfotericine B i.v.",
            "cite_spans": [],
            "section": "4.2 Amoebiasis en mycosen  ::: 4 Chronische longklachten bij pati\u00ebnten met immunosuppressie (tabel #!start#24.1#!sep#Tab1#!sep#table#!end#)",
            "ref_spans": []
        },
        {
            "text": "Tijdens behandeling met prednison kan darmamoebiasis foudroyant verlopen of asymptomatische amoebiasis (geen klachten, wel cysten van\nEntamoeba histolytica in de feces) extra-intestinale manifestaties geven. Het gevolg hiervan is meestal een amoebenabces in de lever, maar andere lokalisaties (bijvoorbeeld in de hersenen) zijn ook mogelijk. Voor longsymptomen bij leverabces door\nE. histolytica\nzie paragraaf 10.1007/978-90-313-7223-2_10#Sec2.",
            "cite_spans": [],
            "section": "4.2 Amoebiasis en mycosen  ::: 4 Chronische longklachten bij pati\u00ebnten met immunosuppressie (tabel #!start#24.1#!sep#Tab1#!sep#table#!end#)",
            "ref_spans": []
        },
        {
            "text": "Bij hiv-ge\u00efnfecteerde pati\u00ebnten met verlaagd CD4-getal die in de tropen zijn geweest, komt een aantal longinfecties vaker voor:",
            "cite_spans": [],
            "section": "4.3 Infecties bij pati\u00ebnten met hiv-infectie ::: 4 Chronische longklachten bij pati\u00ebnten met immunosuppressie (tabel #!start#24.1#!sep#Tab1#!sep#table#!end#)",
            "ref_spans": []
        },
        {
            "text": "\nTuberculose: het risico op ziekteverschijnselen na besmetting is bij verlaagde (cellulaire) immuniteit tienvoudig toegenomen.Infectie met\nPenicillium marneffii (penicilliosis) is vooral mogelijk na bezoek aan Zuidoost-Azi\u00eb. Manifestaties zijn naast ernstige pneumonie, vermagering en koorts ook huidafwijkingen die gelijkenis vertonen met molluscum contagiosum.\n",
            "cite_spans": [],
            "section": "4.3 Infecties bij pati\u00ebnten met hiv-infectie ::: 4 Chronische longklachten bij pati\u00ebnten met immunosuppressie (tabel #!start#24.1#!sep#Tab1#!sep#table#!end#)",
            "ref_spans": []
        },
        {
            "text": "Een belangrijke, niet aan de tropen gerelateerde longafwijking bij deze pati\u00ebnten is\nPneumocystis jiroveci-pneumonie (PCP). Bij infectie door atypische mycobacteri\u00ebn, met name\nM. avium intracellulare is, naast longinfectie, infectie mogelijk in allerlei andere organen (darm, beenmerg, lymfeklieren, botten). Het risico op deze infectie in de tropen is waarschijnlijk beperkt. Precieze gegevens ontbreken echter.",
            "cite_spans": [],
            "section": "4.3 Infecties bij pati\u00ebnten met hiv-infectie ::: 4 Chronische longklachten bij pati\u00ebnten met immunosuppressie (tabel #!start#24.1#!sep#Tab1#!sep#table#!end#)",
            "ref_spans": []
        },
        {
            "text": "Diny Reiger, 27 jaar, zwom op vakantie in het Malawimeer. Vijf weken na terugkeer kreeg zij koorts tot 39\u00b0 C, een droge hoest die zij vroeger nooit had en gewrichtsklachten. Bij onderzoek van de longen werden piepende rhonchi en een verlengd expirium gehoord. Laboratoriumonderzoek toonde lichte eosinofilie (0,5 \u00d7 109/l); de schistosoma-serologie was positief: IFA > 1: 1024 en ELISA 1: 128. De thoraxfoto toonde vlekkige infiltraten over beide longvelden. Onder de diagnose katayamasyndroom met longpassage van larven van schistosomen werd pati\u00ebnte behandeld met praziquantel 40 mg/kg eenmalig. Zij kreeg hierop een jeukende huiduitslag, hevige pijn in botten en gewrichten en eosinofilie van 4,1 \u00d7 109/l. Na zes dagen verdwenen deze klachten, de eosinofilie daalde tot 0,7 en later tot 0,2 \u00d7 109/l. Na drie weken was pati\u00ebnte klachtenvrij en was de thoraxfoto genormaliseerd.",
            "cite_spans": [],
            "section": "Casus 4 ::: 5.1 Migrerende larven ::: 5 Piepende ademhaling, eosinofilie en vluchtige longinfiltraten (tabel #!start#24.1#!sep#Tab1#!sep#table#!end#)",
            "ref_spans": []
        },
        {
            "text": "Een droge hoest met aanwijzingen voor bronchospasme met vluchtige longafwijkingen die na enkele weken weer verdwenen zijn, met in het bloed eosinofilie, kan bij personen die recent uit de tropen zijn teruggekeerd wijzen op door de long migrerende larven. De worminfectie is dan pas enkele weken geleden opgetreden (uitzondering: strongyloidiasis, zie de casus). De infectie kan zijn verworven door ingestie van eieren (Ascaris, Toxocara), via penetratie van larven door de huid (via watercontact door schistosomen zoals bij Diny in casus 4 of via de grond: mijnworm,\nStrongyloides) of via een insect (Filaria). Bij schistosomiasis wordt dit invasiestadium van de infectie katayamasyndroom genoemd. Kenmerkend hiervoor is de trias koorts, eosinofilie en urticaria. Een positieve\nSchistosoma-serologie bevestigt de diagnose. Behandeling van dit stadium is in feite niet nodig, en kan zelfs tot een heftige reactie op vrijgekomen wormantigeen leiden (casus 4). Wordt behandeling in dit stadium nodig geacht, dan wordt praziquantel in combinatie met een korte prednisonkuur aangeraden. Zijn de klinische verschijnselen van het invasiestadium wegge\u00ebbd, dan moet (na drie tot zes maanden) nogmaals praziquantel 40 mg/kg eenmalig gegeven worden, omdat de effectiviteit van dit middel tegen larven van schistosomen beperkt is. Andere worminfecties worden behandeld volgens de richtlijnen.",
            "cite_spans": [],
            "section": "Casus 4 ::: 5.1 Migrerende larven ::: 5 Piepende ademhaling, eosinofilie en vluchtige longinfiltraten (tabel #!start#24.1#!sep#Tab1#!sep#table#!end#)",
            "ref_spans": []
        },
        {
            "text": "Klachten over piepende ademhaling (wheezing) en benauwdheid kunnen uiteraard ook berusten op verergering van een bestaande astma bronchiale.",
            "cite_spans": [],
            "section": "5.2 Overige oorzaken ::: 5 Piepende ademhaling, eosinofilie en vluchtige longinfiltraten (tabel #!start#24.1#!sep#Tab1#!sep#table#!end#)",
            "ref_spans": []
        },
        {
            "text": "Zijn de klachten recent na een tropenreis ontstaan en toont aanvullend onderzoek eosinofilie en vluchtige longafwijkingen, dan berusten ze in bijna alle gevallen op het larvenstadium van een wormziekte. Hiernaast spelen bij het ontstaan van de ziekteverschijnselen circulerende immuuncomplexen een rol, in ieder geval bij het katayamasyndroom. Het beschreven klinische beeld komt voor bij schistosomiasis (casus 4), ascariasis (l\u00f6fflersyndroom), strongyloidiasis, mijnworminfectie, toxocariasis (viscerale larva migrans) en tropische pulmonale eosinofilie door lymfatische filariasis.",
            "cite_spans": [],
            "section": "5.2 Overige oorzaken ::: 5 Piepende ademhaling, eosinofilie en vluchtige longinfiltraten (tabel #!start#24.1#!sep#Tab1#!sep#table#!end#)",
            "ref_spans": []
        },
        {
            "text": "In zeldzame gevallen kunnen bij toxocariasis, tropische pulmonale eosinofilie, schistosomiasis en mogelijk ook bij strongyloidiasis persisterende granulomateuze en later fibrotische longafwijkingen voorkomen.",
            "cite_spans": [],
            "section": "5.2 Overige oorzaken ::: 5 Piepende ademhaling, eosinofilie en vluchtige longinfiltraten (tabel #!start#24.1#!sep#Tab1#!sep#table#!end#)",
            "ref_spans": []
        },
        {
            "text": "Uiteraard moet bij het beschreven klinische beeld ook met niet aan de tropen gerelateerde afwijkingen rekening worden gehouden, maar meestal bestonden deze al eerder. Voorbeelden zijn het churg-strausssyndroom (allergische pulmonale granulomatose) en bronchopulmonale aspergillose.",
            "cite_spans": [],
            "section": "5.2 Overige oorzaken ::: 5 Piepende ademhaling, eosinofilie en vluchtige longinfiltraten (tabel #!start#24.1#!sep#Tab1#!sep#table#!end#)",
            "ref_spans": []
        }
    ],
    "ref_entries": {},
    "back_matter": [],
    "bib_entries": {
        "BIBREF0": {
            "title": "Incidence of Respiratory Viruses Among Travelers With a Febrile Syndrome Returning From Tropical and Subtropical Areas",
            "authors": [
                {
                    "first": "M",
                    "middle": [],
                    "last": "Camps",
                    "suffix": ""
                }
            ],
            "year": 2008,
            "venue": "J of Med Virol",
            "volume": "80",
            "issn": "",
            "pages": "711-5",
            "other_ids": {
                "DOI": [
                    "10.1002/jmv.21086"
                ]
            }
        },
        "BIBREF1": {
            "title": "",
            "authors": [],
            "year": 2010,
            "venue": "Principles and practice of infectious diseases.",
            "volume": "",
            "issn": "",
            "pages": null,
            "other_ids": {
                "DOI": []
            }
        },
        "BIBREF2": {
            "title": "Prevention of strongyloides hyperinfection syndrome: A rheumatological point of view",
            "authors": [
                {
                    "first": "CH",
                    "middle": [],
                    "last": "Mittermayer",
                    "suffix": ""
                }
            ],
            "year": 2009,
            "venue": "Eur J Internal Med",
            "volume": "20",
            "issn": "",
            "pages": "744-8",
            "other_ids": {
                "DOI": [
                    "10.1016/j.ejim.2009.09.001"
                ]
            }
        },
        "BIBREF3": {
            "title": "Influenza Virus Infection in Travelers to Tropical and Subtropical Countries",
            "authors": [
                {
                    "first": "M",
                    "middle": [],
                    "last": "Mutsch",
                    "suffix": ""
                }
            ],
            "year": 2005,
            "venue": "Clin Infect Dis",
            "volume": "40",
            "issn": "",
            "pages": "1282-7",
            "other_ids": {
                "DOI": [
                    "10.1086/429243"
                ]
            }
        },
        "BIBREF4": {
            "title": "Leptospirose in 2006: bijna de helft werd in Nederland opgelopen",
            "authors": [],
            "year": 2007,
            "venue": "Infectieziekten Bulletin",
            "volume": "18",
            "issn": "11",
            "pages": "402-3",
            "other_ids": {
                "DOI": []
            }
        },
        "BIBREF5": {
            "title": "Lung diseases in the tropics. Part 1. Tropical granulo-matous disorders of the lung: diagnosis and management.",
            "authors": [
                {
                    "first": "OP",
                    "middle": [],
                    "last": "Sharma",
                    "suffix": ""
                },
                {
                    "first": "A",
                    "middle": [],
                    "last": "Maheshwari",
                    "suffix": ""
                }
            ],
            "year": 1993,
            "venue": "Tuberc Lung Dis",
            "volume": "74",
            "issn": "",
            "pages": "295-304",
            "other_ids": {
                "DOI": [
                    "10.1016/0962-8479(93)90103-5"
                ]
            }
        },
        "BIBREF6": {
            "title": "Lung diseases in the tropics. Part 2. Common tropical lung diseases: diagnosis and management.",
            "authors": [
                {
                    "first": "OP",
                    "middle": [],
                    "last": "Sharma",
                    "suffix": ""
                },
                {
                    "first": "A",
                    "middle": [],
                    "last": "Maheshwari",
                    "suffix": ""
                }
            ],
            "year": 1993,
            "venue": "Tuberc Lung Dis",
            "volume": "74",
            "issn": "",
            "pages": "359-70",
            "other_ids": {
                "DOI": [
                    "10.1016/0962-8479(93)90078-C"
                ]
            }
        },
        "BIBREF7": {
            "title": "",
            "authors": [
                {
                    "first": "GT",
                    "middle": [],
                    "last": "Strickland",
                    "suffix": ""
                }
            ],
            "year": 2000,
            "venue": "Hunter\u2019 s Tropical medicine and infectious diseases.",
            "volume": "",
            "issn": "",
            "pages": null,
            "other_ids": {
                "DOI": []
            }
        },
        "BIBREF8": {
            "title": "Avian Influenza A (H5N1) in 10 patients in Vietnam",
            "authors": [
                {
                    "first": "TH",
                    "middle": [],
                    "last": "Tran",
                    "suffix": ""
                }
            ],
            "year": 2004,
            "venue": "N Engl J Med",
            "volume": "350",
            "issn": "12",
            "pages": "1179-88",
            "other_ids": {
                "DOI": [
                    "10.1056/NEJMoa040419"
                ]
            }
        },
        "BIBREF9": {
            "title": "Respiratory infections unique to Asia",
            "authors": [
                {
                    "first": "KW",
                    "middle": [],
                    "last": "Tsang",
                    "suffix": ""
                }
            ],
            "year": 2008,
            "venue": "Respirology",
            "volume": "13",
            "issn": "",
            "pages": "937-49",
            "other_ids": {
                "DOI": [
                    "10.1111/j.1440-1843.2008.01409.x"
                ]
            }
        },
        "BIBREF10": {
            "title": "Strongyloides stercoralis: een goedaardige parasiet met enkele kwaadaardige karaktertrekken",
            "authors": [
                {
                    "first": "JCM",
                    "middle": [],
                    "last": "Vetter",
                    "suffix": ""
                },
                {
                    "first": "T",
                    "middle": [],
                    "last": "van Gool",
                    "suffix": ""
                }
            ],
            "year": 1999,
            "venue": "Ned Tijdschr Med Microbiol",
            "volume": "7",
            "issn": "",
            "pages": "48-52",
            "other_ids": {
                "DOI": []
            }
        },
        "BIBREF11": {
            "title": "Hantaviruses underestimated pulmonary viruses?",
            "authors": [
                {
                    "first": "J",
                    "middle": [],
                    "last": "Clement",
                    "suffix": ""
                }
            ],
            "year": 2008,
            "venue": "Clin Infectious Dis",
            "volume": "46",
            "issn": "3",
            "pages": "477-9",
            "other_ids": {
                "DOI": [
                    "10.1086/524896"
                ]
            }
        },
        "BIBREF12": {
            "title": "Clinical spectrum of pulmonary involvement in leptospirosis in a region of endemicity, with quantification of leptospiral burden",
            "authors": [
                {
                    "first": "ER",
                    "middle": [],
                    "last": "Segura",
                    "suffix": ""
                }
            ],
            "year": 2005,
            "venue": "Clin Infectious Dis",
            "volume": "40",
            "issn": "3",
            "pages": "343-51",
            "other_ids": {
                "DOI": [
                    "10.1086/427110"
                ]
            }
        },
        "BIBREF13": {
            "title": "Risk of infection with Mycobacterium tuberculosis among travellers to areas of high tuberculosis en-demicity",
            "authors": [
                {
                    "first": "FG",
                    "middle": [],
                    "last": "Cobelens",
                    "suffix": ""
                },
                {
                    "first": "H",
                    "middle": [],
                    "last": "van Deutekom",
                    "suffix": ""
                },
                {
                    "first": "JW",
                    "middle": [],
                    "last": "Draayer-Jansen",
                    "suffix": ""
                }
            ],
            "year": 2000,
            "venue": "Lancet",
            "volume": "356",
            "issn": "9228",
            "pages": "461-5",
            "other_ids": {
                "DOI": [
                    "10.1016/S0140-6736(00)02554-X"
                ]
            }
        },
        "BIBREF14": {
            "title": "Emergence of a novel Swine-origin influenza A virus (H1N1) in humans",
            "authors": [
                {
                    "first": "FS",
                    "middle": [],
                    "last": "Dawood",
                    "suffix": ""
                }
            ],
            "year": 2009,
            "venue": "N Engl J Med",
            "volume": "360",
            "issn": "25",
            "pages": "2605-15",
            "other_ids": {
                "DOI": [
                    "10.1056/NEJMoa0903810"
                ]
            }
        },
        "BIBREF15": {
            "title": "Evaluation of two ELISA and two indirect haemagglutination tests for serodiagnosis of pulmonary hydatid disease",
            "authors": [
                {
                    "first": "F",
                    "middle": [],
                    "last": "Eris",
                    "suffix": ""
                }
            ],
            "year": 2009,
            "venue": "Korean J Parasitol",
            "volume": "47",
            "issn": "4",
            "pages": "427-9",
            "other_ids": {
                "DOI": [
                    "10.3347/kjp.2009.47.4.427"
                ]
            }
        },
        "BIBREF16": {
            "title": "A variety of respiratory viruses found in symptomatic travellers returning from countries with ongoing spread of the new influenza A(H1N1)v virus strain",
            "authors": [
                {
                    "first": "P",
                    "middle": [],
                    "last": "Follin",
                    "suffix": ""
                }
            ],
            "year": 2009,
            "venue": "Eurosurveillance",
            "volume": "18",
            "issn": "",
            "pages": null,
            "other_ids": {
                "DOI": []
            }
        },
        "BIBREF17": {
            "title": "",
            "authors": [],
            "year": null,
            "venue": "",
            "volume": "",
            "issn": "",
            "pages": null,
            "other_ids": {
                "DOI": []
            }
        },
        "BIBREF18": {
            "title": "",
            "authors": [],
            "year": null,
            "venue": "",
            "volume": "",
            "issn": "",
            "pages": null,
            "other_ids": {
                "DOI": []
            }
        },
        "BIBREF19": {
            "title": "Respiratory Tract Infections in Travelers: A Review of the GeoSentinel Surveillance Network",
            "authors": [
                {
                    "first": "K",
                    "middle": [],
                    "last": "Leder",
                    "suffix": ""
                }
            ],
            "year": 2003,
            "venue": "Clinical Infect Dis",
            "volume": "36",
            "issn": "",
            "pages": "399-406",
            "other_ids": {
                "DOI": [
                    "10.1086/346155"
                ]
            }
        }
    }
}