{
    "paper_id": "51c9ca7304e2b96993fe77980430b6bc31b7098b",
    "metadata": {
        "title": "Hochsicherheitslabor 36",
        "authors": [
            {
                "first": "Udo",
                "middle": [
                    "Josef"
                ],
                "last": "Weber",
                "suffix": "",
                "affiliation": {
                    "laboratory": "",
                    "institution": "Weber und Partner GmbH",
                    "location": {
                        "settlement": "K\u00f6ln",
                        "country": "Deutschland"
                    }
                },
                "email": ""
            }
        ]
    },
    "abstract": [],
    "body_text": [
        {
            "text": "Aus einer Pressever\u00f6ffentlichung 1 der Philipps-Universit\u20ac at Marburg (Auszug): \"Das epidemische Auftreten hochpathogener Viren ist von gro\u00dfer gesundheitspolitischer Bedeutung. Die Gefahren, die von solchen Epidemien f\u20ac ur das Gesundheitssystem ausgehen, m\u20ac ussen nach Ma\u00dfnahmen des \u00f6ffentlichen Gesundheitsdienstes einged\u20ac ammt werden. Von gr\u00f6\u00dfter Bedeutung ist aber, die ausl\u00f6senden Viren schnell zu diagnostizieren, um damit eine Grundlage f\u20ac ur m\u00f6gliche Quarant\u20ac anema\u00dfnahmen und eventuelle Therapien zu erhalten. Gleichzeitig ist die Erforschung von hochpathogenen Viren essenziell, um m\u00f6gliche Ziele f\u20ac ur antivirale Therapien und Impfstoffe zu identifizieren. [. . .] Die Untersuchungen in dem BSL-4-Labor umfassen auf der einen Seite Diagnostik von importierten Infektionen (Lassa-, Marburg-und Ebolavirus), von neu auftretenden hochpathogenen Viren (wie im Jahr 2003 das SARS-CoV) und von Viren, die f\u20ac ur bioterroristische Zwecke eingesetzt werden k\u00f6nnen. Auf der anderen Seite werden hochpathogene Viren hinsichtlich ihrer Vermehrungsmechanismen erforscht, um Strategien zur Pr\u20ac avention und Therapien, der durch die Viren hervorgerufenen Erkrankungen, zu entwickeln. [. . .] Ziel der Arbeiten im BSL-4-Labor ist somit die Erforschung hochpathogener Viren zu diagnostischen, therapeutischen und pr\u20ac aventiven Zwecken.\"",
            "cite_spans": [
                {
                    "start": 667,
                    "end": 674,
                    "text": "[. . .]",
                    "ref_id": null
                },
                {
                    "start": 1179,
                    "end": 1186,
                    "text": "[. . .]",
                    "ref_id": null
                }
            ],
            "ref_spans": [],
            "section": "Einleitung: Notwendigkeit von Forschungslaboren"
        },
        {
            "text": "Vor dem Hintergrund der Ebolaepidemie 2014/2015 ist der Text selbsterkl\u20ac arend.",
            "cite_spans": [],
            "ref_spans": [],
            "section": "Einleitung: Notwendigkeit von Forschungslaboren"
        },
        {
            "text": "Mikrobiologische Labore werden als Hochsicherheitslabore bezeichnet, wenn eine besondere Schutzaufgabe erf\u20ac ullt werden muss. Allgemein l\u20ac asst sich feststellen: Je gef\u20ac ahrlicher der Erreger, desto h\u00f6her die Schutzstufe! An den in der Natur vorkommenden Erregern wird geforscht, um Ausbreitungen von Krankheiten vermeiden oder eind\u20ac ammen zu k\u00f6nnen. Auch sind gentechnische Untersuchungen und Ver\u20ac anderungen an nat\u20ac urlich auftretenden Erregern notwendig. Bei den nat\u20ac urlichen, nicht gentechnisch ver\u20ac anderten Erregern findet die Einstufung der Schutzma\u00dfnahmen durch die Einteilung in Risikogruppen und durch eine Gef\u20ac ahrdungsanalyse statt.",
            "cite_spans": [],
            "ref_spans": [],
            "section": "Allgemeine Erl\u20ac auterung Hochsicherheitslabore"
        },
        {
            "text": "Die notwendigen Schutzma\u00dfnahmen im Umgang mit den Erregern regelt die BioStoffV (Verordnung \u20ac uber Sicherheit und Gesundheitsschutz bei T\u20ac atigkeiten mit biologischen Arbeitsstoffen) und nachgeschaltet verschiedene TRBA (Technische Regeln f\u20ac ur biologische Arbeitsstoffe). Sobald gentechnische Ver\u20ac anderungen an den Erregern vorgenommen werden, kommt das Gentechnikgesetz (GenTG) sowie die GenTSV (Verordnung \u20ac uber die Sicherheitsstufen und Sicherheitsma\u00dfnahmen bei gentechnischen Arbeiten in gentechnischen Anlagen) mit den Anh\u20ac angen I bis IV zur Anwendung.",
            "cite_spans": [],
            "ref_spans": [],
            "section": "Allgemeine Erl\u20ac auterung Hochsicherheitslabore"
        },
        {
            "text": "Biologische Stoffe, insbesondere Mikroorganismen, werden \u20ac uber eine Gef\u20ac ahrdungsbeurteilung in eine Schutzstufe, die sogenannte biologische Schutzstufe, eingeordnet. Die EU-Richtlinie 2000/54/EG ist in Europa g\u20ac ultig, somit auch in Deutschland. Diese Richtlinie regelt den Schutz der Arbeitnehmer gegen Gef\u20ac ahrdung durch biologische Arbeitsstoffe. Vergleichbare Einteilungen gibt es auch in den USA und anderen L\u20ac andern.",
            "cite_spans": [],
            "ref_spans": [],
            "section": "Biologische Schutzstufen allgemein"
        },
        {
            "text": "Entsprechend der Gef\u20ac ahrdung werden die Erreger in vier Schutzstufen eingeteilt. Schutzstufe 4 hat die h\u00f6chsten Anforderungen.",
            "cite_spans": [],
            "ref_spans": [],
            "section": "Biologische Schutzstufen allgemein"
        },
        {
            "text": "Biostoffverordnung (BioStoffV) Die BioStoffV setzt mehrere EG-Richtlinien um. Unterschieden wird in gezielte und nicht gezielte T\u20ac atigkeiten ( \u00a7 2 Bio-StoffV). In \u00a7 3 der BioStoffV wird diese Einstufung vorgenommen. Je h\u00f6her die Risikogruppe desto h\u00f6her die Schutzaufwendungen und umso aufwendiger der Bau und der Betrieb solcher Anlagen (Labore, Produktionsst\u20ac atten, Tierhaltungen, Gew\u20ac achsh\u20ac auser, Aquarien). Grunds\u20ac atzlich regeln die Richtlinien 90/679/EWG und 2000/54/EG die Einstufung in die Risikogruppen.",
            "cite_spans": [],
            "ref_spans": [],
            "section": "2.1.1"
        },
        {
            "text": "Ausschuss f\u00fcr biologische Arbeitsstoffe (ABAS) Der Ausschuss ber\u20ac at das Bundesministerium f\u20ac ur Arbeit und Soziales und untersteht der Bundesanstalt f\u20ac ur Arbeitsschutz und Arbeitsmedizin. Zum Arbeitsgebiet der Arbeitsgruppe geh\u00f6ren u. a. die wissenschaftliche Bewertung von biologischen Arbeitsstoffen und die Einstufung dieser in die entsprechenden Risikogruppen. In den Technische Regeln f\u20ac ur biologische Arbeitsstoffe (TRBA) werden Regeln vorgegeben und Einstufungen von Bakterien, Viren, Pilzen, Parasiten und Zellkulturen vorgenommen. Ist ein Biostoff nicht in den TRBA aufgef\u20ac uhrt oder in einem Ministerialblatt ver\u00f6ffentlicht, ist noch keine Einstufung erfolgt. In diesem Fall ist durch den Arbeitgeber die Einstufung vorzunehmen ( \u00a7 3 BioStoffV).",
            "cite_spans": [],
            "ref_spans": [],
            "section": "2.1.2"
        },
        {
            "text": "Risikogruppe 1: Biostoffe, bei denen unwahrscheinlich ist, dass sie bei Menschen eine Krankheit hervorrufen. Beispielhafte Erreger sind:",
            "cite_spans": [],
            "ref_spans": [],
            "section": "Risikogruppen nach \u00a7 3 BioStoffV mit Beispielen"
        },
        {
            "text": "\u2022 B\u20ac ackerhefe (Saccharomyces) \u2022 Joghurt Bakterien (Lactobacillus) \u2022 Zwingerhusten (Canine Adenovirus) Bestehen Zweifel dar\u20ac uber, welche Sicherheitsstufe f\u20ac ur die vorgeschlagene gentechnische Arbeit angemessen ist, so ist die gentechnische Arbeit der h\u00f6heren Sicherheitsstufe zuzuordnen. Im Einzelfall kann die zust\u20ac andige Beh\u00f6rde auf Antrag Sicherheitsma\u00dfnahmen einer niedrigeren Sicherheitsstufe zulassen, wenn ein ausreichender Schutz f\u20ac ur die menschliche Gesundheit und Umwelt nachgewiesen wird.",
            "cite_spans": [],
            "ref_spans": [],
            "section": "Risikogruppen nach \u00a7 3 BioStoffV mit Beispielen"
        },
        {
            "text": "Genehmigung, Anzeige und Anmeldung von gentechnischen Anlagen und erstmaligen gentechnischen Arbeiten Gentechnische Arbeiten d\u20ac urfen nur in gentechnischen Anlagen durchgef\u20ac uhrt werden. Die Errichtung und Inbetriebgehung der technischen Anlagen, in denen gentechnische Arbeiten der Sicherheitsstufe 3 und 4 durchgef\u20ac uhrt werden sollen, bed\u20ac urfen der Genehmigung (Anlagengenehmigung). Die Genehmigung berechtigt zur Durchf\u20ac uhrung der im Genehmigungsbescheid genannten Arbeiten. Die Genehmigung kann auf Antrag erteilt werden f\u20ac ur \u2022 die Errichtung einer gentechnischen Anlage oder des Teils einer solchen Anlage,",
            "cite_spans": [],
            "ref_spans": [],
            "section": "2.2.4"
        },
        {
            "text": "\u2022 die Errichtung und den Betrieb des Teils einer gentechnischen Anlage.",
            "cite_spans": [],
            "ref_spans": [],
            "section": "2.2.4"
        },
        {
            "text": "Wesentliche \u00c4nderungen der Lage, der Beschaffenheit oder des Betriebs einer gentechnischen Anlage, in der gentechnische Arbeiten der Sicherheitsstufe 3 oder 4 durchge-f\u20ac uhrt werden sollen, bed\u20ac urfen einer Anlagengenehmigung.",
            "cite_spans": [],
            "ref_spans": [],
            "section": "2.2.4"
        },
        {
            "text": "Sollen in einer gentechnischen Anlage der Sicherheitsstufe 3 und 4 weitere gentechnische Arbeiten durchgef\u20ac uhrt werden, die nicht im Antrag benannt sind, bedarf dies einer gesonderten Genehmigung.",
            "cite_spans": [],
            "ref_spans": [],
            "section": "2.2.4"
        },
        {
            "text": "Genehmigungsverfahren Das Genehmigungsverfahren setzt einen schriftlichen Antrag voraus. Einem Antrag auf Genehmigung einer gentechnischen Anlage sind die Unterlagen beizuf\u20ac ugen, die zur Pr\u20ac ufung der Voraussetzung der Genehmigung, einschlie\u00dflich der nach \u00a7 22 Abs. 1 des Gentechnikgesetzes umfassten beh\u00f6rdlichen Entscheidungen, erforderlich sind. Die Unterlagen m\u20ac ussen insbesondere folgende Angaben und Anlagen enthalten:",
            "cite_spans": [],
            "ref_spans": [],
            "section": "2.2.5"
        },
        {
            "text": "1. Lage der gentechnischen Anlage sowie Name und Anschrift des Betreibers. 2. Name des Projektleiters unter Einbeziehung des Nachweises der erforderlichen Sachkunde. 3. Die Namen des/der Beauftragten f\u20ac ur die biologische Sicherheit sowie den Nachweis der erforderlichen Sachkunde. 4. Beschreibung der bestehenden oder der geplanten gentechnischen Anlage und ihres Betriebs, insbesondere der f\u20ac ur die Sicherheit und den Arbeitsschutz bedeutsamen Einrichtungen und Vorkehrungen. 5. Risikobewertung nach \u00a7 6 Abs. 1 Gentechnikgesetzes und einer Beschreibung der vorgesehenen gentechnischen Arbeiten, aus der sich die Eigenschaft und die verwendeten Spender-und Empf\u20ac angerorganismen oder die Ausgangsorganismen oder ggf. verwendete Wirtsvektorsysteme sowie deren Vektoren und des gentechnisch ver\u20ac anderten Organismus im Hinblick auf die erforderliche Sicherheitsstufe zu ersehen sind. 6. Beschreibung der verf\u20ac ugbaren Techniken zur Erfassung, Identifizierung und \u00dcberwachung des gentechnisch ver-\u20ac anderten Organismus. 7. Angaben \u20ac uber Anzahl und Ausbildung des Personals.",
            "cite_spans": [],
            "ref_spans": [],
            "section": "2.2.5"
        },
        {
            "text": "Notfallpl\u20ac ane und Angaben \u20ac uber Ma\u00dfnahmen zur Vermeidung von Unf\u20ac allen und Betriebsst\u00f6rungen. 8. Information \u20ac uber die Abfall-und Abwasserentsorgung.",
            "cite_spans": [],
            "ref_spans": [],
            "section": "2.2.5"
        },
        {
            "text": "Die baulichen Durchf\u20ac uhrungen werden im Wesentlichen durch die GenTSV (Gentechniksicherheitsverordnung) festgelegt. Diese Verordnung regelt die Sicherheitsanforderun-gen an gentechnischen Arbeiten in gentechnischen Anlagen, einschlie\u00dflich der T\u20ac atigkeit im Gefahrenbereich. Die Regelungen f\u20ac ur die Freisetzungen werden im Folgenden nicht weiter beachtet.",
            "cite_spans": [],
            "ref_spans": [],
            "section": "2.2.5"
        },
        {
            "text": "Die gentechnischen Arbeiten in den gentechnischen Anlagen sind nach Ma\u00dfgabe der \u00a7 \u00a7 4-7 in die in \u00a7 7 Abs. 1 Gentechnikgesetz genannten Sicherheitsstufen zuzuordnen.",
            "cite_spans": [],
            "ref_spans": [],
            "section": "2.2.5"
        },
        {
            "text": "Gesetze und Verordnungen Die Vorgaben f\u20ac ur die Errichtung, Planung und den Betrieb von Hochsicherheitslaboren sind, obwohl umfangreich, nur in wenigen Punkten konkret. Im Folgenden eine Auswahl von Gesetzen und Verordnungen, die sich in den Inhalten teilweise gleichen, sich aber auch widersprechen: Der Vollst\u20ac andigkeit halber sei erw\u20ac ahnt, dass in der Tiermedizin \u20ac ahnliche Sicherheitsanforderungen nach entsprechender Gef\u20ac ahrdungsanalyse umzusetzen sind. In diesem Fall wird nicht weiter darauf eingegangen.",
            "cite_spans": [],
            "ref_spans": [],
            "section": "2.2.6"
        },
        {
            "text": "In der Anlagenbetriebsgenehmigung unterscheidet man grunds\u20ac atzlich zwei Teilgenehmigungen (Abb. 1). \u00dcblicherweise wird vor der Einrichtung von Bauvorhaben eine Baugenehmigung (Errichtergenehmigung) eingereicht und vor der Inbetriebnahme der eigentlichen gentechnischen Anlagen die Betriebsgenehmigung. Je nach Nutzung und Kom-plexibilit\u20ac at des Vorhabens sind zus\u20ac atzliche Teilgenehmigungen einzuholen, z. B. L\u20ac uftungs-und Entw\u20ac asserungsgesuche. Die Bearbeitungstiefe der Betriebsgenehmigung (k\u20ac unftig als Anlagenbetriebsgenehmigung bezeichnet) ist wesentlich h\u00f6her und umfangreicher. Die Genehmigungsbeh\u00f6rden sind je nach Land unterschiedlich, z. B. Regierungspr\u20ac asident, Landesamt f\u20ac ur Gesundheit und Soziales.",
            "cite_spans": [],
            "ref_spans": [],
            "section": "Genehmigungen"
        },
        {
            "text": "Es gibt nach Absprache mit der Genehmigungsbeh\u00f6rde in der Regel ein sogenanntes konzentriertes Verfahren. Die zu-st\u20ac andige Genehmigungsbeh\u00f6rde \u20ac ubernimmt dann die Aufgabe der Beh\u00f6rdenkoordination w\u20ac ahrend der Betriebsgenehmigungsphase und wichtet unterschiedliche Bestimmungen nach der sicherheitstechnischen Priorit\u20ac at. Je nach Land wirken zwischen 10 und 15 Einzelbeh\u00f6rden im Genehmigungsverfahren mit. Auch wenn in einem konzentrierten Verfahren das Bauen wieder losgel\u00f6st betrachtet wird (z. B. Errichtergenehmigung), ist es ratsam, die Genehmigungsfragen f\u20ac ur den Gesamtprozess zeitnah zu kl\u20ac aren (Integrative Bewertung).",
            "cite_spans": [],
            "ref_spans": [],
            "section": "Genehmigungen"
        },
        {
            "text": "H\u20ac aufig haben Fragen der Hygieneplanung Auswirkungen auf die Logistik und Organisation, die wiederum Bauausf\u20ac uhrungen bestimmen, z. B. Zutrittsberechtigung, Material-qualit\u20ac at, Ver-und Entsorgungseinrichtungen, Anlagenverschaltungen.",
            "cite_spans": [],
            "ref_spans": [],
            "section": "Genehmigungen"
        },
        {
            "text": "Neben der vertiefenden Betrachtung zur Betriebsgenehmigung, was Hygiene-und Begasungskonzept, Gefahrenabwehr-und Entfluchtungsplanung sowie Feuerwehreinsatzplanung anbelangt, m\u20ac ussen Fragen der biologischen Sicherheit ber\u20ac ucksichtigt werden. Der Gesetzgeber hat die Zentrale Kommission f\u20ac ur biologische Sicherheitsfragen (ZKBS) eingerichtet, die u. a. die bauliche und technische Einrichtungen (hier: Planung) beurteilt. Diese Kommission hat zwar im Genehmigungsprozess nur eine beratende Funktion (baulicher Teil), ihre Empfehlungen werden jedoch in der Regel umgesetzt.",
            "cite_spans": [],
            "ref_spans": [],
            "section": "Genehmigungen"
        },
        {
            "text": "Zu beachten ist im Genehmigungsverfahren auch, dass h\u20ac aufig die biologische Grenze (Containmentgrenze) nicht den baulich geforderten F90-Abschluss bilden kann (Abb. 2 Alle Einbautenwie Fenster, T\u20ac uren, Durchdringungen, Kan\u20ac ale bis zum Schwebstofffiltergeh\u20ac auseunterliegen den Dichtigkeits-und Best\u20ac andigkeitsanforderungen. Die Fl\u20ac achensumme aller \"L\u00f6cher\" f\u20ac ur diese Beispiele betr\u20ac agt 3,1 mm 2 .",
            "cite_spans": [
                {
                    "start": 160,
                    "end": 167,
                    "text": "(Abb. 2",
                    "ref_id": null
                }
            ],
            "ref_spans": [],
            "section": "Genehmigungen"
        },
        {
            "text": "Grunds\u20ac atzlich sind zwei Ausf\u20ac uhrungsvarianten m\u00f6glich:",
            "cite_spans": [],
            "ref_spans": [],
            "section": "Genehmigungen"
        },
        {
            "text": "\u2022 Beton (beschichtet)",
            "cite_spans": [],
            "ref_spans": [],
            "section": "Genehmigungen"
        },
        {
            "text": "\u2022 Edelstahl (geschraubt oder geschwei\u00dft).",
            "cite_spans": [],
            "ref_spans": [],
            "section": "Genehmigungen"
        },
        {
            "text": "Gute Erfahrungen hinsichtlich Flexibilit\u20ac at und Dichtigkeit liegen mit geschraubten Edelstahlcontainments vor (Abb. 3, 4, 5, 6 und 7) .",
            "cite_spans": [
                {
                    "start": 111,
                    "end": 119,
                    "text": "(Abb. 3,",
                    "ref_id": null
                },
                {
                    "start": 120,
                    "end": 122,
                    "text": "4,",
                    "ref_id": null
                },
                {
                    "start": 123,
                    "end": 125,
                    "text": "5,",
                    "ref_id": null
                },
                {
                    "start": 126,
                    "end": 134,
                    "text": "6 und 7)",
                    "ref_id": null
                }
            ],
            "ref_spans": [],
            "section": "Genehmigungen"
        },
        {
            "text": "Die Anforderungen an die Dichtigkeit f\u20ac ur BSL-3-Labore ist nicht eindeutig geregelt (begasbar!). In der Praxis stellt die Organisation die Anforderung an die Dichtigkeit, wie beispielsweise:",
            "cite_spans": [],
            "ref_spans": [],
            "section": "Genehmigungen"
        },
        {
            "text": "\u2022 K\u00f6nnen R\u20ac aume, die sich um den zu begasenden Raum befinden, im Betrieb ger\u20ac aumt werden? \u2022 Wie h\u20ac aufig wird begast, und wie hoch wird der Aufwand f\u20ac ur Vorbereitung und Durchf\u20ac uhrung akzeptiert? \u2022 Sind Erreger luftg\u20ac angig? \u2022 Kann auch bei St\u00f6rungen der Unterdruck realisiert werden?",
            "cite_spans": [],
            "ref_spans": [],
            "section": "Genehmigungen"
        },
        {
            "text": "Es ist ratsam, diese Fragen mit dem Nutzer zu kl\u20ac aren, damit eine Festlegung der Bauanforderungen erfolgen kann. Hinsichtlich Materialbest\u20ac andigkeit bestehen die gleichen Anforderungen.",
            "cite_spans": [],
            "ref_spans": [],
            "section": "Genehmigungen"
        },
        {
            "text": "Die raumlufttechnischen Anlagen (RLT-Anlagen) geh\u00f6ren neben dem baulichen Containment zu den wichtigen sicherheitsrelevanten Einrichtungen. Die Anlagen f\u20ac uhren die thermischen Lasten ab, stellen die klimatischen Bedingungen auch f\u20ac ur Versuchstiere sicher und regeln die Druckstufen.",
            "cite_spans": [],
            "ref_spans": [],
            "section": "Raumlufttechnische Anlagen"
        },
        {
            "text": "Die Zu-und Abluft f\u20ac ur BSL-4-Labore wird mit Schwebstofffiltern gesichert (Abb. 8) . Die Schwebstofffilter stellen die Barriere in der Abluft dar. Ihre einwandfreie Funktion ist von entscheidender Bedeutung. Deshalb stellen die Genehmigungsbeh\u00f6rden die Anforderung, die Funktion der Abluftfilter auch im laufenden Betrieb testen zu k\u00f6nnen. Dies betrifft nicht nur den Dichtsitz, sondern auch den R\u20ac uckhaltegrad. Dar\u20ac uber hinaus m\u20ac ussen die Filter und die Geh\u20ac ause sicher dekontaminiert werden k\u00f6nnen (durch Begasung). Entsprechende Nachweise sind zu f\u20ac uhren.",
            "cite_spans": [
                {
                    "start": 75,
                    "end": 83,
                    "text": "(Abb. 8)",
                    "ref_id": null
                }
            ],
            "ref_spans": [],
            "section": "Raumlufttechnische Anlagen"
        },
        {
            "text": "\u00dcblicherweise werden die Zu-und Abluftanlagen in BSL-4-Laboren, insbesondere, wenn auch noch Versuchstiere in den R\u20ac aumlichkeiten untergebracht sind, redundant ausgef\u20ac uhrt. Die Funktion der RLT-Anlage ist f\u20ac ur die Druckhaltung beim Ein-und Ausschleusen von Personen und Material zwingend erforderlich. Bei BSL-3-Laboren wird auf die Schwebstofffilter in der Zuluft verzichtet und der Abluftfilter als H14-Schwebstofffilter gefordert. In BSL-4-Laboren erfolgt eine doppelte Zuund Abluftfilterung mit Schwebstofffiltern in Serie (H13/H14). ",
            "cite_spans": [],
            "ref_spans": [],
            "section": "Raumlufttechnische Anlagen"
        },
        {
            "text": "Bei allen Laboren wird der Abwasseranfall minimiert. Betriebswasser wird f\u20ac ur die Versorgung der Dekontaminationsdusche und f\u20ac ur das Ansetzen von Desinfektionsfl\u20ac ussigkeit notwendig (Abb. 12 eine Durchreicheschleuse verlangt (Abb. 13 und 14) . Diese kann als Begasungsschleuse ausgef\u20ac uhrt werden oder als Tauchschleuse mit einer Desinfektionstrennfl\u20ac ussigkeit. Bei beiden Varianten sind \u00dcberwachungsmechanismen notwendig, um die jeweilige Einwirkzeit sicherstellen zu k\u00f6nnen. Auch ist die wechselseitige T\u20ac urverriegelung notwendig sowie die Pr\u20ac ufung der Konzentration bei einer Begasungsschleuse oder der Wirksamkeit der Trennfl\u20ac ussigkeit und Feststellung des Niveaus (H\u00f6henniveaus) der Trennfl\u20ac ussigkeit bei Tauchschleusen.",
            "cite_spans": [
                {
                    "start": 185,
                    "end": 193,
                    "text": "(Abb. 12",
                    "ref_id": null
                },
                {
                    "start": 228,
                    "end": 244,
                    "text": "(Abb. 13 und 14)",
                    "ref_id": null
                }
            ],
            "ref_spans": [],
            "section": "Betriebswasserversorgung"
        },
        {
            "text": "Die BioStoffV und GenTSV verlangen, dass Gro\u00dfger\u20ac ate sicher in die Labore ein-und ausgeschleust werden k\u00f6nnen. In der Regel werden diese Schleusen bei S3-und S4-Laboren ausgef\u20ac uhrt. Bei einem S3-Labor ist diese Anforderung nicht zwangsl\u20ac aufig notwendig, eine Abreinigung durch Luft sowie eine Oberfl\u20ac achendesinfektion des auszuschleusenden Produktes w\u20ac urden theoretisch reichen. In der Praxis ist es jedoch h\u20ac aufig so, dass eine Oberfl\u20ac achenreinigung von auszubringenden Ger\u20ac atschaften und Material nicht m\u00f6glich ist. Daher ist auch im S3-Labor eine Begasung zu empfehlen.",
            "cite_spans": [],
            "ref_spans": [],
            "section": "Gro\u00dfger\u20ac ate-Desinfektionskammer"
        },
        {
            "text": "Jedes BSL-3-und BSL-4-Labor muss nach GenTSV und BioStoffV einen Durchreicheautoklav haben (Abb. 15 ). Hierbei sind die besonderen Sicherheitsanforderungen an die Autoklaven zu ber\u20ac ucksichtigen. Nach Expertenmeinung muss die Abluft der Autoklaven \u20ac uber eine thermische Nachbehandlungseinheit gef\u20ac uhrt werden. Entwicklungen von Ge-r\u20ac ateherstellern erm\u00f6glichen die Realisierung dieser Forderung. Inwieweit diese zus\u20ac atzliche Sicherungsma\u00dfnahme sinnvoll ist, ist projektweise zu pr\u20ac ufen. Eine doppelte Absicherung, \u20ac ahnlich der RLT-Abluftanlage, mit zwei in Serie geschalteten Schwebstofffiltern und die M\u00f6glichkeit, diese vor Ausbau zu inaktivieren, gen\u20ac ugt den Anforderungen ebenfalls. Die sogenannten Incenerators (thermische Nachbehandlungseinheit) haben einen relativ hohen Energieverbrauch. Auch ist der Nachweis der Wirksamkeit zurzeit von allen Herstellern nicht befriedigend gel\u00f6st.",
            "cite_spans": [
                {
                    "start": 91,
                    "end": 99,
                    "text": "(Abb. 15",
                    "ref_id": null
                }
            ],
            "ref_spans": [],
            "section": "Durchreicheautoklav"
        },
        {
            "text": "Das beim Autoklavieren anfallende Kondensat muss ebenfalls deaktiviert werden, bevor es in die allgemeine Abwasseranlage eingeleitet wird. Empfehlenswert ist das Kondensat \u20ac uber die thermische Abwasserinaktivierungsanlage zu inaktivieren. Verschiedene Hersteller bieten die automatische Kondensatautoklavierung im Standardprogramm an. Abb. 12 Chemieansetzstation (Fa. Enviro DTS) 4.9",
            "cite_spans": [
                {
                    "start": 336,
                    "end": 380,
                    "text": "Abb. 12 Chemieansetzstation (Fa. Enviro DTS)",
                    "ref_id": null
                }
            ],
            "ref_spans": [],
            "section": "Durchreicheautoklav"
        },
        {
            "text": "Thermische Abwasserinaktivierungsanlage (TAI-Anlage) S\u20ac amtliche anfallende Abw\u20ac asser aus einem Labor der Sicherheitsstufen 3 und 4 m\u20ac ussen thermisch oder mit einem erprobten chemischen Verfahren inaktiviert werden. Bei kleineren Laboreinheiten und wenig anfallenden Abw\u20ac assern wird dies zun\u20ac achst \u20ac uber einen Autoklav mit Fl\u20ac ussigkeitsprogramm m\u00f6glich (BSL-3-Labore). Sobald jedoch eine Personenchemiedusche notwendig wird (Anzugslabor BSL 4) empfiehlt es sich, eine thermische Abwassersterilisation (Abb. 16) einzuplanen und zu betreiben.",
            "cite_spans": [],
            "ref_spans": [],
            "section": "Durchreicheautoklav"
        },
        {
            "text": "In diesem Fall k\u00f6nnen s\u20ac amtliche Abw\u20ac asser in einem geschlossenen System gesammelt werden. Es ist darauf zu achten, dass eine Systementl\u20ac uftung stattfinden muss, damit die Abw\u20ac asser entsprechend den technischen Notwendigkeiten st\u00f6rungsfrei in die TAI-Anlage eingeleitet werden k\u00f6nnen. In aller Regel haben diese Anlagen einen Vorlagebeh\u20ac alter, der zur Neutralisation der Abw\u20ac asser herangezogen wird. Der nachgeschaltete Sterilisator wird bef\u20ac ullt und mit Dampf oder je nach System auch elektrisch auf die zu sterilisierende Temperatur gebracht. Diese liegt bei 121 C, bei bestimmten Erreger auch bei 134 C. Die Sterilisationszeit (Haltezeit nach Erreichen der Temperatur) ist mit 20 Minuten in der Regel ausreichend (bei Prionen und umh\u20ac ullten Erregern kann auch eine l\u20ac angere Haltezeit notwendig werden). Es ist sicherzustellen, dass eine homogene Temperaturverteilung in dem Sterilisator vorhanden ist.",
            "cite_spans": [],
            "ref_spans": [],
            "section": "Durchreicheautoklav"
        },
        {
            "text": "Bei Einsatz einer automatischen Wasserl\u00f6schanlage kann das L\u00f6schwasser kontaminiert sein. In diesem Fall wird das L\u00f6schwasser in die thermische Inaktivierungsanlage abgeleitet und in entsprechend ausgelegte Puffertanks zwischengelagert, um es \u20ac uber die TAI-Anlage gefahrlos ableiten zu k\u00f6nnen.",
            "cite_spans": [],
            "ref_spans": [],
            "section": "Durchreicheautoklav"
        },
        {
            "text": "Die GenTSV und BioStoffV fordern f\u20ac ur die sicherheitsrelevanten Anlagen eine sichere Stromversorgung. In der Regel wird aus Kapazit\u20ac atsgr\u20ac unden, neben einer Batterie, die zun\u20ac achst eine unterbrechungsfreie Stromversorgung sicherstellt, eine Netzersatzanlage (NEA) installiert, die den sicheren Betrieb der Anlagen erm\u00f6glicht, auch bei Stromausfall (Abb. 17 und 18) .",
            "cite_spans": [
                {
                    "start": 352,
                    "end": 368,
                    "text": "(Abb. 17 und 18)",
                    "ref_id": null
                }
            ],
            "ref_spans": [],
            "section": "Stromversorgung"
        },
        {
            "text": "Mit der Genehmigunsbeh\u00f6rde ist zu vereinbaren, wie lange der sichere Betrieb aufrecht erhalten werden muss, was letztendlich zur Dimensionierung des Dieseltanks f\u20ac uhrt. Bei der Stromversorgung ist darauf zu achten, dass Einrich-tungsgegenst\u20ac ande ebenfalls als sicherheitsrelevant angesehen werden k\u00f6nnen (z. B. Tiefk\u20ac uhlschr\u20ac anke von \u00c080 C). Dies betrifft auch den Umgang mit gef\u20ac ahrlichen Stoffen in Digestorien sowie in Sicherheitswerkb\u20ac anken.",
            "cite_spans": [],
            "ref_spans": [],
            "section": "Stromversorgung"
        },
        {
            "text": "Abb. 14 Abreinigen einer Durchreicheschleuse (Fa. HT Labor + Hospitaltechnik AG)",
            "cite_spans": [],
            "ref_spans": [],
            "section": "Stromversorgung"
        },
        {
            "text": "Abb. 13 Ansicht Durchreicheschleuse (Fa. HT Labor + Hospitaltechnik AG) Aus der Erfahrung heraus sollten s\u20ac amtliche BSL-3-und BSL-4-Einrichtungen netzersatzberechtigt und die Labore mit einer gen\u20ac ugenden Anzahl von unterbrechungsfreien Stromversorgungssteckdosen (USV) ausgestattet sein.",
            "cite_spans": [],
            "ref_spans": [],
            "section": "Stromversorgung"
        },
        {
            "text": "Bei Hochsicherheitslaboren wird gefordert, dass eine sichere Kommunikation zwischen Personen im und au\u00dferhalb des Labors stattfinden muss. Es ist darauf zu achten, dass diese Kommunikationseinrichtung mit den Vollschutzanz\u20ac ugen und Atemluftmasken genutzt werden kann. Die Kommunikationseinrichtung kann \u20ac uber Telefonie, Headset oder auch \u20ac uber Gegensprechanlagen erfolgen.",
            "cite_spans": [],
            "ref_spans": [],
            "section": "Kommunikationseinrichtung"
        },
        {
            "text": "In der Regel darf in Hochsicherheitslaboren der Schutzstufe 3 und 4 nur mit mindestens zwei Mitarbeitern gearbeitet werden. Da es jedoch eine Vielzahl von Arbeiten gibt, das Einschleusen im BSL-4-Labor ist sehr zeitintensiv, werden h\u20ac aufig in der Genehmigungsphase Ausnahmen zugelassen. Dies setzt jedoch voraus, dass eine vollfl\u20ac achige \u00dcberwachung von au\u00dfen stattfinden kann. Zus\u20ac atzlich muss die beobachtende Person die M\u00f6glichkeit haben, in den jeweiligen Hochsicherheitsbereich eintreten zu k\u00f6nnen. In diesem Fall, d. h. mit einer fl\u20ac achenabdeckenden Video\u20ac uberwachung, ist das Arbeiten auch alleine in Hochsicherheitslaboren m\u00f6glich.",
            "cite_spans": [],
            "ref_spans": [],
            "section": "Video\u00fcberwachung"
        },
        {
            "text": "Der zweite Grund f\u20ac ur die Video\u20ac uberwachung ist das Kontrollieren der Personen im Umfeld der Hochsicherheitslabore. Auch wird eine Kamera\u20ac uberwachung beim Zutritt in die eigentlichen Hochsicherheitsbereiche gefordert, mit Aufschaltung auf eine Sicherheitsleitstelle. Damit ergibt sich eine zus\u20ac atzliche Sicherheitsbarriere, um Zutritt von nicht ge-w\u20ac unschten Personen zu unterbinden.",
            "cite_spans": [],
            "ref_spans": [],
            "section": "Video\u00fcberwachung"
        },
        {
            "text": "Eine vollfl\u20ac achige \u00dcberwachung des Hochsicherheitsbereiches, dies betrifft auch Technikzentralen, wird durch das sogenannte Eckwertepapier der Feuerwehr gefordert. Es muss jedem Betreiber verdeutlicht werden, dass Brandmeldeanlagen nach VDS-Bestimmungen turnusm\u20ac a\u00dfig \u20ac uberpr\u20ac uft werden m\u20ac ussen, auch unterj\u20ac ahrig.",
            "cite_spans": [],
            "ref_spans": [],
            "section": "Brandmeldeanlage"
        },
        {
            "text": "In einem Hochsicherheitslabor ist diese \u00dcberwachung/ Pr\u20ac ufung nicht ohne weiteres mit der biologischen Sicherheit und der Organisation in \u00dcbereinstimmung zu bringen. Bei einem BSL-4-Labor darf kein fremdes Personal in ein m\u00f6glicherweise kontaminiertes Labor eingeschleust werden.",
            "cite_spans": [],
            "ref_spans": [],
            "section": "Brandmeldeanlage"
        },
        {
            "text": "Die zuvor genannten Bedingungen schlie\u00dfen eine unter-j\u20ac ahrige Wartung von der Brandmeldeanlage aus. Hier ist mit dem Betreiber festzulegen, dass die Brandmeldek\u00f6pfe unter-j\u20ac ahrig ausgewechselt werden m\u20ac ussen und nur nach Herunterfahren der Anlage (Dekontamination der vollst\u20ac andigen Anlage) eine \u00dcberpr\u20ac ufung j\u20ac ahrlich erfolgen kann.",
            "cite_spans": [],
            "ref_spans": [],
            "section": "Brandmeldeanlage"
        },
        {
            "text": "Die Brandmeldeanlage dient nicht nur dazu, Br\u20ac ande weiter zu melden bzw. bei Br\u20ac anden zu alarmieren, sondern sie schaltet den Alarm auf weitere technische Anlagen auf. Die Brandmeldeanlage meldet die Bereiche, in denen das Brandereignis stattfindet. In der L\u00f6schanlage wird das dazugeh\u00f6rige Bereichsventil ge\u00f6ffnet und die L\u00f6schanlage in Betrieb gesetzt. Eine weitere Alarmmeldung erfolgt an die Ge-b\u20ac audeleittechnik (GLT), da zwingend notwendige Verschaltungen in der RLT-Anlage zur Druckhaltung erfolgen m\u20ac ussen und ggf. Bodeneinl\u20ac aufe zur Abf\u20ac uhrung von L\u00f6schwasser ge\u00f6ffnet werden. Zus\u20ac atzlich m\u20ac ussen Alarmierungen abgesetzt werden f\u20ac ur Feuerwehr, Sicherheitsoffizier und Personal innerhalb und au\u00dferhalb des Hochsicherheitsbereiches. Daneben werden, je nach Entfluchtungskonzept, T\u20ac ur-steuerungen und Verriegelungen ggf. freigegeben. Somit hat die Funktion der Brandmeldeanlage in der Sicherheitskette einen hohen Stellenwert!",
            "cite_spans": [],
            "ref_spans": [],
            "section": "Brandmeldeanlage"
        },
        {
            "text": "Es ist selbstverst\u20ac andlich, dass ein Zutritt von au\u00dfen in Hochsicherheitslabore aus vielerlei Gesichtspunkten heraus nicht zugelassen werden kann. Zun\u20ac achst befinden sich in einem Hochsicherheitslabor Proben und ggf. infizierte Tiere, die beim Freisetzen f\u20ac ur Personen und Umwelt erheblichen Schaden verursachen k\u00f6nnen. Es muss vermieden werden, dass Dritte, die versuchen in ein Labor einzudringen, um ggf. Tierversuche zu verhindern, Zutritt bekommen. Die Gef\u20ac ahrdung \u20ac uber Bioterrorismus ist ebenfalls nicht auszuschlie\u00dfen.",
            "cite_spans": [],
            "ref_spans": [],
            "section": "Einbruchsmeldeanlage"
        },
        {
            "text": "Im Zuge der Installation der Einbruchsmeldeanlage ist auch mit den zust\u20ac andigen polizeilichen Beh\u00f6rden R\u20ac ucksprache \u20ac uber Art und Umfang des Schutzes sowie der Alarmierungen zu halten.",
            "cite_spans": [],
            "ref_spans": [],
            "section": "Einbruchsmeldeanlage"
        },
        {
            "text": "Einher mit der Einbruchsmeldeanlage geht die Zutrittskontrolle. Nur der Personenkreis, der geschult wurde und der eine Zutrittsberechtigung und Erlaubnis durch den zust\u20ac andigen Verantwortlichen erhalten hat, darf auch tats\u20ac achlich Zutritt haben.",
            "cite_spans": [],
            "ref_spans": [],
            "section": "Zutrittskontrolle (Zuko)"
        },
        {
            "text": "Neben der mechanischen Zutrittsbeschr\u20ac ankung wird eine geistige (PIN-Code) oder biometrische Erkennung seitens der Genehmigungsbeh\u00f6rde verlangt. Im weiteren Zuge von Si-cherheits\u20ac uberlegungen k\u00f6nnen auch Alarmschaltungen bei der Zutrittskontrollanlage oder bei Bedrohung des Laboranten zu einer Weiterschaltung zur Polizei sinnvoll sein.",
            "cite_spans": [],
            "ref_spans": [],
            "section": "Zutrittskontrolle (Zuko)"
        },
        {
            "text": "Neben den genannten m\u00f6glichen Gefahren von au\u00dfen sind zus\u20ac atzlich alle T\u20ac uren zu den Sicherheitslaboren zu \u20ac uberwachen. Jede Zutrittst\u20ac ur vor der Schleuse erh\u20ac alt ein Anzeigeterminal, an dem die Betriebszust\u20ac ande (wesentliche technische Parameter) erfasst und angezeigt werden. So werden beispielsweise an der jeweils \u20ac au\u00dferen Schleusent\u20ac ur Dr\u20ac ucke innerhalb der Schleuse und der Laborr\u20ac aume sowie etwaige St\u00f6rungen aus dem Gefahrenmanagementsystem angezeigt. Dadurch wird erreicht, dass keine unn\u00f6tige Einschleusung vorgenommen wird. Die Priorisierung der Alarme kann ebenfalls an diesen T\u20ac urtableaus angezeigt werden.",
            "cite_spans": [],
            "ref_spans": [],
            "section": "T\u00fcr\u00fcberwachung und Druckanzeige"
        },
        {
            "text": "Innerhalb einer Laboranlage (wenn es mehrere R\u20ac aume gibt) wird an jeder T\u20ac ur ein zus\u20ac atzliches Tableau installiert, das in dem zu betretenden Raum die Zust\u20ac ande anzeigt. Im Wesentlichen handelt es sich um Dr\u20ac ucke, jedoch k\u00f6nnen auch bei Tierhaltungen innerhalb von Hochsicherheitslaboren Temperatur und Feuchtigkeit von Bedeutung sein.",
            "cite_spans": [],
            "ref_spans": [],
            "section": "T\u00fcr\u00fcberwachung und Druckanzeige"
        },
        {
            "text": "Bei technischen St\u00f6rungen werden \u20ac uber die T\u20ac ur-\u20ac uberwachung die jeweiligen Zutrittst\u20ac uren verriegelt, sodass keine Gef\u20ac ahrdung f\u20ac ur Personen und Umwelt durch unwissentliches \u00d6ffnen der T\u20ac uren bei umgekehrten Druckver-h\u20ac altnissen erfolgen kann.",
            "cite_spans": [],
            "ref_spans": [],
            "section": "T\u00fcr\u00fcberwachung und Druckanzeige"
        },
        {
            "text": "Neben der Kommunikationsebene wird in Hochsicherheitslaboren h\u20ac aufig gefordert, dass zus\u20ac atzlich ein optisches und akustisches Signal bei St\u00f6rungen im Labor und au\u00dferhalb bei Gefahren abgesetzt wird. Um nicht bei jeder unwesentlichen technischen St\u00f6rung bei sicherheitsrelevanten Anlagen den Laborbetrieb einzuschr\u20ac anken, werden in der Regel verschiedene Priorit\u20ac atsebenen eingef\u20ac uhrt.",
            "cite_spans": [],
            "ref_spans": [],
            "section": "Alarmierungseinrichtungen"
        },
        {
            "text": "Bei einem \"Rotalarm\", z. B. Ausfall der Chemikalienaufbereitung f\u20ac ur die Personenchemiedusche, ist das Labor nach Beendigung und Verbringung der Arbeiten sofort zu verlassen. Zus\u20ac atzlich zur separaten Alarmierungseinrichtung werden an den T\u20ac urtableaus beispielsweise auch St\u00f6rungen angezeigt, d. h. bei einem \"Gelbalarm\" wird der Laborant sicherheitshalber die Kl\u20ac arung herbeif\u20ac uhren, ehe er das Labor betritt.",
            "cite_spans": [],
            "ref_spans": [],
            "section": "Alarmierungseinrichtungen"
        },
        {
            "text": "In Betriebsanweisungen wird das Verhalten bei der jeweiligen Alarmmeldung festgeschrieben und das Personal tur-nusm\u20ac a\u00dfig geschult.",
            "cite_spans": [],
            "ref_spans": [],
            "section": "Alarmierungseinrichtungen"
        },
        {
            "text": "Die Geb\u20ac audeautomation ist das Verbindungselement von allen sicherheitsrelevanten Anlagen, die auch untereinander in Funktionszusammenh\u20ac angen stehen. Die Ausfallsicherheit dieser Systeme ist eminent wichtig. So werden z. B. Brandmeldeanlagen mit der GLT, wegen der Druckhaltung, verkn\u20ac upft. Die Anforderung an die Regelgenauigkeit ist besonders zu erw\u20ac ahnen. Mit konventionellen Regelungselementen lassen sich die Druckkaskaden nicht aufbauen. Infolgedessen sind schnelle Regelelemente mit hoher Regelgenauigkeit einzusetzen. Mit den heutigen technologischen Bedingungen lassen sich s\u20ac amtliche St\u00f6rgr\u00f6\u00dfen, z. B. durch \u00d6ffnen von T\u20ac uren, innerhalb von zehn Sekunden ausregulieren. Mit l\u20ac angeren Zeitr\u20ac aumen gef\u20ac ahrdet man die komplette Logistik und l\u20ac auft Gefahr, dass diese Systeme, z. B. durch Not-Auf, \u20ac uberlistet werden.",
            "cite_spans": [],
            "ref_spans": [],
            "section": "Geb\u20ac audeautomation und Gefahrenmeldesystem"
        },
        {
            "text": "Insbesondere ist auch die Entfluchtung zu betrachten, da es unvorstellbar ist, dass z. B. bei einer Einschwingzeit von zwei Minuten und Durchtritt durch eine Personenchemiekaliendusche im Gefahrfall eine ordnungsgem\u20ac a\u00dfe Dekontamination stattfinden wird.",
            "cite_spans": [],
            "ref_spans": [],
            "section": "Geb\u20ac audeautomation und Gefahrenmeldesystem"
        },
        {
            "text": "Durch das Eckwertepapier der Feuerwehr, das in Deutschland in die \u20ac uberwiegenden Baurichtlinien der L\u20ac ander \u20ac ubernommen worden ist, wird der Einbau einer automatischen L\u00f6schanlage f\u20ac ur BSL-3-und BSL-4-Labore vorgegeben. Es gibt verschiedene L\u00f6sungsm\u00f6glichkeiten. Alle M\u00f6glichkeiten haben jedoch mehr oder weniger Vor-und Nachteile. Im Folgenden werden drei Systeme beschrieben.",
            "cite_spans": [],
            "ref_spans": [],
            "section": "Feuerl\u00f6schsysteme, automatische"
        },
        {
            "text": "Bei einem Brandalarm str\u00f6mt das Gas binnen drei Sekunden in die R\u20ac aume. Dadurch, dass in den Gasflaschen sehr hohe Dr\u20ac ucke herrschen, ist dieser Drucksto\u00df nicht sicher zu beherrschen. Diese Anlagen haben eine Zulassung \u20ac uber den Sachversicherer, der auf der Einstr\u00f6mung innerhalb von 3-5 Sekunden basiert. Diese Einstr\u00f6mzeit muss in einem gasdichten Containment, damit dieses nicht zerst\u00f6rt werden kann, verl\u20ac angert werden.",
            "cite_spans": [],
            "ref_spans": [],
            "section": "Gasl\u00f6schsystem mit Inertgas (z. B. Argon)"
        },
        {
            "text": "Mittlerweile gibt es Anlagenhersteller, die sich dieser Problematik gestellt haben und die Einstr\u00f6mmenge nach Kapazit\u20ac at der RLT-Anlagen realisieren k\u00f6nnen. Dadurch werden Druckst\u00f6\u00dfe vermieden, die zu einer Zerst\u00f6rung des Containments f\u20ac uhren k\u00f6nnten.",
            "cite_spans": [],
            "ref_spans": [],
            "section": "Gasl\u00f6schsystem mit Inertgas (z. B. Argon)"
        },
        {
            "text": "(z. B. Novec) Das Einstr\u00f6men bei chemischen Gasen verursacht zun\u20ac achst einen Unterdruck durch extreme Temperaturabsenkung, anschlie\u00dfend kommt es zu einem Druckanstieg. Zeitverz\u00f6gernd k\u00f6nnen diese Gase nicht einstr\u00f6men, da es dann ggf. zu einer Entmischung kommt, die die L\u00f6schwirkung reduziert.",
            "cite_spans": [],
            "ref_spans": [],
            "section": "Gasl\u00f6schanlagen mit chemischen Gasen"
        },
        {
            "text": "Die Unterdr\u20ac ucke, auch bei Betrieb der Klimatechnik, liegen bei 1200-2000 Pa, bei kurzzeitigem Anstieg auf 1200-1800 Pa in dem \u00dcberdruckbereich. H\u00f6here Dr\u20ac ucke sowohl im Unter-als auch im \u00dcberdruckbereich sind m\u00f6glich, wenn z. B. die F\u20ac uhler der RLT-Anlage im Betrieb nicht optimal kalibriert werden. Auch halten \"normale\" T\u20ac uren und Fenster diese Dr\u20ac ucke nicht aus.",
            "cite_spans": [],
            "ref_spans": [],
            "section": "Gasl\u00f6schanlagen mit chemischen Gasen"
        },
        {
            "text": "Sprinkleranlagen sind konventionelle Anlagen. Bei kontaminierten R\u20ac aumen haben Sprinkleranlagen den Nachteil, dass kontaminierte L\u00f6schwasser abgef\u20ac uhrt werden m\u20ac ussen. Infolgedessen ist das L\u00f6schwasser sicher aufzufangen und zu beproben bzw. zu deaktivieren.",
            "cite_spans": [],
            "ref_spans": [],
            "section": "Wasserl\u00f6schtechnik"
        },
        {
            "text": "arbeiter und des Betreiberpersonals und entsprechenden aus-sagekr\u20ac aftigen Betriebsanweisungen muss sichergestellt werden, dass die Kenntnisse aus der Planung und dem Genehmigungsverfahren heraus so transparent dargestellt werden, dass es zu keiner Gef\u20ac ahrdung kommen kann. Wiederholungs-pr\u20ac ufungen und \u00dcbungen sind ebenfalls notwendig und durch-zuf\u20ac uhren. Diese f\u20ac uhren zum Qualit\u20ac atsbewusstsein und f\u00f6rdern ruhiges und \u20ac uberlegtes Handeln bei St\u00f6rf\u20ac allen.",
            "cite_spans": [],
            "ref_spans": [],
            "section": "Wasserl\u00f6schtechnik"
        },
        {
            "text": "Durch die Ausf\u20ac uhrungen in diesem Kapitel ist deutlich geworden, dass das Planen, Bauen und Betreiben eines Hochsicherheitslabors sehr gut vorbereitet werden muss. Es ist ratsam, der Empfehlung, den Nutzer, sp\u20ac atere Anlagenbetreiber (Technik und Bau) und die Genehmigungsbeh\u00f6rde rechtzeitig in das Verfahren einzubinden, zu folgen. Umfangreiche technische Kenntnisse, insbesondere das Zusammenspiel gewerks\u20ac ubergreifender Funktionen, sind notwendig. Die Sicherheit steht an oberster Stelle. Nicht zuletzt deswegen ist im Sinne der BioStoffV und des Gentechnikgesetzes die Forderung zu sehen, dass bauliche und technische M\u00f6glichkeiten vor organisatorischen und organisatorische M\u00f6glichkeiten vor Einsatz von zus\u20ac atzlichen pers\u00f6nlichen Schutzausr\u20ac ustungen stehen. Auch bei Sicherheitsbedingungen, die zweifelsfrei gegeben sind, sind Auflagen aus der Genehmigung, auch was den Brandschutz anbelangt, kritisch zu hinterfragen. Zu schnelle Einwilligung in m\u00f6gliche genehmigungstechnische Forderungen f\u20ac uhren zur Verteuerung und zur Verkomplizierung von Anlagen. Neben dem finanziellen Aufwand besteht auch Gefahr, die Komplexibilit\u20ac at zu erh\u00f6hen und damit m\u00f6gliche Zusammenh\u20ac ange nicht mehr erkennen zu k\u00f6nnen. ",
            "cite_spans": [],
            "ref_spans": [],
            "section": "Zusammenfassung"
        }
    ],
    "bib_entries": {
        "BIBREF0": {
            "ref_id": "b0",
            "title": "17 Netzersatzaggregat als Anlagenteil der sicheren Stromversorgung Abb. 18 Schema sichere Stromversorgung (Fa",
            "authors": [
                {
                    "first": "",
                    "middle": [],
                    "last": "Abb",
                    "suffix": ""
                }
            ],
            "year": null,
            "venue": "",
            "volume": "",
            "issn": "",
            "pages": "",
            "other_ids": {}
        }
    },
    "ref_entries": {
        "TABREF0": {
            "text": "Risikogruppe 2: Biologische Substanzen, die beim Menschen Krankheiten hervorrufen k\u00f6nnen, bei denen aber eine wirksame Behandlung normalerweise m\u00f6glich ist und eine Verbreitung in der Bev\u00f6lkerung eher unwahrscheinlich ist. Beispielhafte Erreger sind:Risikogruppe 3: Biologische Substanzen aus dieser Risikogruppe k\u00f6nnen schwere Krankheiten bei Menschen hervorrufen, bei denen jedoch eine wirksame Vorbeugung und Behandlung \u20ac ublicherweise m\u00f6glich ist. Eine Verbreitung in der Bev\u00f6lkerung ist eher unwahrscheinlich, aber m\u00f6glich. Beispielhafte Erreger sind: Risikogruppe 4: \"Biologische Substanzen, die bei Menschen schwere Erkrankungen hervorrufen k\u00f6nnen. Eine wirksame Behandlung oder Vorbeugung ist nicht (Fortsetzung) m\u00f6glich. Die Gefahr einer weiteren Verbreitung in der Bev\u00f6lkerung besteht. Beispielhafte Erreger, die h\u20ac amorrhagisches Fieber hervorrufen k\u00f6nnen und \u20ac uber dem Luftweg \u20ac ubertragbar sind\": Vergleichbar mit der BioStoffV erfolgt nach Gentechnikgesetz die Risikobewertung von Arbeiten im gentechnischen Bereich. Dieses Gesetzt gilt f\u20ac ur 1. gentechnische Anlagen, 2. gentechnische Arbeiten, 3. die Freisetzung von gentechnisch ver\u20ac anderten Organismen und 4. das Inverkehrbringen von Produkten, die gentechnisch ver\u20ac anderte Organismen enthalten oder aus solchen bestehen. Tiere gelten als Produkte im Sinne dieses Gesetzes. Unter gentechnischen Anlagen versteht man Einrichtungen, in denen gentechnische Arbeiten im geschlossenen System durchgef\u20ac uhrt werden, bei denen spezifische Einschlie\u00dfungsma\u00dfnahmen angewendet werden, um den Kontakt der verwendeten Organismen mit Menschen und Umwelt zu begrenzen und ein dem Gef\u20ac ahrdungspotenzial angemessenes Sicherheitsniveau zu gew\u20ac ahrleisten. Unter gentechnischen Arbeiten versteht man die Erzeugung gentechnisch ver-\u20ac anderter Organismen. \u00dcber Freisetzen und Inverkehrbringung wird im Weiteren nicht genauer eingegangen. Im Sinne dieses Gesetzes sind Organismeneinheiten (einschlie\u00dflich Mikroorganismen), die f\u20ac ahig sind, sich zu vermehren oder gentechnisches Material zu \u20ac ubertragen. Unter Mikroorganismen fallen: Mikrobiologisch kleine ein-oder mehrzellige Algen \u2022 Flechten \u2022 Sonstige Einzeller oder mikroskopisch kleine tierische Mehrzeller \u2022 Tierische und pflanzliche Zellkulturen. Die zentrale Kommission f\u20ac ur biologische Sicherheit (ZKBS) setzt sich zusammen aus Sachverst\u20ac andigen (SV), die \u20ac uber besondere und m\u00f6glichst auch internationale Erfahrungen in den Bereichen der verf\u20ac ugen. Zus\u20ac atzlichTeam-RKI werden sachkundige Personen aus dem Bereich \u2022 der Gewerkschaften, \u2022 des Arbeitsschutzes, \u2022 der Wirtschaft, \u2022 der Landwirtschaft, \u2022 des Umweltschutzes, \u2022 des Naturschutzes, \u2022 des Verbraucherschutzes und \u2022 der forschungsf\u00f6rdernden Organisationen eingesetzt. Die Mitglieder dieser Kommission sind in ihrer T\u20ac atigkeit unabh\u20ac angig und nicht an Weisungen gebunden. Sie sind zur Verschwiegenheit verpflichtet. Die Kommission pr\u20ac uft und bewertet sicherheitsrelevante Fragen nach den Vorschriften des Gentechnikgesetzes, gibt hierzu Empfehlungen und ber\u20ac at die Bundesregierung und die L\u20ac ander in sicherheitsrelevanten Fragen zur Gentechnik. Bei ihren Empfehlungen ber\u20ac ucksichtigt die Kommission auch die internationalen Entwicklungen auf dem Gebiet der gentechnischen Sicherheit. Sicherheitsstufen nach \u00a7 7 Gentechnikgesetz Die Sicherheitsstufe 1 ist den gentechnischen Arbeiten zugeordnet, bei denen nach dem Stand der Wissen-BSL = biologische Sicherheitsstufe (biosafety level). schaft nicht von einem Risiko f\u20ac ur die menschliche Gesundheit und Umwelt auszugehen ist.Der Sicherheitsstufe 2 sind gentechnische Arbeiten zuzuordnen, bei denen nach Stand der Wissenschaft von einem geringen Risikofaktor f\u20ac ur die menschliche Gesundheit und die Umwelt auszugehen ist.Der Sicherheitsstufe 3 sind gentechnische Arbeiten zuzuordnen, bei denen nach dem Stand der Wissenschaft von einem m\u20ac a\u00dfigen Risiko f\u20ac ur die menschliche Gesundheit und Umwelt auszugehen ist. Beispielhafte Erreger f\u20ac ur Sicherheitsstufe 3 sind:Der Sicherheitsstufe 4 sind gentechnische Arbeiten zuzuordnen, bei denen nach dem Stand der Wissenschaft von einem hohen Risiko oder dem begr\u20ac undeten Verdacht eines solchen Risikos f\u20ac ur die menschliche Gesundheit oder der Umwelt auszugehen ist. Beispielhafte Erreger f\u20ac ur Sicherheitsstufe 4 sind:",
            "latex": null,
            "type": "table"
        },
        "TABREF1": {
            "text": "z. B. 100, 120 \u2022 Bundesimmissionsschutzgesetz \u2022 DIN EN, z. B. DIN 1946 T. 7, EN 12128 Sonstige Vorschriften, wie z. B.: Zus\u20ac atzlich besch\u20ac aftigen sich Aussch\u20ac usse mit der Festlegung von Standards, wie z. B.: Fenster und T\u20ac uren des Arbeitsbereiches m\u20ac ussen w\u20ac ahrend der Arbeiten geschlossen sein. Labort\u20ac uren m\u20ac ussen nach au\u00dfen aufschlagen und aus Gr\u20ac unden des Personenschutzes ein Sichtfenster aufweisen. 4. F\u20ac ur die Desinfektion und Reinigung der H\u20ac ande m\u20ac ussen Anmerkung: Auch hier nur bauliche Voraussetzungen in Addition der vorhergehenden. 1. Das Labor muss von seiner Umgebung abgeschirmt sein. 2. Fenster d\u20ac urfen nicht zu \u00f6ffnen sein. 3. In der Regel ist eine Schleuse einzurichten, \u20ac uber die das Labor zu betreten und zu verlassen ist. Die Schleuse ist mit zwei selbstschlie\u00dfenden T\u20ac uren auszustatten, die bei bestimmungsgem\u20ac a\u00dfem Betrieb gegeneinander verriegelt sind. Sie muss eine H\u20ac andedesinfektionsvorrichtung enthalten. In der Regel ist in der Schleuse ein Handwaschbecken mit Ellbogen-, Fu\u00df-oder Sensorbet\u20ac atigung einzurichten. In begr\u20ac undeten Einzelf\u20ac allen kann auf eine Schleuse verzichtet werden. Falls erforderlich ist eine Dusche einzurichten. 4. Ein Autoklav oder eine gleichwertige Sterilisationseinheit muss im Labor vorhanden sein. 5. Bei Arbeiten, bei denen Aerosole entstehen k\u00f6nnen, muss stets eine Sicherheitswerkbank der Klasse I oder II vorhanden sein. Die Arbeiten haben dort stattzufinden. 6. Der Zutritt zum Labor ist auf die Personen zu beschr\u20ac anken, deren Anwesenheit zur Durchf\u20ac uhrung der Versuche erforderlich sind und die zum Eintritt befugt sind. Der Projektleiter ist verantwortlich f\u20ac ur die Bestimmung der zutrittsberechtigten Personen. Eine Person darf nur dann allein im Labor arbeiten, wenn eine von innen zu bet\u20ac atigende Alarmanlage vorhanden ist. 7. Im Arbeitsbereich anfallende und zu sterilisierende Abw\u20ac asser sind grunds\u20ac atzlich einer thermischen Nachbe-handlung zu unterziehen, in Auffangbeh\u20ac altern zu sammeln und zu autoklavieren oder durch eine zentrale Abwassersterilisation durchzuf\u20ac uhren. Alternativ k\u00f6nnen auch erprobte, chemische Inaktivierungsverfahren eingesetzt werden, wenn diese genehmigungsf\u20ac ahig sind. Bei bestimmungsgem\u20ac a\u00dfem Betrieb und unter Beachtung der organisatorischen Sicherheitsma\u00dfnahmen fallen aus der Schleuse keine kontaminierten Abw\u20ac asser an. 8. Der Laborbereich muss zum Zwecke der Begasung abdichtbar sein. 9. Sofern mit pathogenen Organismen gearbeitet wird, f\u20ac ur die eine \u00dcbertragung durch die Luft nicht ausgeschlossen werden kann, muss das Labor unter st\u20ac andigem, durch Alarmgeber kontrollierbarem Unterdruck gehalten und die Abluft \u20ac uber Hochleistungsschwebstofffilter gef\u20ac uhrt werden. Die R\u20ac uckf\u20ac uhrung kontaminierter Abluft in den Arbeitsbereich ist unzul\u20ac assig. 10. F\u20ac ur sicherheitsrelevante Einrichtungen wie L\u20ac uftungsanlagen, einschlie\u00dflich Ventilationssystemen, Notruf und \u00dcberwachungseinrichtungen, ist eine Notstromversorgung einzurichten. Zum sicheren Verlassen des Arbeitsbereichs ist eine Sicherheitsbeleuchtung einzurichten. 11. Beim Auswechseln von Filtern, z. B. der l\u20ac uftungstechnischen Anlage oder der Sicherheitswerkbank, m\u20ac ussen diese entweder im Einbau sterilisiert oder zwecks sp\u20ac aterer Sterilisierung durch ein ger\u20ac ateseits vorgesehenes Austauschsystem in einen luftdichten Beh\u20ac alter verpackt werden, sodass eine Infektion des Wartungspersonals und anderer Personen ausgeschlossen werden kann. 12. F\u20ac ur die Kommunikation vom Labor nach au\u00dfen muss eine geeignete Einrichtung vorhanden sein. Sicherheitsstufe 4 1. Das Labor muss entweder ein eigenst\u20ac andiges Geb\u20ac aude sein oder als Teil eines Geb\u20ac aude, durch einen Flur oder Vorraum deutlich von den allgemein zug\u20ac anglichen Ver-kehrsfl\u20ac achen abgetrennt werden. Das Labor soll keine Fenster haben. Sind Fenster vorhanden, m\u20ac ussen diese dicht, bruchsicher und d\u20ac urfen nicht zu \u00f6ffnen sein. Es m\u20ac ussen Ma\u00dfnahmen getroffen werden, die jedes unbeabsichtigte oder unerlaubte Betreten des Labors verhindern. Alle T\u20ac uren des Labors m\u20ac ussen selbstschlie\u00dfend sein. Die Arbeitsr\u20ac aume des Labors d\u20ac urfen nur durch eine dreikammrige Schleuse betreten werden. 2. Die Schleuse muss gegen den Vorraum und die Arbeits-r\u20ac aume mit einer entsprechenden Druckstaffelung versehen sein, um den Austritt von Luft aus dem isolierten Laborteil zu verhindern. Die mittlere Kammer der Schleuse muss eine Personendusche enthalten. Eine Einrichtung zum Einbringen gro\u00dfr\u20ac aumiger Ger\u20ac ate oder Ein-richtungsgegenst\u20ac anden ist vorzusehen. 3. Alle W\u20ac ande, Decken und Fu\u00dfb\u00f6den des Labors m\u20ac ussen nach au\u00dfen dicht sein. Alle Durchtritte von Ver-und Entsorgungsleitungen m\u20ac ussen abgedichtet sein. 4. Das Labor muss mit einem Durchreicheautoklav ausge-r\u20ac ustet sein. Durch eine automatisch wirkende Verriegelung ist sicherzustellen, dass die T\u20ac ur nur ge\u00f6ffnet werden kann, nachdem der Sterilisationszyklus in der Schleuse beendet wurde. Zum Ein-und Ausschleusen von Ger\u20ac aten und hitzeempfindlichem Material ist ein Tauchtank oder eine begasbare Durchreiche mit wechselseitig verriegelbaren T\u20ac uren vorzusehen. 5. Das Labor muss durch ein eigenes Ventilationssystem bel\u20ac uftet werden. Dieses ist so auszulegen, dass im Labor ein st\u20ac andiger Unterdruck gegen\u20ac uber der Au\u00dfenwelt aufrecht erhalten wird. Der Unterdruck muss vom Vorraum bis zum Arbeitsraum jeweils zunehmen. Der in der letzten Stufe tats\u20ac achlich vorhandene Unterdruck muss von innen wie von au\u00dfen leicht kontrollierbar und pr\u20ac ufbar sein. Unzul\u20ac assige Druckver\u20ac anderungen m\u20ac ussen durch einen h\u00f6rbaren Alarm angezeigt werden. Zu-und Abluft sind so zu koppeln, dass bei Ausfall von Ventilatoren die Luft keinesfalls unkontrolliert austreten kann. Die Abluft aus dem Labor muss so aus dem Geb\u20ac aude gelangen, dass eine Gef\u20ac ahrdung der Umwelt nicht eintreten kann. Zuund Abluft des Labors m\u20ac ussen durch zwei aufeinander folgende Hochleistungsschwebstofffilter gef\u20ac uhrt werden. Die Filter sind so anzuordnen, dass ihre einwandfreie Funktion im eingebauten Zustand \u20ac uberpr\u20ac uft werden kann. Zu-und Abluftleitungen m\u20ac ussen hinter den Filtern mechanisch dicht verschlie\u00dfbar sein, um ein gefahrloses Wechseln der Filter zu erm\u00f6glichen. Es muss sichergestellt sein, dass bei einem Ausfall des Stromnetzes Alarm gegeben wird. -Die Ventile des Abluftsystems m\u20ac ussen stromlos in einen sicheren Zustand gelangen. Die Sicherheits-werkb\u20ac anke m\u20ac ussen eine Vorrichtung f\u20ac ur die gefahrlose Ein-und Ausschleusung von Material und G\u20ac utern enthalten. Zum Zweck der Desinfektion der Vielzahl von Widerspr\u20ac uchen in den zu realisierenden Ma\u00dfnahmen, die im Genehmigungsverfahren aufzukl\u20ac aren sind. Entsprechend notwendige Risikoabsch\u20ac atzungen m\u20ac ussen vereinbart werden, die die Anlage genehmigungs-und abnahmef\u20ac ahig machen.",
            "latex": null,
            "type": "table"
        },
        "TABREF2": {
            "text": "). Grunds\u20ac atzlich ist bei Planung und Ausf\u20ac uhrung gr\u00f6\u00dfte Sorgfalt notwendig. Alle Funktionen m\u20ac ussen nachgewiesen werden, auch gewerks\u20ac ubergreifend. Zus\u20ac atzlich sind Dekontaminationsma\u00dfnahmen f\u20ac ur Reparaturen, Instandhaltungsund Wartungsarbeiten zu planen. Der R\u20ac uckbau muss sicher durchgef\u20ac uhrt werden k\u00f6nnen. tionsmittelbest\u20ac andig, gegen das eingesetzte Gas (i. d. R. Formaldehyd oder Wasserstoffperoxid) und gegen eingesetzte Reinigungs-und Desinfektionsmittel dauerhaft resistent sein.",
            "latex": null,
            "type": "table"
        },
        "TABREF3": {
            "text": "F\u20ac ur Anzugslabore ist eine sichere Druck-und Atemluftversorgung unerl\u20ac asslich.F\u20ac ur die genauen Regelungsanforderungen, bedingt durch die dichte Bauweise, ist eine pneumatische Regelung f\u20ac ur das schnelle Reagieren zur Druckstufenrealisierung empfehlenswert.Je nach Ausf\u20ac uhrung von T\u20ac uren (mit Druckluftdichtungen) ist eine sichere Druckluftversorgung zur Aufrechterhaltung des Containments notwendig. Die Versorgung vonAbb.  3 Gro\u00dfger\u20ac ateraum im BSL-4-Labor mit Fl\u20ac ussigstickstofflager-beh\u20ac alter (Fa. Cryotherm) Atemluft ist selbsterkl\u20ac arend. Bei Ausfall von Strom und Netzersatzsystemen und infolgedessen der Ausfall der Drucklufterzeugung muss im BSL-4-Labor ein Back-Up-System die Versorgung mit Atemluft immer absichern. Die Personen in den Hochsicherheitslaboren, die mit Atemluft in ihren Vollschutzanz\u20ac ugen versorgt werden, m\u20ac ussen die Laboreinrichtung sicher verlassen und die erforderliche Dekontamination durchf\u20ac uhren k\u00f6nnen. S\u20ac amtliche technisch notwendigen Einrichtungen m\u20ac ussen ebenfalls, \u20ac uber einen mit der Genehmigungsbeh\u00f6rde festzulegenden Zeitraum, sicher betrieben werden k\u00f6nnen (Dichtungen, Regelungen etc.)(Abb. 9). Hier kommen entweder Peressigs\u20ac aure oder Microchem plus zur Anwendung. Das 30-35 %ige Konzentrat wird auf ein Desinfektionsgemisch zwischen 3 und 5 % ver-d\u20ac unnt und mithilfe von Pumpen oder Druckluft in die Dusche eingespr\u20ac uht. Nach der Einwirkzeit erfolgt ein Absp\u20ac ulen des Schutzanzuges mit Betriebswasser und ein Abreinigen der Desinfektionsfl\u20ac ussigkeit von den Oberfl\u20ac achen. Das Abwasser flie\u00dft in die thermische Abwasserinaktivierungsanlage in einem geschlossenen System.Abb. 5  Bewegungsfl\u20ac ache und Atemluftanschl\u20ac usse (blaue Schl\u20ac auche)",
            "latex": null,
            "type": "table"
        }
    },
    "back_matter": [
        {
            "text": "Aufgrund der hohen L\u00f6schwassermengen werden andere Wasserl\u00f6schsysteme bevorzugt. Zu nennen sind hier die Feinspr\u20ac uhtechnik (mit Mitteldruckanlagen) sowie die Hochdruck-Nebel-L\u00f6schanlagen (HDNLA). Je h\u00f6her die Dr\u20ac ucke und je feiner die Verspr\u20ac uhung umso niedriger sind die L\u00f6schwassermengen. Feinspr\u20ac uhanlagen haben den Vorteil, bei Ausl\u00f6sung keine nennenswerte Sichtbehinderung zu erzeugen. Bei der HDNLA vernebelt der feine Nebel den Raum und schr\u20ac ankt das Sichtfeld ein, was bei der Entfluchtung nicht w\u20ac unschenswert ist.Je nach Projekt ist zu untersuchen, welche der Wasserl\u00f6schtechniken eingesetzt werden kann. In jedem Fall sind die L\u00f6schwassermengen im Auffangbeh\u20ac alter zu sichern, damit keine Verschleppung \u20ac uber das Abwasser erfolgen kann.",
            "cite_spans": [],
            "ref_spans": [],
            "section": "annex"
        },
        {
            "text": "Die Sicherheitsbeleuchtung wird ebenfalls nach GenTSV und BioStoffV gefordert. Diese soll ein gefahrloses Verlassen, auch bei Stromausfall, des Labors erm\u00f6glichen. \u00dcblicherweise haben die Systeme eine Zulassung mit eigenen Batterieanlagen. Diese sind auch im Rahmen der Realisierung bei Hochsicherheitslaboren einzusetzen.Weiterhin ist zu untersuchen, inwieweit es bei Stromausfall zu Sicherheitsrisiken kommen kann (z. B. bei Arbeiten mit hochinfekti\u00f6sen Erregern) oder ob nicht die \"normale\" Beleuchtung \u20ac uber Batterie (zumindest 50 %) gesichert werden soll, um eben die Gef\u20ac ahrdung bei schlechten Sichtver-h\u20ac altnissen zu vermeiden. Auch ist zu beachten, dass sich durch den Sichtschutz-bzw. Vollschutzanzug zus\u20ac atzliche Sehbehinderungen ergeben.",
            "cite_spans": [],
            "ref_spans": [],
            "section": "Sicherheitsbeleuchtung"
        },
        {
            "text": "Viele Vorg\u20ac ange beim Bau und Betrieb von Hochsicherheitslaboren sind, mit konventionellen standardisierten Abnahmeverfahren, nicht ausreichend zu pr\u20ac ufen. Umso wichtiger ist es, im Rahmen der Genehmigung die Pr\u20ac ufverfahren der einzelnen Bau-und Anlagenteile festzulegen und diese bereits in der Vergabe zu ber\u20ac ucksichtigen. Je nach Anlage k\u00f6nnen diese Pr\u20ac ufverfahren relativ aufwendig sein. So ist z. B. der Nachweis der Wirksamkeit einer Personenchemiedusche eine komplexe Angelegenheit, die es mit der Genehmigungsbeh\u00f6rde vor Errichtung und Vergabe zu kl\u20ac aren gilt. Auch ist der Betrieb der TAI-Anlage mit dem Nachweis, dass tats\u20ac achlich alle m\u00f6glichen Erreger deaktiviert werden m\u20ac ussen, besonders zu betrachten. Raumbegasungen, unabh\u20ac angig vom Verfahren, m\u20ac ussen ebenfalls sicher durchgef\u20ac uhrt werden k\u00f6nnen. Die entsprechenden Pr\u20ac ufszenarien sind festzulegen. Das Begasen von Filtern und der Nachweis der Wirksamkeit muss vereinbart werden. Dies gilt nicht nur f\u20ac ur eingebaute Filter in der RLT-Anlage, sondern auch f\u20ac ur Filter und Systeme in Subanlagen, wie z. B. Sicherheitswerkb\u20ac anke oder Autoklaven (Abluftfilter). Da es sich hierbei um anlagenspezifische und je nach Fabrikat unterschiedliche Verfahren handelt, ist die Festlegung der Leistungsnachweise von besonderer Bedeutung. Auch ist die komplexe Anlagensicherheit bei St\u00f6rf\u20ac allen zu beschreiben und das Pr\u20ac ufverfahren festzulegen, z. B. durch eine St\u00f6rfallsimulation (Abb. 19 ).",
            "cite_spans": [
                {
                    "start": 1450,
                    "end": 1458,
                    "text": "(Abb. 19",
                    "ref_id": null
                }
            ],
            "ref_spans": [],
            "section": "Abnahme, Qualifizierung und Validierung"
        },
        {
            "text": "Qualit\u20ac atssicherungDie Abnahme von Einzelgewerken, bei \u00f6ffentlichen Bauvorhaben werden h\u20ac aufig selbst Vergabeeinheiten (VE) noch einmal aufgesplittet, ist nicht zielf\u20ac uhrend. Viele der vorbeschriebenen sicherheitsrelevanten Anlagen stehen untereinander in Funktionsabh\u20ac angigkeit und m\u20ac ussen auch in der Schnittstelle gepr\u20ac uft werden. Da in der Realit\u20ac at nicht alle Gewerke gleichzeitig fertig werden, jedoch nach Vergaberecht nach Fertigstellung des Gewerks ein Anspruch des Auftragsnehmers auf Abnahme besteht, sind hier bei Auftragsvergabe Regelungen zu treffen, die \u20ac uber die Bestimmungen der VOB hinaus gehen. Die notwendigen funktionalen Zusammenh\u20ac ange von Einzelgewerken werden, mit der Definition der Schnittstelle, in einer Gewerkebeziehungsmatrix festgehalten.In der Regel muss bei Hochsicherheitslaboren im Vorfeld eine Untersuchung der technischen Risiken erfolgen. Anhand dieser Risiken werden zus\u20ac atzliche gewerksinterne \u00dcber-pr\u20ac ufungen notwendig (z. B. Ausfall einer redundanten Pumpe). In diesen gewerksinternen \u00dcberpr\u20ac ufungen sind anhand von St\u00f6rfallsimulationen auch die gewerks\u20ac ubergreifenden Schnittstellen, einschlie\u00dflich des dynamischen Verhaltens von Anlagen, zu pr\u20ac ufen. Diese Art von \u00dcberpr\u20ac ufungen lassen sich nicht zwangsl\u20ac aufig auf Dritte \u20ac ubertragen.Die Betriebs-und St\u00f6rfallmatrix (Abb. 19 ) muss im Vorfeld erstellt werden. Den Firmen muss anhand dieser Betriebs-und St\u00f6rfallmatrix verdeutlicht werden, dass der Nachweis der gewerks\u20ac ubergreifenden Funktionen ein wesentlicher Bestandteil des Vertrages ist. Zur Qualit\u20ac atssicherung bei Hochsicherheitslaboren z\u20ac ahlt nicht nur das einwandfreie Funktionieren von sicherheitsrelevanten Anlagen.Im Zusammenhang mit organisatorischen Notwendigkeiten und in Kenntnis biologischer Gef\u20ac ahrdung bei Ausfall von technischen Anlagen oder Fehlverhalten von Laboranten und Anlagenbetreibern sind Schulungen der Betreiber regelm\u20ac a\u00dfig notwendig.Die Qualit\u20ac atssicherung beginnt mit einer umfangreichen Analyse s\u20ac amtlicher m\u00f6glicher technischer St\u00f6rf\u20ac alle. Diese ber\u20ac ucksichtigt dann weitere m\u00f6gliche Fehlbedienungen und m\u00f6gliches Fehlverhalten. Mit der Schulung der Labormit-",
            "cite_spans": [
                {
                    "start": 1327,
                    "end": 1335,
                    "text": "(Abb. 19",
                    "ref_id": null
                }
            ],
            "ref_spans": [],
            "section": "6"
        }
    ]
}