{
    "paper_id": "PMC7087128",
    "metadata": {
        "title": "Cholesterol is important for the entry process of porcine deltacoronavirus",
        "authors": [
            {
                "first": "Ji",
                "middle": [
                    "Hyun"
                ],
                "last": "Jeon",
                "suffix": "",
                "email": null,
                "affiliation": {}
            },
            {
                "first": "Changhee",
                "middle": [],
                "last": "Lee",
                "suffix": "",
                "email": "changhee@knu.ac.kr",
                "affiliation": {}
            }
        ]
    },
    "body_text": [],
    "ref_entries": {
        "FIGREF0": {
            "text": "Fig.\u00a01: Effects of cellular cholesterol depletion and replenishment on the replication of PDCoV. (A) PDCoV infection efficiency after cholesterol depletion from the cell membrane. ST cells were preincubated with M\u03b2CD at the indicated concentrations for 1 h and were mock-infected or infected with PDCoV. Viral production in the presence of M\u03b2CD was calculated by measuring the percentage of cells expressing PDCoV N proteins using flow cytometry. (B) Viral progeny production by cellular cholesterol depletion. ST cells pretreated with M\u03b2CD were infected with PDCoV and maintained in the presence of M\u03b2CD. At 24 hpi, virus culture supernatants were collected and the PDCoV titer was determined. (C and D) PDCoV infection efficiency after cholesterol depletion and replenishment from the cell membrane. ST cells were preincubated with M\u03b2CD with (+) or without (\u2013) exogenous cholesterol and infected with PDCoV in the presence or absence of M\u03b2CD and/or exogenous cholesterol as indicated. Viral infectivity was determined by measuring the percentage of cells expressing PDCoV N proteins using FACS analysis (C) and by virus titration (D). (E) Cholesterol content determination after cholesterol depletion and replenishment from the cell membrane. ST cells were preincubated with M\u03b2CD with (+) or without (\u2013) exogenous cholesterol and infected with PDCoV in the presence or absence of M\u03b2CD and/or exogenous cholesterol as indicated. Virus-specific CPE were observed daily and photographed at 24 hpi using a fluorescent/bright-field microscope at a magnification of 200\u00d7 (first row of panels). For immunostaining, infected cells were fixed at 24 hpi and incubated with a cholesterol-binding, fluorescent antibiotic, Filipin III (second row of panels). The cells were examined using a fluorescent microscope at 200\u00d7 magnification. The values shown are the means of three independent experiments, and error bars represent standard deviations. *, P = 0.001\u20130.05; **, P < 0.001",
            "type": "figure"
        },
        "FIGREF1": {
            "text": "Fig.\u00a02: Effects of viral cholesterol depletion and replenishment on the replication of PDCoV. (A) PDCoV infection efficiency after cholesterol depletion from the virus envelope. PDCoV suspensions were treated with M\u03b2CD to remove cholesterol in the viral envelope, followed by ultracentrifugation, and the purified PDCoV was used to infect fresh ST cells. Virus infectivity was determined by measuring the percentage of cells expressing N proteins of PDCoV using FACS analysis. (B) Viral progeny production after viral cholesterol depletion. Virus culture supernatants were collected at the same time-point, and PDCoV titers were determined. (C and D) PDCoV infection efficiency after cholesterol depletion and replenishment from the viral envelope. PDCoV suspensions were treated with M\u03b2CD with (+) or without (\u2013) exogenous cholesterol, followed by ultracentrifugation and infection. Virus infectivity was determined by measuring the percentage of cells expressing PDCoV N proteins using FACS (C) and by virus titration (D). (E) Cholesterol content determination after cholesterol depletion and replenishment from the viral envelope. PDCoV suspensions were incubated with M\u03b2CD with (+) or without (\u2013) exogenous cholesterol, followed by ultracentrifugation. Virion cholesterol contents were determined using filipin III, and fluorescence intensity was measured with a fluorescence microplate reader. The values shown are the means of three independent experiments, and error bars represent standard deviations. *, P = 0.001\u20130.05; **, P < 0.001",
            "type": "figure"
        },
        "FIGREF2": {
            "text": "Fig.\u00a03: Effects of cellular (A) or viral (B) cholesterol depletion on virus entry. (A) ST cells were pretreated M\u03b2CD infected with PDCoV at 4 \u00b0C for 1 h. After washing with cold PBS, infected cells were maintained in the presence or absence of M\u03b2CD, either at 4 \u00b0C (binding) or 37 \u00b0C (internalization), for 1 h. The virus-infected cells maintained at 37 \u00b0C were further treated with proteinase K at 37 \u00b0C. The infected cells were then serially diluted and plated onto fresh target cells. At 2 days post-incubation, bound or internalized viruses were titrated. (B) PDCoV was treated with M\u03b2CD and ultracentrifuged, and the purified virus was used to infect ST cells in the absence of M\u03b2CD to measure bound or internalized viruses exactly as described above. The results are expressed as the mean values from three independent experiments performed in triplicate, and error bars represent standard deviations. *, P = 0.001\u20130.05; **, P < 0.001",
            "type": "figure"
        }
    },
    "back_matter": [],
    "bib_entries": {
        "BIBREF0": {
            "title": "Lipid raft disruption by cholesterol depletion enhances influenza A virus budding from MDCK cells",
            "authors": [
                {
                    "first": "S",
                    "middle": [],
                    "last": "Barman",
                    "suffix": ""
                },
                {
                    "first": "DP",
                    "middle": [],
                    "last": "Nayak",
                    "suffix": ""
                }
            ],
            "year": 2007,
            "venue": "J Virol",
            "volume": "81",
            "issn": "",
            "pages": "12169-12178",
            "other_ids": {
                "DOI": [
                    "10.1128/JVI.00835-07"
                ]
            }
        },
        "BIBREF1": {
            "title": "Human coronavirus 229E binds to CD13 in rafts and enters the cell through caveolae",
            "authors": [
                {
                    "first": "R",
                    "middle": [],
                    "last": "Nomura",
                    "suffix": ""
                },
                {
                    "first": "A",
                    "middle": [],
                    "last": "Kiyota",
                    "suffix": ""
                },
                {
                    "first": "E",
                    "middle": [],
                    "last": "Suzaki",
                    "suffix": ""
                },
                {
                    "first": "K",
                    "middle": [],
                    "last": "Kataoka",
                    "suffix": ""
                },
                {
                    "first": "Y",
                    "middle": [],
                    "last": "Ohe",
                    "suffix": ""
                },
                {
                    "first": "K",
                    "middle": [],
                    "last": "Miyamoto",
                    "suffix": ""
                },
                {
                    "first": "T",
                    "middle": [],
                    "last": "Senda",
                    "suffix": ""
                },
                {
                    "first": "T",
                    "middle": [],
                    "last": "Fujimoto",
                    "suffix": ""
                }
            ],
            "year": 2004,
            "venue": "J Virol",
            "volume": "78",
            "issn": "",
            "pages": "8701-8708",
            "other_ids": {
                "DOI": [
                    "10.1128/JVI.78.16.8701-8708.2004"
                ]
            }
        },
        "BIBREF2": {
            "title": "Role of the lipid rafts in the life cycle of canine coronavirus",
            "authors": [
                {
                    "first": "A",
                    "middle": [],
                    "last": "Pratelli",
                    "suffix": ""
                },
                {
                    "first": "V",
                    "middle": [],
                    "last": "Colao",
                    "suffix": ""
                }
            ],
            "year": 2015,
            "venue": "J Gen Virol",
            "volume": "96",
            "issn": "",
            "pages": "331-337",
            "other_ids": {
                "DOI": [
                    "10.1099/vir.0.070870-0"
                ]
            }
        },
        "BIBREF3": {
            "title": "Importance of cholesterol for infection of cells by transmissible gastroenteritis virus",
            "authors": [
                {
                    "first": "X",
                    "middle": [],
                    "last": "Ren",
                    "suffix": ""
                },
                {
                    "first": "J",
                    "middle": [],
                    "last": "Glende",
                    "suffix": ""
                },
                {
                    "first": "J",
                    "middle": [],
                    "last": "Yin",
                    "suffix": ""
                },
                {
                    "first": "C",
                    "middle": [],
                    "last": "Schwegmann-Wessels",
                    "suffix": ""
                },
                {
                    "first": "G",
                    "middle": [],
                    "last": "Herrler",
                    "suffix": ""
                }
            ],
            "year": 2008,
            "venue": "Virus Res",
            "volume": "137",
            "issn": "",
            "pages": "220-224",
            "other_ids": {
                "DOI": [
                    "10.1016/j.virusres.2008.07.023"
                ]
            }
        },
        "BIBREF4": {
            "title": "Different lineage of porcine deltacoronavirus in Thailand, Vietnam and Lao PDR in 2015",
            "authors": [
                {
                    "first": "K",
                    "middle": [],
                    "last": "Saeng-Chuto",
                    "suffix": ""
                },
                {
                    "first": "A",
                    "middle": [],
                    "last": "Lorsirigool",
                    "suffix": ""
                },
                {
                    "first": "G",
                    "middle": [],
                    "last": "Temeeyasen",
                    "suffix": ""
                },
                {
                    "first": "DT",
                    "middle": [],
                    "last": "Vui",
                    "suffix": ""
                },
                {
                    "first": "CJ",
                    "middle": [],
                    "last": "Stott",
                    "suffix": ""
                },
                {
                    "first": "A",
                    "middle": [],
                    "last": "Madapong",
                    "suffix": ""
                },
                {
                    "first": "T",
                    "middle": [],
                    "last": "Tripipat",
                    "suffix": ""
                },
                {
                    "first": "M",
                    "middle": [],
                    "last": "Wegner",
                    "suffix": ""
                },
                {
                    "first": "M",
                    "middle": [],
                    "last": "Intrakamhaeng",
                    "suffix": ""
                },
                {
                    "first": "W",
                    "middle": [],
                    "last": "Chongcharoen",
                    "suffix": ""
                },
                {
                    "first": "A",
                    "middle": [],
                    "last": "Tantituvanont",
                    "suffix": ""
                },
                {
                    "first": "P",
                    "middle": [],
                    "last": "Kaewprommal",
                    "suffix": ""
                },
                {
                    "first": "J",
                    "middle": [],
                    "last": "Piriyapongsa",
                    "suffix": ""
                },
                {
                    "first": "D",
                    "middle": [],
                    "last": "Nilubol",
                    "suffix": ""
                }
            ],
            "year": 2017,
            "venue": "Transbound Emerg Dis",
            "volume": "64",
            "issn": "",
            "pages": "3-10",
            "other_ids": {
                "DOI": [
                    "10.1111/tbed.12585"
                ]
            }
        },
        "BIBREF5": {
            "title": "Newly emerged porcine deltacoronavirus associated with diarrhoea in swine in China: identification, prevalence and full-length genome sequence analysis",
            "authors": [
                {
                    "first": "D",
                    "middle": [],
                    "last": "Song",
                    "suffix": ""
                },
                {
                    "first": "X",
                    "middle": [],
                    "last": "Zhou",
                    "suffix": ""
                },
                {
                    "first": "Q",
                    "middle": [],
                    "last": "Peng",
                    "suffix": ""
                },
                {
                    "first": "Y",
                    "middle": [],
                    "last": "Chen",
                    "suffix": ""
                },
                {
                    "first": "F",
                    "middle": [],
                    "last": "Zhang",
                    "suffix": ""
                },
                {
                    "first": "T",
                    "middle": [],
                    "last": "Huang",
                    "suffix": ""
                },
                {
                    "first": "T",
                    "middle": [],
                    "last": "Zhang",
                    "suffix": ""
                },
                {
                    "first": "A",
                    "middle": [],
                    "last": "Li",
                    "suffix": ""
                },
                {
                    "first": "D",
                    "middle": [],
                    "last": "Huang",
                    "suffix": ""
                },
                {
                    "first": "Q",
                    "middle": [],
                    "last": "Wu",
                    "suffix": ""
                },
                {
                    "first": "H",
                    "middle": [],
                    "last": "He",
                    "suffix": ""
                },
                {
                    "first": "Y",
                    "middle": [],
                    "last": "Tang",
                    "suffix": ""
                }
            ],
            "year": 2015,
            "venue": "Transbound Emerg Dis",
            "volume": "62",
            "issn": "",
            "pages": "575-580",
            "other_ids": {
                "DOI": [
                    "10.1111/tbed.12399"
                ]
            }
        },
        "BIBREF6": {
            "title": "Virus infection and lipid rafts",
            "authors": [
                {
                    "first": "T",
                    "middle": [],
                    "last": "Suzuki",
                    "suffix": ""
                },
                {
                    "first": "Y",
                    "middle": [],
                    "last": "Suzuki",
                    "suffix": ""
                }
            ],
            "year": 2006,
            "venue": "Biol Pharm Bull",
            "volume": "29",
            "issn": "",
            "pages": "1538-1541",
            "other_ids": {
                "DOI": [
                    "10.1248/bpb.29.1538"
                ]
            }
        },
        "BIBREF7": {
            "title": "Differential effect of cholesterol on type I and II feline coronavirus infection",
            "authors": [
                {
                    "first": "T",
                    "middle": [],
                    "last": "Takano",
                    "suffix": ""
                },
                {
                    "first": "Y",
                    "middle": [],
                    "last": "Satomi",
                    "suffix": ""
                },
                {
                    "first": "Y",
                    "middle": [],
                    "last": "Oyama",
                    "suffix": ""
                },
                {
                    "first": "T",
                    "middle": [],
                    "last": "Doki",
                    "suffix": ""
                },
                {
                    "first": "T",
                    "middle": [],
                    "last": "Hohdatsu",
                    "suffix": ""
                }
            ],
            "year": 2016,
            "venue": "Arch Virol",
            "volume": "161",
            "issn": "",
            "pages": "125-133",
            "other_ids": {
                "DOI": [
                    "10.1007/s00705-015-2655-0"
                ]
            }
        },
        "BIBREF8": {
            "title": "Murine coronavirus requires lipid rafts for virus entry and cell\u2013cell fusion but not for virus release",
            "authors": [
                {
                    "first": "KS",
                    "middle": [],
                    "last": "Choi",
                    "suffix": ""
                },
                {
                    "first": "H",
                    "middle": [],
                    "last": "Aizaki",
                    "suffix": ""
                },
                {
                    "first": "MM",
                    "middle": [],
                    "last": "Lai",
                    "suffix": ""
                }
            ],
            "year": 2005,
            "venue": "J Virol",
            "volume": "79",
            "issn": "",
            "pages": "9862-9871",
            "other_ids": {
                "DOI": [
                    "10.1128/JVI.79.15.9862-9871.2005"
                ]
            }
        },
        "BIBREF9": {
            "title": "The important role of lipid raft-mediated attachment in the infection of cultured cells by coronavirus infectious bronchitis virus beaudette strain",
            "authors": [
                {
                    "first": "H",
                    "middle": [],
                    "last": "Guo",
                    "suffix": ""
                },
                {
                    "first": "M",
                    "middle": [],
                    "last": "Huang",
                    "suffix": ""
                },
                {
                    "first": "Q",
                    "middle": [],
                    "last": "Yuan",
                    "suffix": ""
                },
                {
                    "first": "Y",
                    "middle": [],
                    "last": "Wei",
                    "suffix": ""
                },
                {
                    "first": "Y",
                    "middle": [],
                    "last": "Gao",
                    "suffix": ""
                },
                {
                    "first": "L",
                    "middle": [],
                    "last": "Mao",
                    "suffix": ""
                },
                {
                    "first": "L",
                    "middle": [],
                    "last": "Gu",
                    "suffix": ""
                },
                {
                    "first": "YW",
                    "middle": [],
                    "last": "Tan",
                    "suffix": ""
                },
                {
                    "first": "Y",
                    "middle": [],
                    "last": "Zhong",
                    "suffix": ""
                },
                {
                    "first": "D",
                    "middle": [],
                    "last": "Liu",
                    "suffix": ""
                },
                {
                    "first": "S",
                    "middle": [],
                    "last": "Sun",
                    "suffix": ""
                }
            ],
            "year": 2017,
            "venue": "PLoS One",
            "volume": "12",
            "issn": "",
            "pages": null,
            "other_ids": {
                "DOI": [
                    "10.1371/journal.pone.0170123"
                ]
            }
        },
        "BIBREF10": {
            "title": "Isolation and characterization of a Korean porcine deltacoronavirus strain KNU16-07",
            "authors": [
                {
                    "first": "G",
                    "middle": [],
                    "last": "Jang",
                    "suffix": ""
                },
                {
                    "first": "SH",
                    "middle": [],
                    "last": "Kim",
                    "suffix": ""
                },
                {
                    "first": "YG",
                    "middle": [],
                    "last": "Lee",
                    "suffix": ""
                },
                {
                    "first": "S",
                    "middle": [],
                    "last": "Kim",
                    "suffix": ""
                },
                {
                    "first": "DS",
                    "middle": [],
                    "last": "Lee",
                    "suffix": ""
                },
                {
                    "first": "KK",
                    "middle": [],
                    "last": "Lee",
                    "suffix": ""
                },
                {
                    "first": "C",
                    "middle": [],
                    "last": "Lee",
                    "suffix": ""
                }
            ],
            "year": 2018,
            "venue": "J Vet Sci",
            "volume": "19",
            "issn": "",
            "pages": "586-590",
            "other_ids": {
                "DOI": [
                    "10.4142/jvs.2018.19.4.577"
                ]
            }
        },
        "BIBREF11": {
            "title": "Cellular cholesterol is required for porcine nidovirus infection",
            "authors": [
                {
                    "first": "JH",
                    "middle": [],
                    "last": "Jeon",
                    "suffix": ""
                },
                {
                    "first": "C",
                    "middle": [],
                    "last": "Lee",
                    "suffix": ""
                }
            ],
            "year": 2017,
            "venue": "Arch Virol",
            "volume": "162",
            "issn": "",
            "pages": "3753-3767",
            "other_ids": {
                "DOI": [
                    "10.1007/s00705-017-3545-4"
                ]
            }
        },
        "BIBREF12": {
            "title": "Porcine deltacoronavirus infection: etiology, cell culture for virus isolation and propagation, molecular epidemiology and pathogenesis",
            "authors": [
                {
                    "first": "K",
                    "middle": [],
                    "last": "Jung",
                    "suffix": ""
                },
                {
                    "first": "H",
                    "middle": [],
                    "last": "Hu",
                    "suffix": ""
                },
                {
                    "first": "LJ",
                    "middle": [],
                    "last": "Saif",
                    "suffix": ""
                }
            ],
            "year": 2016,
            "venue": "Virus Res",
            "volume": "226",
            "issn": "",
            "pages": "50-59",
            "other_ids": {
                "DOI": [
                    "10.1016/j.virusres.2016.04.009"
                ]
            }
        },
        "BIBREF13": {
            "title": "Complete genome characterization of Korean porcine deltacoronavirus strain KOR/KNU14-04/2014",
            "authors": [
                {
                    "first": "S",
                    "middle": [],
                    "last": "Lee",
                    "suffix": ""
                },
                {
                    "first": "C",
                    "middle": [],
                    "last": "Lee",
                    "suffix": ""
                }
            ],
            "year": 2014,
            "venue": "Genome Announc",
            "volume": "2",
            "issn": "",
            "pages": null,
            "other_ids": {
                "DOI": [
                    "10.1128/genomeA.01191-14"
                ]
            }
        },
        "BIBREF14": {
            "title": "Lipid rafts play an important role in the early stage of severe acute respiratory syndrome-coronavirus life cycle",
            "authors": [
                {
                    "first": "GM",
                    "middle": [],
                    "last": "Li",
                    "suffix": ""
                },
                {
                    "first": "YG",
                    "middle": [],
                    "last": "Li",
                    "suffix": ""
                },
                {
                    "first": "M",
                    "middle": [],
                    "last": "Yamate",
                    "suffix": ""
                },
                {
                    "first": "SM",
                    "middle": [],
                    "last": "Li",
                    "suffix": ""
                },
                {
                    "first": "K",
                    "middle": [],
                    "last": "Ikuta",
                    "suffix": ""
                }
            ],
            "year": 2007,
            "venue": "Microbes Infect",
            "volume": "9",
            "issn": "",
            "pages": "96-102",
            "other_ids": {
                "DOI": [
                    "10.1016/j.micinf.2006.10.015"
                ]
            }
        },
        "BIBREF15": {
            "title": "Complete genome sequence of strain SDCV/USA/Illinois121/2014, a porcine deltacoronavirus from the United States",
            "authors": [
                {
                    "first": "D",
                    "middle": [],
                    "last": "Marthaler",
                    "suffix": ""
                },
                {
                    "first": "Y",
                    "middle": [],
                    "last": "Jiang",
                    "suffix": ""
                },
                {
                    "first": "J",
                    "middle": [],
                    "last": "Collins",
                    "suffix": ""
                },
                {
                    "first": "K",
                    "middle": [],
                    "last": "Rossow",
                    "suffix": ""
                }
            ],
            "year": 2014,
            "venue": "Genome Announc",
            "volume": "2",
            "issn": "",
            "pages": null,
            "other_ids": {
                "DOI": [
                    "10.1128/genomeA.00218-14"
                ]
            }
        }
    }
}