{
    "paper_id": "bc43d03e5aa200f70b22ff4f5b5912abb4f75ca8",
    "metadata": {
        "title": "Coronaviruses with Special Emphasis on First Insights Concerning SARS 201",
        "authors": [
            {
                "first": "Ed",
                "middle": [],
                "last": "",
                "suffix": "",
                "affiliation": {},
                "email": ""
            },
            {
                "first": "A",
                "middle": [],
                "last": "Schmidt",
                "suffix": "",
                "affiliation": {},
                "email": ""
            },
            {
                "first": "M",
                "middle": [
                    "H"
                ],
                "last": "Wolff",
                "suffix": "",
                "affiliation": {},
                "email": ""
            },
            {
                "first": "O",
                "middle": [],
                "last": "Weber",
                "suffix": "",
                "affiliation": {},
                "email": ""
            }
        ]
    },
    "abstract": [],
    "body_text": [
        {
            "text": "Since their first isolation from chickens in 1937 [1] , coronaviruses have proven to be significant pathogens of many types of wild as well as economically important domesticated animals. Though coronaviruses were first identified as human respiratory pathogens in 1965 [2] , only recently, with their established link with the severe acute respiratory syndrome (SARS), has there been a sudden upsurge of interest in this group of viruses.",
            "cite_spans": [
                {
                    "start": 50,
                    "end": 53,
                    "text": "[1]",
                    "ref_id": "BIBREF0"
                },
                {
                    "start": 270,
                    "end": 273,
                    "text": "[2]",
                    "ref_id": "BIBREF1"
                }
            ],
            "ref_spans": [],
            "section": "Introduction"
        },
        {
            "text": "Taxonomically, these enveloped, positive-sense RNA viruses [1] belong in the genus Coronavirus of the family Coronaviridae in the order Nidovirales [3] . To date, the genus contains some 14 members. Birds and mammals are the known hosts with a wide variety of species affected. In mammals, coronaviruses have been isolated from pigs, cattle, mice, rats, dogs, horses, cats, and humans [1] , and in birds mainly from chickens [4] and turkeys [5] .",
            "cite_spans": [
                {
                    "start": 59,
                    "end": 62,
                    "text": "[1]",
                    "ref_id": "BIBREF0"
                },
                {
                    "start": 148,
                    "end": 151,
                    "text": "[3]",
                    "ref_id": "BIBREF2"
                },
                {
                    "start": 385,
                    "end": 388,
                    "text": "[1]",
                    "ref_id": "BIBREF0"
                },
                {
                    "start": 425,
                    "end": 428,
                    "text": "[4]",
                    "ref_id": "BIBREF3"
                },
                {
                    "start": 441,
                    "end": 444,
                    "text": "[5]",
                    "ref_id": null
                }
            ],
            "ref_spans": [],
            "section": "Introduction"
        },
        {
            "text": "Coronaviruses 229E and OC43 are recognized respiratory pathogens of humans. The causative agent of SARS (SARS-CoV), which has now been fully characterized [6] , awaits its formal inclusion in the genus. Genomic studies show SARS-CoV to be unique as it contains elements of both mammalian and avian ancestry [7] and the effect of this recombination has been disastrous for humans. In the first recorded outbreak in 2003, the virus caused 8,461 clinical cases and 804 recorded deaths globally [8] . Fortunately, and in spite of its seemingly high mutation rates [9] , the spread of the virus was effectively controlled, mainly through general public health measures and basic infection control practices. Nevertheless, the SARS incident has had a significant impact on human health and the global economy [10] and thus highlighted the need to better understand the modes and vehicles for its spread and proper means to interrupt its environmental transmission.",
            "cite_spans": [
                {
                    "start": 155,
                    "end": 158,
                    "text": "[6]",
                    "ref_id": "BIBREF5"
                },
                {
                    "start": 307,
                    "end": 310,
                    "text": "[7]",
                    "ref_id": "BIBREF6"
                },
                {
                    "start": 491,
                    "end": 494,
                    "text": "[8]",
                    "ref_id": "BIBREF7"
                },
                {
                    "start": 560,
                    "end": 563,
                    "text": "[9]",
                    "ref_id": "BIBREF8"
                },
                {
                    "start": 803,
                    "end": 807,
                    "text": "[10]",
                    "ref_id": "BIBREF9"
                }
            ],
            "ref_spans": [],
            "section": "Introduction"
        },
        {
            "text": "Manfred H. Wolff, 1 Syed A. Sattar, 2 Olusola Adegbunrin 2 and Jason Tetro 2",
            "cite_spans": [],
            "ref_spans": [],
            "section": "Environmental survival and microbicide inactivation of coronaviruses"
        },
        {
            "text": "Depending on the type of coronavirus and the animal host species, virus shedding can occur from the respiratory and/or gastrointestinal tract [11] and the two main portals of virus entry into susceptible animals are the nose and the mouth [12] . In humans, coronaviruses normally cause the common cold, SARS being a notable exception because it causes severe pneumonia as well as acute gastroenteritis. The risk of environmental contamination with the SARS-CoV is thus much higher. The evidence available thus far from outbreak investigations is strongly suggestive of droplet transmission [13] and to a much limited degree by aerosols [14] . It is not known if the SARS-CoV can also be acquired through the mouth or the conjunctivae, nor do we know if inhaled virus deposited in the throat can be directly translocated to the gut.",
            "cite_spans": [
                {
                    "start": 142,
                    "end": 146,
                    "text": "[11]",
                    "ref_id": "BIBREF10"
                },
                {
                    "start": 239,
                    "end": 243,
                    "text": "[12]",
                    "ref_id": "BIBREF11"
                },
                {
                    "start": 590,
                    "end": 594,
                    "text": "[13]",
                    "ref_id": "BIBREF12"
                },
                {
                    "start": 636,
                    "end": 640,
                    "text": "[14]",
                    "ref_id": "BIBREF13"
                }
            ],
            "ref_spans": [],
            "section": "Pathogenesis and shedding of infectious virus"
        },
        {
            "text": "In SARS, massive spiking of the immunological response leads to hypoxia and eventual respiratory distress syndrome [15] . Infection of the gastrointestinal tract causes acute diarrhea and may also result in peritonitis and necrotizing colitis [16] . The simultaneous involvement of the respiratory as well as the gastrointestinal tracts in SARS [11] is highly reminiscent of coronavirus infections in cattle [17] and other animals.",
            "cite_spans": [
                {
                    "start": 115,
                    "end": 119,
                    "text": "[15]",
                    "ref_id": "BIBREF14"
                },
                {
                    "start": 243,
                    "end": 247,
                    "text": "[16]",
                    "ref_id": "BIBREF15"
                },
                {
                    "start": 345,
                    "end": 349,
                    "text": "[11]",
                    "ref_id": "BIBREF10"
                },
                {
                    "start": 408,
                    "end": 412,
                    "text": "[17]",
                    "ref_id": "BIBREF16"
                }
            ],
            "ref_spans": [],
            "section": "Pathogenesis and shedding of infectious virus"
        },
        {
            "text": "Based on the pig model, the infectious period for coronaviruses is approximately 6 days post-infection [12, 18] with a peak at day 4 post-infection. This holds true for bovine [17, 19] and human infections [20, 21] as well. In pigs, virus release from the nose peaks on the fourth day of infection with yields of > 5.5 log 10 TCID 50 /g of nasal discharge, with the air around such animals containing nearly 2 log 10 of infectious virus/m 3 [12] . Similarly, infectious virus has been detected in the nasal discharge and feces of SARS patients [11] .",
            "cite_spans": [
                {
                    "start": 103,
                    "end": 107,
                    "text": "[12,",
                    "ref_id": "BIBREF11"
                },
                {
                    "start": 108,
                    "end": 111,
                    "text": "18]",
                    "ref_id": "BIBREF17"
                },
                {
                    "start": 176,
                    "end": 180,
                    "text": "[17,",
                    "ref_id": "BIBREF16"
                },
                {
                    "start": 181,
                    "end": 184,
                    "text": "19]",
                    "ref_id": "BIBREF18"
                },
                {
                    "start": 206,
                    "end": 210,
                    "text": "[20,",
                    "ref_id": "BIBREF19"
                },
                {
                    "start": 211,
                    "end": 214,
                    "text": "21]",
                    "ref_id": "BIBREF20"
                },
                {
                    "start": 441,
                    "end": 445,
                    "text": "[12]",
                    "ref_id": "BIBREF11"
                },
                {
                    "start": 544,
                    "end": 548,
                    "text": "[11]",
                    "ref_id": "BIBREF10"
                }
            ],
            "ref_spans": [],
            "section": "Pathogenesis and shedding of infectious virus"
        },
        {
            "text": "In general, a given pathogen must remain viable outside the host to allow for environmental spread, and the combined effect of many biotic and abiotic factors determines how long such viability can be retained. While environmental survival of coronaviruses has been studied to some degree under experimental conditions [22, 23] including SARS (Tab. 1), we know much less about the types and relative significance of vehicles in the in-nature spread of coronaviruses, in particular those that can infect humans. For example, infectious virus has been recovered from both droplets and air in the vicinity of pigs experimentally infected with the porcine respiratory coronavirus [12] , but the potential, if any, of droplets and aerosols in the spread of the virus to susceptible animals in the vicinity is unknown.",
            "cite_spans": [
                {
                    "start": 319,
                    "end": 323,
                    "text": "[22,",
                    "ref_id": "BIBREF21"
                },
                {
                    "start": 324,
                    "end": 327,
                    "text": "23]",
                    "ref_id": "BIBREF22"
                },
                {
                    "start": 676,
                    "end": 680,
                    "text": "[12]",
                    "ref_id": "BIBREF11"
                }
            ],
            "ref_spans": [],
            "section": "Environmental survival and spread of coronaviruses"
        },
        {
            "text": "The following is a summary of the available information on the environmental survival and spread of coronaviruses.",
            "cite_spans": [],
            "ref_spans": [],
            "section": "Environmental survival and spread of coronaviruses"
        },
        {
            "text": "The effect of relative humidity (RH) and air temperature has been studied on the airborne survival of experimentally aerosolized human coronavirus 229E [22] . As is true for enveloped viruses in general, 229E survived better at 30-50% RH than at 80% RH when the air temperature was about 20\u00b0C. Under these conditions, the half-lives of the virus at 30%, 50% and 80% RH were 27, 67 and 3 hours, respectively. Lowering the air temperature to 6\u00b0C increased the half-lives of the virus at 30% and 50% RH to 34 and 103 hours, respectively. But the lower air temperature produced the most dramatic effect on virus survival at 80% RH and changed its half-life from 3 to over 86 hours.",
            "cite_spans": [
                {
                    "start": 152,
                    "end": 156,
                    "text": "[22]",
                    "ref_id": "BIBREF21"
                }
            ],
            "ref_spans": [],
            "section": "Air"
        },
        {
            "text": "The available epidemiological evidence strongly suggests that SARS spreads through droplets [13] and such spread is much easier to control than that through aerosols. However, the pattern of spread of SARS-CoV in at least two instances is highly suggestive of airborne spread.",
            "cite_spans": [
                {
                    "start": 92,
                    "end": 96,
                    "text": "[13]",
                    "ref_id": "BIBREF12"
                }
            ],
            "ref_spans": [],
            "section": "Air"
        },
        {
            "text": "A cluster of 329 SARS cases was recorded in one apartment complex in Hong Kong with the majority of them occurring on several floors in one wing [24] . This pattern of spread is highly suggestive of virus dissemination by air, and the aerosolization of the virus was speculated to have occurred Environmental survival and microbicide inactivation of coronaviruses 203 from malfunctioning sewers in the building [24] . Rodent pests in the building have been hypothesized as possible amplifiers and disseminators of the virus [25] ; the virus, most likely acquired from infected residents, may have multiplied in the rodents, being released in their excreta and then possibly becoming airborne. While hantaviruses, for example, can infect humans from aerosolized rodent excreta [26] , the role of air in the transmission of SARS-CoV in this outbreak remains speculative at this stage. However, a more detailed analysis of the outbreak of SARS at that apartment complex suggests that the virus released by the patients themselves may have spread through air [27] .",
            "cite_spans": [
                {
                    "start": 145,
                    "end": 149,
                    "text": "[24]",
                    "ref_id": "BIBREF23"
                },
                {
                    "start": 411,
                    "end": 415,
                    "text": "[24]",
                    "ref_id": "BIBREF23"
                },
                {
                    "start": 524,
                    "end": 528,
                    "text": "[25]",
                    "ref_id": "BIBREF24"
                },
                {
                    "start": 776,
                    "end": 780,
                    "text": "[26]",
                    "ref_id": "BIBREF25"
                },
                {
                    "start": 1055,
                    "end": 1059,
                    "text": "[27]",
                    "ref_id": "BIBREF26"
                }
            ],
            "ref_spans": [],
            "section": "Air"
        },
        {
            "text": "Limited airborne spread of SARS may have occurred on board commercial aircraft. In one such instance, a symptomatic index case infected at least 22 of 120 (18.3%) passengers and crew during a three-hour flight [14] . Some of those infected were seated over 2 m (90 inches) away from the index case, a distance much longer than the 0.9 m (36 inches) generally believed to be the limit for droplet transmission. In such retrospective investigations it is virtually impossible to rule out the role of other possible means of virus spread. Also, the inside of an aircraft combines features which may be more conducive to airborne spread of pathogens.",
            "cite_spans": [
                {
                    "start": 210,
                    "end": 214,
                    "text": "[14]",
                    "ref_id": "BIBREF13"
                }
            ],
            "ref_spans": [],
            "section": "Air"
        },
        {
            "text": "A recent report from Canada suggests that oxygen delivery masks with open vents could promote the dispersal of respiratory pathogens such as SARS-CoV through their enhanced release in mists of exhaled pulmonary gases [28] . The exhaled moist air ejected from such oxygen masks is believed to carry pathogen-laden droplets over longer distances and possibly contribute to an increased risk of spread of respiratory infections in nosocomial settings. Additional investigations are needed to first prove that viruses such SARS-CoV can retain their infectivity better in the warm, moisture-laden air exhaled from oxygen masks. The findings on the influence of RH and air temperature on the airborne survival of coronavirus 229E would tend to suggest otherwise [22] .",
            "cite_spans": [
                {
                    "start": 217,
                    "end": 221,
                    "text": "[28]",
                    "ref_id": "BIBREF27"
                },
                {
                    "start": 756,
                    "end": 760,
                    "text": "[22]",
                    "ref_id": "BIBREF21"
                }
            ],
            "ref_spans": [],
            "section": "Air"
        },
        {
            "text": "SARS-CoV can survive for up to 96 hours in body fluids such as sputum, feces and serum, but is less stable in urine [20] . The fecal excretion of SARS-CoV generated much concern on the safety of handling and spreading municipal solids on lands [29] . There are no reports of the recovery of infectious SARS-CoV from raw sewage or sludge and if the behavior of other enveloped viruses such as HIV is an indication, it would be highly unlikely that the virus can survive in such wastes long enough to pose any risks to human health. In view of this, it is even less likely that the virus would survive the conventional methods of sewage and biosolids treatment. Therefore, any suggestion of health risk from handling of municipal wastes or their proper disposal would be difficult to justify [29] .",
            "cite_spans": [
                {
                    "start": 116,
                    "end": 120,
                    "text": "[20]",
                    "ref_id": "BIBREF19"
                },
                {
                    "start": 244,
                    "end": 248,
                    "text": "[29]",
                    "ref_id": null
                },
                {
                    "start": 790,
                    "end": 794,
                    "text": "[29]",
                    "ref_id": null
                }
            ],
            "ref_spans": [],
            "section": "Sewage and biosolids"
        },
        {
            "text": "Since safety and ethical considerations would not permit the experimental contamination of the hands of human subjects with SARS-CoV, we have used 229E as a surrogate to study the potential of coronaviruses to survive on hands. Preliminary findings from such experiments indicate that nearly 45% of infectious virus remains viable on the hands of adult subjects after 1 hour. This is in contrast to other enveloped respiratory viruses (e.g. parainfluenzavirus) which become essentially undetectable in about 10 minutes on human skin [30] .",
            "cite_spans": [
                {
                    "start": 533,
                    "end": 537,
                    "text": "[30]",
                    "ref_id": "BIBREF28"
                }
            ],
            "ref_spans": [],
            "section": "Skin"
        },
        {
            "text": "We are not aware of any published information on the survival of coronaviruses in food. Recent studies have shown SARS-CoV to survive in water to a very limited degree [20] . There is no evidence to suggest the spread of coronaviruses through food or water.",
            "cite_spans": [
                {
                    "start": 168,
                    "end": 172,
                    "text": "[20]",
                    "ref_id": "BIBREF19"
                }
            ],
            "ref_spans": [],
            "section": "Food and water"
        },
        {
            "text": "SARS-CoV [20] and 229E and OC43 [23] can retain their infectivity for several hours on porous and non-porous environmental surfaces. While such survival is better than that of other enveloped human pathogens [30] , there is no evidence to suggest that environmental surfaces play any direct or indirect role in the spread of coronaviruses.",
            "cite_spans": [
                {
                    "start": 9,
                    "end": 13,
                    "text": "[20]",
                    "ref_id": "BIBREF19"
                },
                {
                    "start": 32,
                    "end": 36,
                    "text": "[23]",
                    "ref_id": "BIBREF22"
                },
                {
                    "start": 208,
                    "end": 212,
                    "text": "[30]",
                    "ref_id": "BIBREF28"
                }
            ],
            "ref_spans": [],
            "section": "Environmental surfaces"
        },
        {
            "text": "Because of their enveloped nature coronaviruses are more susceptible to microbicides than non-enveloped viruses. In a comparative study, an animal parvovirus (non-enveloped) required 20-to 500-fold higher concentrations of the tested microbicides than were needed to inactivate an animal coronavirus [31] .",
            "cite_spans": [
                {
                    "start": 300,
                    "end": 304,
                    "text": "[31]",
                    "ref_id": "BIBREF29"
                }
            ],
            "ref_spans": [],
            "section": "Activity of microbicides against coronaviruses"
        },
        {
            "text": "Even before the advent of SARS considerable evaluation of the activity of microbicides against this virus group had been carried out. The following is a summary of this information.",
            "cite_spans": [],
            "ref_spans": [],
            "section": "Activity of microbicides against coronaviruses"
        },
        {
            "text": "Virucidal activity of several microbicides was tested against the mouse hepatitis virus (MHV) and the canine coronavirus (CCV), Kilham rat virus and canine parvovirus [32] . Both coronaviruses were readily inactivated by ethanol, isopropanol, benzalkonium chloride, iodophor, sodium hypochlorite, sodium chlorite, cresol soap and formaldehyde whereas the two parvoviruses proved to be considerably more resistant.",
            "cite_spans": [
                {
                    "start": 167,
                    "end": 171,
                    "text": "[32]",
                    "ref_id": "BIBREF30"
                }
            ],
            "ref_spans": [],
            "section": "Activity of microbicides against coronaviruses"
        },
        {
            "text": "The relative resistance of 229E to microbicides was compared to that of coxsackievirus B3, adenovirus type 5, and parainfluenzavirus type 3 using the second tier of a quantitative carrier test (QCT-2) [33] . Stainless steel disks were used as carriers and each one received 10 \u00b5l of the test virus, suspended in either faeces or mucin and the inoculum allowed to dry for 1 h under ambient conditions. After 1 min exposure to 20 \u00b5l of the disinfectant, the virus from the disks was immediately eluted and plaque assayed. The efficacy criterion of a \u2265 3 log 10 reduction in virus infectivity was used. As expected, the coronavirus proved to be generally less resistant to microbicides than the two non-enveloped viruses.",
            "cite_spans": [
                {
                    "start": 201,
                    "end": 205,
                    "text": "[33]",
                    "ref_id": "BIBREF31"
                }
            ],
            "ref_spans": [],
            "section": "Activity of microbicides against coronaviruses"
        },
        {
            "text": "In a more recent study, Wood and Payne [34] used a suspension test to assess the activity of chloroxylenol, benzalkonium chloride and cetrimide/chlorhexidine against three types of enveloped viruses (herpesvirus type 1, HIV-1 and a human coronavirus). The coronavirus was found to be generally more resistant than the other two enveloped viruses tested. While this observation is of interest, the findings have limited practical significance because the testing was based on a suspension test which presents the test microbicide with a weaker challenge than a carrier test protocol. A summary of all findings can be found in Table 2 .",
            "cite_spans": [
                {
                    "start": 39,
                    "end": 43,
                    "text": "[34]",
                    "ref_id": "BIBREF32"
                }
            ],
            "ref_spans": [
                {
                    "start": 625,
                    "end": 632,
                    "text": "Table 2",
                    "ref_id": "TABREF1"
                }
            ],
            "section": "Activity of microbicides against coronaviruses"
        },
        {
            "text": "Most alcohols used in disinfection are ethanol and isopropyl alcohol, both usually at a concentration of 70% [32, 34] . Without soil load, the transmissible gastroenteritis virus (TGEV) was reduced 4.5 log 10 by ethanol in the suspension test over 5 minutes [35] . Similarly, using QCT-2 and organic load, ethanol reduced 229E [33] by at least 3 log10 over the course of 5 minutes.",
            "cite_spans": [
                {
                    "start": 109,
                    "end": 113,
                    "text": "[32,",
                    "ref_id": "BIBREF30"
                },
                {
                    "start": 114,
                    "end": 117,
                    "text": "34]",
                    "ref_id": "BIBREF32"
                },
                {
                    "start": 258,
                    "end": 262,
                    "text": "[35]",
                    "ref_id": "BIBREF33"
                },
                {
                    "start": 327,
                    "end": 331,
                    "text": "[33]",
                    "ref_id": "BIBREF31"
                }
            ],
            "ref_spans": [],
            "section": "Alcohols"
        },
        {
            "text": "In tests using varying concentrations of sodium hypochlorite, 1000 ppm was effective against TGEV [34] , bovine coronavirus [31] and 229E [33] irrespective of test conditions. Chloramine T (C 7 H 7 SO 2 NNaCl) had similar results against bovine coronavirus and 229E. Povidone-iodine at a concentration of 1% reduced 229E by >3 log 10 with the QCT-2 test.",
            "cite_spans": [
                {
                    "start": 98,
                    "end": 102,
                    "text": "[34]",
                    "ref_id": "BIBREF32"
                },
                {
                    "start": 124,
                    "end": 128,
                    "text": "[31]",
                    "ref_id": "BIBREF29"
                },
                {
                    "start": 138,
                    "end": 142,
                    "text": "[33]",
                    "ref_id": "BIBREF31"
                }
            ],
            "ref_spans": [],
            "section": "Chlorine and other halides"
        },
        {
            "text": "Formaldehyde at 4% is used as an overall disinfecting and sterilizing solution albeit its use as a general disinfectant is not recommended. It is effective against TGEV, reducing it over 5 log 10 in under 5 minutes in suspension. At 2%, glutaraldehyde can inactivate 229E over 3 log 10 [33] in the QCT-2 test.",
            "cite_spans": [
                {
                    "start": 286,
                    "end": 290,
                    "text": "[33]",
                    "ref_id": "BIBREF31"
                }
            ],
            "ref_spans": [],
            "section": "Aldehydes"
        },
        {
            "text": "A quaternary ammonium disinfectant requires the presence of an ammonium ion and at least one of its hydrogen atoms substituted by an organic radical. As a result, the list of quaternary ammonium compounds is rather extensive. This type of disinfectant is usually cationic and affects a Environmental survival and microbicide inactivation of coronaviruses 207 cell by adhering to its negatively charged membrane and disrupting the ionic potential of the cell. In the case of viruses, this adherence can disrupt the envelope, rendering the virus noninfectious. The quaternary ammonium compounds are best represented by chlorhexidine gluconate, which is widely used in health care institutions and in consumer disinfectants and antiseptics. In both suspension and QCT-2 tests, chlorhexidine gluconate faired well against TGEV [35] and 229E [33, 34] . Concentrations ranging from 500 to 15,000 ppm were effective in reducing the virus by at least 3 log 10 .",
            "cite_spans": [
                {
                    "start": 823,
                    "end": 827,
                    "text": "[35]",
                    "ref_id": "BIBREF33"
                },
                {
                    "start": 837,
                    "end": 841,
                    "text": "[33,",
                    "ref_id": "BIBREF31"
                },
                {
                    "start": 842,
                    "end": 845,
                    "text": "34]",
                    "ref_id": "BIBREF32"
                }
            ],
            "ref_spans": [],
            "section": "Quaternary ammonium compounds"
        },
        {
            "text": "The phenolic compounds have a long history as their ancestry dates back to the use of coal tar soaps, whose active ingredients were creosol-based.",
            "cite_spans": [],
            "ref_spans": [],
            "section": "Phenolics"
        },
        {
            "text": "Although some disinfectants continue to use the same historical active ingredient, creosol, most have developed over time to become more active against various microbes. For example, o-phenylphenol at 200 ppm is highly ineffective against most viruses, including 229E in the QCT-2 test [33] . However, the addition of either a detergent, such as sodium lauryl sulphate, or ethanol, proves highly effective against the virus over 3 log 10 reduction is seen after 5 minutes. In the same way, many phenolic compounds rely on the helper effect of other chemicals to work effectively.",
            "cite_spans": [
                {
                    "start": 286,
                    "end": 290,
                    "text": "[33]",
                    "ref_id": "BIBREF31"
                }
            ],
            "ref_spans": [],
            "section": "Phenolics"
        },
        {
            "text": "The World Health Organization Laboratory Network has summarized the available data on SARS-CoV survival and inactivation [36] , which are redrawn for this chapter as Table 3 . Tables 4 and 5 summarize more recent studies on the inactivation of 229E by environmental surface disinfectants and antiseptics, respectively.",
            "cite_spans": [
                {
                    "start": 121,
                    "end": 125,
                    "text": "[36]",
                    "ref_id": "BIBREF34"
                }
            ],
            "ref_spans": [
                {
                    "start": 166,
                    "end": 173,
                    "text": "Table 3",
                    "ref_id": "TABREF2"
                },
                {
                    "start": 176,
                    "end": 190,
                    "text": "Tables 4 and 5",
                    "ref_id": "TABREF3"
                }
            ],
            "section": "Survival and inactivation of the SARS coronavirus"
        },
        {
            "text": "Despite the enhanced awareness of the potential of coronaviruses as animal and human pathogens, our understanding of their environmental survival and the exact means of their spread remains weak. Such information would be essential to design and implement more rational approaches to prevention and control of outbreaks of coronaviral infections. This is particularly relevant for the recently discovered SARS-CoV. However, the limited data available indicate that coronaviruses as a group are more stable in the environment that other enveloped viruses. The second tier of the quantitative carrier test (QCT-2) with stainless steel disks was used. Ten \u00b5l of the virus suspension with a soil load was dried on each carrier and the inoculum exposed to 50 \u00b5l of the test microbicide at 23 \u00b12\u00b0C. The fingerpad method (ASTM 1838) was used. Ten \u00b5l of virus in soil load was placed on each fingerpad & dried. The dried inoculum was exposed to 1 ml of control or test solution for 30 seconds. The fingerpads were eluted & eluates plaque assayed.",
            "cite_spans": [],
            "ref_spans": [],
            "section": "Concluding remarks"
        }
    ],
    "bib_entries": {
        "BIBREF0": {
            "ref_id": "b0",
            "title": "Coronaviridae: The viruses and their replication",
            "authors": [
                {
                    "first": "K",
                    "middle": [
                        "V"
                    ],
                    "last": "Holmes",
                    "suffix": ""
                },
                {
                    "first": "Mmc",
                    "middle": [],
                    "last": "Lai",
                    "suffix": ""
                }
            ],
            "year": 1996,
            "venue": "Virology",
            "volume": "1",
            "issn": "",
            "pages": "1075--1093",
            "other_ids": {}
        },
        "BIBREF1": {
            "ref_id": "b1",
            "title": "The coronaviruses",
            "authors": [
                {
                    "first": "A",
                    "middle": [
                        "Z"
                    ],
                    "last": "Kapikian",
                    "suffix": ""
                }
            ],
            "year": 1975,
            "venue": "Dev Biol Stand",
            "volume": "28",
            "issn": "",
            "pages": "42--64",
            "other_ids": {}
        },
        "BIBREF2": {
            "ref_id": "b2",
            "title": "Taxonomy of Viruses. ICTV Index to Virus Classification and Nomenclature",
            "authors": [],
            "year": null,
            "venue": "",
            "volume": "",
            "issn": "",
            "pages": "",
            "other_ids": {}
        },
        "BIBREF3": {
            "ref_id": "b3",
            "title": "Infectious bronchitis in laying fowls",
            "authors": [
                {
                    "first": "D",
                    "middle": [
                        "A"
                    ],
                    "last": "Grattan",
                    "suffix": ""
                }
            ],
            "year": 1968,
            "venue": "Vet Rec",
            "volume": "83",
            "issn": "",
            "pages": "",
            "other_ids": {}
        },
        "BIBREF4": {
            "ref_id": "b4",
            "title": "Comments on the etiology and immunity of transmissible (coronaviral) enteritis of turkeys (bluecomb)",
            "authors": [
                {
                    "first": "D",
                    "middle": [
                        "J"
                    ],
                    "last": "King",
                    "suffix": ""
                }
            ],
            "year": 1975,
            "venue": "Am J Vet Res",
            "volume": "36",
            "issn": "",
            "pages": "555--556",
            "other_ids": {}
        },
        "BIBREF5": {
            "ref_id": "b5",
            "title": "Characterization of a novel coronavirus associated with severe acute respiratory syndrome",
            "authors": [
                {
                    "first": "P",
                    "middle": [
                        "A"
                    ],
                    "last": "Rota",
                    "suffix": ""
                },
                {
                    "first": "M",
                    "middle": [
                        "S"
                    ],
                    "last": "Oberste",
                    "suffix": ""
                },
                {
                    "first": "S",
                    "middle": [
                        "S"
                    ],
                    "last": "Monroe",
                    "suffix": ""
                },
                {
                    "first": "W",
                    "middle": [
                        "A"
                    ],
                    "last": "Nix",
                    "suffix": ""
                },
                {
                    "first": "R",
                    "middle": [],
                    "last": "Campagnoli",
                    "suffix": ""
                },
                {
                    "first": "J",
                    "middle": [
                        "P"
                    ],
                    "last": "Icenogle",
                    "suffix": ""
                },
                {
                    "first": "S",
                    "middle": [],
                    "last": "Penaranda",
                    "suffix": ""
                },
                {
                    "first": "B",
                    "middle": [],
                    "last": "Bankamp",
                    "suffix": ""
                },
                {
                    "first": "K",
                    "middle": [],
                    "last": "Maher",
                    "suffix": ""
                },
                {
                    "first": "M",
                    "middle": [
                        "H"
                    ],
                    "last": "Chen",
                    "suffix": ""
                }
            ],
            "year": 2003,
            "venue": "Science",
            "volume": "300",
            "issn": "",
            "pages": "1394--1399",
            "other_ids": {}
        },
        "BIBREF6": {
            "ref_id": "b6",
            "title": "Mosaic evolution of the severe acute respiratory syndrome coronavirus",
            "authors": [
                {
                    "first": "J",
                    "middle": [],
                    "last": "Stavrinides",
                    "suffix": ""
                },
                {
                    "first": "D",
                    "middle": [
                        "S"
                    ],
                    "last": "Guttman",
                    "suffix": ""
                }
            ],
            "year": 2004,
            "venue": "J Virol",
            "volume": "78",
            "issn": "",
            "pages": "76--82",
            "other_ids": {}
        },
        "BIBREF7": {
            "ref_id": "b7",
            "title": "Severe acute respiratory syndrome (SARS) Report by the Secretariat",
            "authors": [],
            "year": 2003,
            "venue": "",
            "volume": "8422",
            "issn": "",
            "pages": "",
            "other_ids": {}
        },
        "BIBREF8": {
            "ref_id": "b8",
            "title": "Comparative analysis of the SARS coronavirus genome: a good start to a long journey",
            "authors": [
                {
                    "first": "E",
                    "middle": [
                        "G"
                    ],
                    "last": "Brown",
                    "suffix": ""
                },
                {
                    "first": "J",
                    "middle": [
                        "A"
                    ],
                    "last": "Tetro",
                    "suffix": ""
                }
            ],
            "year": 2003,
            "venue": "Lancet",
            "volume": "361",
            "issn": "",
            "pages": "1756--1757",
            "other_ids": {}
        },
        "BIBREF9": {
            "ref_id": "b9",
            "title": "SARS attacks, China shudders",
            "authors": [
                {
                    "first": "C",
                    "middle": [],
                    "last": "Chandler",
                    "suffix": ""
                }
            ],
            "year": 2003,
            "venue": "Fortune",
            "volume": "147",
            "issn": "",
            "pages": "",
            "other_ids": {}
        },
        "BIBREF10": {
            "ref_id": "b10",
            "title": "Enteric involvement of severe acute respiratory syndrome-associated coronavirus infection",
            "authors": [
                {
                    "first": "W",
                    "middle": [
                        "K"
                    ],
                    "last": "Leung",
                    "suffix": ""
                },
                {
                    "first": "K",
                    "middle": [
                        "F"
                    ],
                    "last": "To",
                    "suffix": ""
                },
                {
                    "first": "P",
                    "middle": [
                        "K"
                    ],
                    "last": "Chan",
                    "suffix": ""
                },
                {
                    "first": "H",
                    "middle": [
                        "L"
                    ],
                    "last": "Chan",
                    "suffix": ""
                },
                {
                    "first": "A",
                    "middle": [
                        "K"
                    ],
                    "last": "Wu",
                    "suffix": ""
                },
                {
                    "first": "N",
                    "middle": [],
                    "last": "Lee",
                    "suffix": ""
                },
                {
                    "first": "K",
                    "middle": [
                        "Y"
                    ],
                    "last": "Yuen",
                    "suffix": ""
                },
                {
                    "first": "J",
                    "middle": [
                        "J"
                    ],
                    "last": "Sung",
                    "suffix": ""
                }
            ],
            "year": 2003,
            "venue": "Gastroenterology",
            "volume": "125",
            "issn": "",
            "pages": "1011--1017",
            "other_ids": {}
        },
        "BIBREF11": {
            "ref_id": "b11",
            "title": "Experimental infection of pigs with the porcine respiratory coronavirus (PRCV): measure of viral excretion",
            "authors": [
                {
                    "first": "E",
                    "middle": [],
                    "last": "Bourgueil",
                    "suffix": ""
                },
                {
                    "first": "E",
                    "middle": [],
                    "last": "Hutet",
                    "suffix": ""
                },
                {
                    "first": "R",
                    "middle": [],
                    "last": "Cariolet",
                    "suffix": ""
                },
                {
                    "first": "P",
                    "middle": [],
                    "last": "Vannier",
                    "suffix": ""
                }
            ],
            "year": 1992,
            "venue": "Vet Microbiol",
            "volume": "31",
            "issn": "",
            "pages": "11--18",
            "other_ids": {}
        },
        "BIBREF12": {
            "ref_id": "b12",
            "title": "SARS transmission: language and droplet production",
            "authors": [
                {
                    "first": "S",
                    "middle": [],
                    "last": "Inouye",
                    "suffix": ""
                }
            ],
            "year": 2003,
            "venue": "Lancet",
            "volume": "362",
            "issn": "",
            "pages": "",
            "other_ids": {}
        },
        "BIBREF13": {
            "ref_id": "b13",
            "title": "Transmission of the severe acute respiratory syndrome on aircraft",
            "authors": [
                {
                    "first": "S",
                    "middle": [
                        "J"
                    ],
                    "last": "Olsen",
                    "suffix": ""
                },
                {
                    "first": "H",
                    "middle": [
                        "L"
                    ],
                    "last": "Chang",
                    "suffix": ""
                },
                {
                    "first": "T",
                    "middle": [
                        "Y"
                    ],
                    "last": "Cheung",
                    "suffix": ""
                },
                {
                    "first": "A",
                    "middle": [
                        "F"
                    ],
                    "last": "Tang",
                    "suffix": ""
                },
                {
                    "first": "T",
                    "middle": [
                        "L"
                    ],
                    "last": "Fisk",
                    "suffix": ""
                },
                {
                    "first": "S",
                    "middle": [
                        "P"
                    ],
                    "last": "Ooi",
                    "suffix": ""
                },
                {
                    "first": "H",
                    "middle": [
                        "W"
                    ],
                    "last": "Kuo",
                    "suffix": ""
                },
                {
                    "first": "D",
                    "middle": [
                        "D"
                    ],
                    "last": "Jiang",
                    "suffix": ""
                },
                {
                    "first": "K",
                    "middle": [
                        "T"
                    ],
                    "last": "Chen",
                    "suffix": ""
                },
                {
                    "first": "J",
                    "middle": [],
                    "last": "Lando",
                    "suffix": ""
                }
            ],
            "year": 2003,
            "venue": "N Engl J Med",
            "volume": "349",
            "issn": "",
            "pages": "2416--2422",
            "other_ids": {}
        },
        "BIBREF14": {
            "ref_id": "b14",
            "title": "Severe acute respiratory syndrome (sars) in children",
            "authors": [
                {
                    "first": "G",
                    "middle": [
                        "W"
                    ],
                    "last": "Wong",
                    "suffix": ""
                },
                {
                    "first": "T",
                    "middle": [
                        "F"
                    ],
                    "last": "Fok",
                    "suffix": ""
                }
            ],
            "year": 2004,
            "venue": "Pediatr Pulmonol",
            "volume": "37",
            "issn": "S26",
            "pages": "69--71",
            "other_ids": {}
        },
        "BIBREF15": {
            "ref_id": "b15",
            "title": "Detection of feline coronavirus in captive Felidae in the USA",
            "authors": [
                {
                    "first": "M",
                    "middle": [],
                    "last": "Kennedy",
                    "suffix": ""
                },
                {
                    "first": "S",
                    "middle": [],
                    "last": "Citino",
                    "suffix": ""
                },
                {
                    "first": "A",
                    "middle": [
                        "H"
                    ],
                    "last": "Mcnabb",
                    "suffix": ""
                },
                {
                    "first": "A",
                    "middle": [
                        "S"
                    ],
                    "last": "Moffatt",
                    "suffix": ""
                },
                {
                    "first": "K",
                    "middle": [],
                    "last": "Gertz",
                    "suffix": ""
                },
                {
                    "first": "S",
                    "middle": [],
                    "last": "Kania",
                    "suffix": ""
                }
            ],
            "year": 2002,
            "venue": "J Vet Diagn Invest",
            "volume": "14",
            "issn": "",
            "pages": "520--522",
            "other_ids": {}
        },
        "BIBREF16": {
            "ref_id": "b16",
            "title": "Detection of respiratory and enteric shedding of bovine coronaviruses in cattle in an Ohio feedlot",
            "authors": [
                {
                    "first": "M",
                    "middle": [],
                    "last": "Hasoksuz",
                    "suffix": ""
                },
                {
                    "first": "A",
                    "middle": [
                        "E"
                    ],
                    "last": "Hoet",
                    "suffix": ""
                },
                {
                    "first": "S",
                    "middle": [
                        "C"
                    ],
                    "last": "Loerch",
                    "suffix": ""
                },
                {
                    "first": "T",
                    "middle": [
                        "E"
                    ],
                    "last": "Wittum",
                    "suffix": ""
                },
                {
                    "first": "P",
                    "middle": [
                        "R"
                    ],
                    "last": "Nielsen",
                    "suffix": ""
                },
                {
                    "first": "L",
                    "middle": [
                        "J"
                    ],
                    "last": "Saif",
                    "suffix": ""
                }
            ],
            "year": 2002,
            "venue": "J Vet Diagn Invest",
            "volume": "14",
            "issn": "",
            "pages": "308--313",
            "other_ids": {}
        },
        "BIBREF17": {
            "ref_id": "b17",
            "title": "Dual infections of feeder pigs with porcine reproductive and respiratory syndrome virus followed by porcine respiratory coronavirus or swine influenza virus: a clinical and virological study",
            "authors": [
                {
                    "first": "K",
                    "middle": [],
                    "last": "Van Reeth",
                    "suffix": ""
                },
                {
                    "first": "H",
                    "middle": [],
                    "last": "Nauwynck",
                    "suffix": ""
                },
                {
                    "first": "M",
                    "middle": [],
                    "last": "Pensaert",
                    "suffix": ""
                }
            ],
            "year": 1996,
            "venue": "Vet Microbiol",
            "volume": "48",
            "issn": "",
            "pages": "325--335",
            "other_ids": {}
        },
        "BIBREF18": {
            "ref_id": "b18",
            "title": "Association of enteric shedding of bovine torovirus (Breda virus) and other enteropathogens with diarrhea in veal calves",
            "authors": [
                {
                    "first": "A",
                    "middle": [
                        "E"
                    ],
                    "last": "Hoet",
                    "suffix": ""
                },
                {
                    "first": "J",
                    "middle": [],
                    "last": "Smiley",
                    "suffix": ""
                },
                {
                    "first": "C",
                    "middle": [],
                    "last": "Thomas",
                    "suffix": ""
                },
                {
                    "first": "P",
                    "middle": [
                        "R"
                    ],
                    "last": "Nielsen",
                    "suffix": ""
                },
                {
                    "first": "T",
                    "middle": [
                        "E"
                    ],
                    "last": "Wittum",
                    "suffix": ""
                },
                {
                    "first": "L",
                    "middle": [
                        "J"
                    ],
                    "last": "Saif",
                    "suffix": ""
                }
            ],
            "year": 2003,
            "venue": "Am J Vet Res",
            "volume": "64",
            "issn": "",
            "pages": "485--490",
            "other_ids": {}
        },
        "BIBREF19": {
            "ref_id": "b19",
            "title": "Stability of SARS coronavirus in human specimens and environment and its sensitivity to heating and UV irradiation",
            "authors": [
                {
                    "first": "S",
                    "middle": [
                        "M"
                    ],
                    "last": "Duan",
                    "suffix": ""
                },
                {
                    "first": "X",
                    "middle": [
                        "S"
                    ],
                    "last": "Zhao",
                    "suffix": ""
                },
                {
                    "first": "R",
                    "middle": [
                        "F"
                    ],
                    "last": "Wen",
                    "suffix": ""
                },
                {
                    "first": "J",
                    "middle": [
                        "J"
                    ],
                    "last": "Huang",
                    "suffix": ""
                },
                {
                    "first": "G",
                    "middle": [
                        "H"
                    ],
                    "last": "Pi",
                    "suffix": ""
                },
                {
                    "first": "S",
                    "middle": [
                        "X"
                    ],
                    "last": "Zhang",
                    "suffix": ""
                },
                {
                    "first": "J",
                    "middle": [],
                    "last": "Han",
                    "suffix": ""
                },
                {
                    "first": "S",
                    "middle": [
                        "L"
                    ],
                    "last": "Bi",
                    "suffix": ""
                },
                {
                    "first": "L",
                    "middle": [],
                    "last": "Ruan",
                    "suffix": ""
                },
                {
                    "first": "Xp; Sars Research",
                    "middle": [],
                    "last": "Dong",
                    "suffix": ""
                },
                {
                    "first": "",
                    "middle": [],
                    "last": "Team",
                    "suffix": ""
                }
            ],
            "year": 2003,
            "venue": "Biomed Environ Sci",
            "volume": "16",
            "issn": "",
            "pages": "246--255",
            "other_ids": {}
        },
        "BIBREF20": {
            "ref_id": "b20",
            "title": "Evaluation of concurrent shedding of bovine coronavirus via the respiratory tract and enteric route in feedlot cattle",
            "authors": [
                {
                    "first": "K",
                    "middle": [
                        "O"
                    ],
                    "last": "Cho",
                    "suffix": ""
                },
                {
                    "first": "A",
                    "middle": [
                        "E"
                    ],
                    "last": "Hoet",
                    "suffix": ""
                },
                {
                    "first": "S",
                    "middle": [
                        "C"
                    ],
                    "last": "Loerch",
                    "suffix": ""
                },
                {
                    "first": "T",
                    "middle": [
                        "E"
                    ],
                    "last": "Wittum",
                    "suffix": ""
                },
                {
                    "first": "L",
                    "middle": [
                        "J"
                    ],
                    "last": "Saif",
                    "suffix": ""
                }
            ],
            "year": 2001,
            "venue": "Am J Vet Res",
            "volume": "62",
            "issn": "",
            "pages": "1436--1441",
            "other_ids": {}
        },
        "BIBREF21": {
            "ref_id": "b21",
            "title": "Survival characteristics of airborne human coronavirus 229E",
            "authors": [
                {
                    "first": "M",
                    "middle": [
                        "K"
                    ],
                    "last": "Ijaz",
                    "suffix": ""
                },
                {
                    "first": "A",
                    "middle": [
                        "H"
                    ],
                    "last": "Brunner",
                    "suffix": ""
                },
                {
                    "first": "S",
                    "middle": [
                        "A"
                    ],
                    "last": "Sattar",
                    "suffix": ""
                },
                {
                    "first": "R",
                    "middle": [
                        "C"
                    ],
                    "last": "Nair",
                    "suffix": ""
                },
                {
                    "first": "Johnson-Lussenburg",
                    "middle": [],
                    "last": "Cm",
                    "suffix": ""
                }
            ],
            "year": 1985,
            "venue": "J Gen Virol",
            "volume": "66",
            "issn": "",
            "pages": "2743--2748",
            "other_ids": {}
        },
        "BIBREF22": {
            "ref_id": "b22",
            "title": "Survival of human coronaviruses 229E and OC43 in suspension and after drying onsurfaces: a possible source ofhospitalacquired infections",
            "authors": [
                {
                    "first": "J",
                    "middle": [],
                    "last": "Sizun",
                    "suffix": ""
                },
                {
                    "first": "M",
                    "middle": [
                        "W"
                    ],
                    "last": "Yu",
                    "suffix": ""
                },
                {
                    "first": "P",
                    "middle": [
                        "J"
                    ],
                    "last": "Talbot",
                    "suffix": ""
                }
            ],
            "year": 2000,
            "venue": "J Hosp Infect",
            "volume": "46",
            "issn": "",
            "pages": "55--60",
            "other_ids": {}
        },
        "BIBREF23": {
            "ref_id": "b23",
            "title": "The mystery of Amoy Gardens",
            "authors": [
                {
                    "first": "S",
                    "middle": [
                        "K"
                    ],
                    "last": "Ng",
                    "suffix": ""
                }
            ],
            "year": 2004,
            "venue": "At the Epicentre: Hong Kong and the SARS Outbreak",
            "volume": "",
            "issn": "",
            "pages": "117--138",
            "other_ids": {}
        },
        "BIBREF24": {
            "ref_id": "b24",
            "title": "Possible role of an animal vector in the SARS outbreak at Amoy Gardens",
            "authors": [
                {
                    "first": "S",
                    "middle": [
                        "K"
                    ],
                    "last": "Ng",
                    "suffix": ""
                }
            ],
            "year": 2003,
            "venue": "Lancet",
            "volume": "362",
            "issn": "",
            "pages": "570--572",
            "other_ids": {}
        },
        "BIBREF25": {
            "ref_id": "b25",
            "title": "Hantavirus pulmonary syndrome: the new American hemorrhagic fever",
            "authors": [
                {
                    "first": "C",
                    "middle": [
                        "J"
                    ],
                    "last": "Peters",
                    "suffix": ""
                },
                {
                    "first": "A",
                    "middle": [
                        "S"
                    ],
                    "last": "Khan",
                    "suffix": ""
                }
            ],
            "year": 2002,
            "venue": "Clin Infect Dis",
            "volume": "34",
            "issn": "",
            "pages": "1224--1231",
            "other_ids": {}
        },
        "BIBREF26": {
            "ref_id": "b26",
            "title": "Evidence of airborne transmission of the severe acute respiratory syndrome virus",
            "authors": [
                {
                    "first": "Its",
                    "middle": [],
                    "last": "Yu",
                    "suffix": ""
                },
                {
                    "first": "Y",
                    "middle": [],
                    "last": "Li",
                    "suffix": ""
                },
                {
                    "first": "T",
                    "middle": [
                        "W"
                    ],
                    "last": "Wong",
                    "suffix": ""
                },
                {
                    "first": "W",
                    "middle": [],
                    "last": "Tam",
                    "suffix": ""
                },
                {
                    "first": "A",
                    "middle": [
                        "T"
                    ],
                    "last": "Chan",
                    "suffix": ""
                },
                {
                    "first": "J",
                    "middle": [
                        "H"
                    ],
                    "last": "Lee",
                    "suffix": ""
                },
                {
                    "first": "D",
                    "middle": [
                        "Y"
                    ],
                    "last": "Leung",
                    "suffix": ""
                },
                {
                    "first": "T",
                    "middle": [],
                    "last": "Ho",
                    "suffix": ""
                }
            ],
            "year": 2004,
            "venue": "N Eng J Med",
            "volume": "350",
            "issn": "",
            "pages": "1731--1739",
            "other_ids": {}
        },
        "BIBREF27": {
            "ref_id": "b27",
            "title": "Dispersal of respiratory droplets with open vs closed oxygen delivery masks: implications for the transmission of severe acute respiratory syndrome",
            "authors": [
                {
                    "first": "R",
                    "middle": [],
                    "last": "Somogyi",
                    "suffix": ""
                },
                {
                    "first": "A",
                    "middle": [
                        "E"
                    ],
                    "last": "Vesely",
                    "suffix": ""
                },
                {
                    "first": "T",
                    "middle": [],
                    "last": "Azami",
                    "suffix": ""
                },
                {
                    "first": "D",
                    "middle": [],
                    "last": "Preiss",
                    "suffix": ""
                },
                {
                    "first": "J",
                    "middle": [],
                    "last": "Fisher",
                    "suffix": ""
                },
                {
                    "first": "J",
                    "middle": [],
                    "last": "Correia",
                    "suffix": ""
                },
                {
                    "first": "R",
                    "middle": [
                        "A"
                    ],
                    "last": "Fowler",
                    "suffix": ""
                }
            ],
            "year": 2004,
            "venue": "Chest",
            "volume": "125",
            "issn": "",
            "pages": "1155--1157",
            "other_ids": {}
        },
        "BIBREF28": {
            "ref_id": "b28",
            "title": "Transmission of viral infections through animate and inanimate surfaces and infection control through chemical disinfection",
            "authors": [
                {
                    "first": "S",
                    "middle": [
                        "A"
                    ],
                    "last": "Sattar",
                    "suffix": ""
                },
                {
                    "first": "V",
                    "middle": [
                        "S"
                    ],
                    "last": "Springthorpe",
                    "suffix": ""
                }
            ],
            "year": 1996,
            "venue": "Modeling Disease Transmission and Its Prevention by Disinfection",
            "volume": "",
            "issn": "",
            "pages": "224--257",
            "other_ids": {}
        },
        "BIBREF29": {
            "ref_id": "b29",
            "title": "Virucidal efficacy of eight disinfectants against pneumovirus, coronavirus and parvovirus",
            "authors": [
                {
                    "first": "P",
                    "middle": [],
                    "last": "Maris",
                    "suffix": ""
                }
            ],
            "year": 1990,
            "venue": "Ann Rech Vet",
            "volume": "21",
            "issn": "",
            "pages": "275--279",
            "other_ids": {}
        },
        "BIBREF30": {
            "ref_id": "b30",
            "title": "Virucidal efficacy of physico-chemical treatments against coronaviruses and parvoviruses of laboratory animals",
            "authors": [
                {
                    "first": "M",
                    "middle": [],
                    "last": "Saknimit",
                    "suffix": ""
                },
                {
                    "first": "I",
                    "middle": [],
                    "last": "Inatsuki",
                    "suffix": ""
                },
                {
                    "first": "Y",
                    "middle": [],
                    "last": "Sugiyama",
                    "suffix": ""
                },
                {
                    "first": "K",
                    "middle": [],
                    "last": "Yagami",
                    "suffix": ""
                }
            ],
            "year": 1988,
            "venue": "Jikken Dobutsu",
            "volume": "37",
            "issn": "",
            "pages": "341--345",
            "other_ids": {}
        },
        "BIBREF31": {
            "ref_id": "b31",
            "title": "Chemical disinfection of non-porous inanimate surfaces experimentally contaminated with four human pathogenic viruses",
            "authors": [
                {
                    "first": "S",
                    "middle": [
                        "A"
                    ],
                    "last": "Sattar",
                    "suffix": ""
                },
                {
                    "first": "V",
                    "middle": [
                        "S"
                    ],
                    "last": "Springthorpe",
                    "suffix": ""
                },
                {
                    "first": "Y",
                    "middle": [],
                    "last": "Karim",
                    "suffix": ""
                },
                {
                    "first": "P",
                    "middle": [],
                    "last": "Loro",
                    "suffix": ""
                }
            ],
            "year": 1989,
            "venue": "Epidemiol Infect",
            "volume": "102",
            "issn": "",
            "pages": "493--505",
            "other_ids": {}
        },
        "BIBREF32": {
            "ref_id": "b32",
            "title": "The action of three antiseptics/disinfectants against enveloped and non-enveloped viruses",
            "authors": [
                {
                    "first": "A",
                    "middle": [],
                    "last": "Wood",
                    "suffix": ""
                },
                {
                    "first": "D",
                    "middle": [],
                    "last": "Payne",
                    "suffix": ""
                }
            ],
            "year": 1998,
            "venue": "J Hosp Infect",
            "volume": "38",
            "issn": "",
            "pages": "283--295",
            "other_ids": {}
        },
        "BIBREF33": {
            "ref_id": "b33",
            "title": "Laboratory evaluation of selected disinfectants as virucidal agents against porcine parvovirus, pseudorabies virus, and transmissible gastroenteritis virus",
            "authors": [
                {
                    "first": "T",
                    "middle": [
                        "T"
                    ],
                    "last": "Brown",
                    "suffix": ""
                }
            ],
            "year": 1981,
            "venue": "Am J Vet Res",
            "volume": "42",
            "issn": "",
            "pages": "1033--1036",
            "other_ids": {}
        },
        "BIBREF34": {
            "ref_id": "b34",
            "title": "World Health Organization. First data on stability and resistance of SARS coronavirus compiled by members of WHO laboratory network",
            "authors": [],
            "year": null,
            "venue": "",
            "volume": "",
            "issn": "",
            "pages": "",
            "other_ids": {}
        }
    },
    "ref_entries": {
        "TABREF0": {
            "text": "Environmental survival of SARS-CoV (modified from[20]",
            "latex": null,
            "type": "table"
        },
        "TABREF1": {
            "text": "Effect of microbicides on coronaviruses",
            "latex": null,
            "type": "table"
        },
        "TABREF2": {
            "text": "",
            "latex": null,
            "type": "table"
        },
        "TABREF3": {
            "text": "Activity of microbicides against coronavirus 229E (Sattar et al., unpublished data) MicrobicideDilution tested (ppm) Contact time (min) Log 10 reduction",
            "latex": null,
            "type": "table"
        },
        "TABREF4": {
            "text": "Activity of an ethanol-based hand rub against coronavirus 229E (Sattar et al., unpublished data)",
            "latex": null,
            "type": "table"
        }
    },
    "back_matter": []
}