{
    "paper_id": "05f35dc7cb2959fd68695357a0fd393d3a30df8c",
    "metadata": {
        "title": "Community Acquired Pneumonia Principles of Management Site-of-Care Decisions Patients admitted to the ICU with severe community-acquired pneumonia (CAP) generally fall into one of two categories: (1) those whose",
        "authors": [
            {
                "first": "Richard",
                "middle": [
                    "G"
                ],
                "last": "Wunderink",
                "suffix": "",
                "affiliation": {
                    "laboratory": "",
                    "institution": "Northwestern University",
                    "location": {
                        "settlement": "Chicago",
                        "region": "IL",
                        "country": "USA"
                    }
                },
                "email": "r-wunderink@northwestern.edu"
            },
            {
                "first": "Mark",
                "middle": [
                    "W"
                ],
                "last": "Landmeier",
                "suffix": "",
                "affiliation": {
                    "laboratory": "",
                    "institution": "Northwestern University",
                    "location": {
                        "settlement": "Chicago",
                        "region": "IL",
                        "country": "USA"
                    }
                },
                "email": ""
            },
            {
                "first": "R",
                "middle": [
                    "G"
                ],
                "last": "Wunderink",
                "suffix": "",
                "affiliation": {
                    "laboratory": "",
                    "institution": "Northwestern University",
                    "location": {
                        "settlement": "Chicago",
                        "region": "IL",
                        "country": "USA"
                    }
                },
                "email": ""
            },
            {
                "first": "M",
                "middle": [
                    "W"
                ],
                "last": "Landmeier",
                "suffix": "",
                "affiliation": {
                    "laboratory": "",
                    "institution": "Northwestern University",
                    "location": {
                        "settlement": "Chicago",
                        "region": "IL",
                        "country": "USA"
                    }
                },
                "email": ""
            }
        ]
    },
    "abstract": [
        {
            "text": "A 31 year old male with a history of diabetes mellitus type 1 and recent skin infection of the neck (for which he underwent incision and drainage and levofloxacin treatment) presented to the emergency department with a three day history of fever, cough productive of bloody sputum, and shortness of breath. He had recently returned from a trip to Asia. He was tachycardic but normotensive and had an oxygen saturation of 93 % on 3 L nasal cannula. WBC count was 21.8 K/UL with 90 % neutrophils, BUN and creatinine were 8 mg/dL and 1.0 mg/dL, respectively, and glucose >350 mg/dL. Suspicion of cavitary pneumonia on chest radiograph was confirmed by computed tomography (Fig. 20.1 ).",
            "cite_spans": [],
            "ref_spans": [
                {
                    "start": 669,
                    "end": 679,
                    "text": "(Fig. 20.1",
                    "ref_id": null
                }
            ],
            "section": "Abstract"
        }
    ],
    "body_text": [
        {
            "text": "Because of additional concern for meliodosis, the patient was started on ceftazidime, azithromycin, and vancomycin. He developed progressive hypoxemia and agitation, at which time he was intubated and started on mechanical ventilation. Bronchoscopic bronchoalveolar lavage (BAL) of the right lower lobe revealed 240 WBCs with 81 % neutrophils. Sampling of a rapidly progressing pleural effusion showed a pleural fluid pH 6.95, glucose 44 mg/dL and LDH 1842 IU/L. Gram stain of both fluids revealed clusters of gram positive cocci. Chest tube drainage of the right pleural space was performed. Urinary antigen testing for Streptocococcus pneumoniae and fungal serologies were negative. He was empirically switched from vancomycin to linezolid. BAL and pleural fluid cultures grew methicillin-resistant Staphylococcus aureus (MRSA). Serum immunoglobulins (IGs) were subsequently found to be very low and he was given IVIG. After a prolonged ICU course, he was ultimately discharged to an acute rehabilitation facility and subsequently returned to full functional status. He continues to receive intermittent outpatient IVIG. Patients in need of mechanical ventilation or vasopressor support because of septic shock automatically require intensive care. However, the decision to admit to the ICU is more difficult when such obvious needs are not present. Early identification of patients likely to deteriorate is important as increased mortality is associated with ICU transfer for delayed respiratory failure or onset of septic shock. Pooled analysis of four prospective CAP studies, of which 138 had delayed-transfer compared to 315 direct Emergency Department (ED) to ICU admissions, demonstrated that the delayed-transfer group had higher 28-day mortality (23.4 % vs. 11.7 %, p < 0.02) and hospital length of stay (13 days vs. 7 days, p < 0.001) in propensity-matched analysis [1] .",
            "cite_spans": [
                {
                    "start": 1878,
                    "end": 1881,
                    "text": "[1]",
                    "ref_id": "BIBREF0"
                }
            ],
            "ref_spans": [],
            "section": ""
        },
        {
            "text": "While some delayed transfers to the ICU represent progressive pneumonia despite appropriate treatment, many patients have subtle clinical findings upon presentation that predict a more aggressive approach will lead to improved outcomes. Using the presence of \u22653 IDSA/ATS minor criteria (Table 20 .1) [2] in the ED, a before/ after quality improvement project demonstrated decreased mortality (adjusted odds ratio [OR] 0.24, 95 % confidence interval [CI] 0.09-0.670, p = 0.006), fewer delayed ICU transfers (14.8 % vs. 32 %, p < 0.001), and minimal increase in direct admissions to the ICU when an aggressive pre-ICU assessment and resuscitation protocol was utilized [3] .",
            "cite_spans": [
                {
                    "start": 300,
                    "end": 303,
                    "text": "[2]",
                    "ref_id": "BIBREF1"
                },
                {
                    "start": 667,
                    "end": 670,
                    "text": "[3]",
                    "ref_id": "BIBREF2"
                }
            ],
            "ref_spans": [
                {
                    "start": 286,
                    "end": 295,
                    "text": "(Table 20",
                    "ref_id": "TABREF0"
                }
            ],
            "section": ""
        },
        {
            "text": "The Pneumonia Severity Index (PSI) and CURB-65 Score, while useful in predicting 30-day mortality and need for hospital admission, have limited ability to predict the need for intensive respiratory monitoring or vasopressor support initially. In addition to the IDSA/ATS minor criteria, several other scores such as SMART-COP [4] generally have very good sensitivity if the threshold is set optimally. However, such scoring tools will lead to a significant increase in ICU admissions if followed rigorously, and they require prospective validation.",
            "cite_spans": [
                {
                    "start": 326,
                    "end": 329,
                    "text": "[4]",
                    "ref_id": "BIBREF3"
                }
            ],
            "ref_spans": [],
            "section": ""
        },
        {
            "text": "Aggressive diagnostic testing is most useful in those with severe CAP requiring ICU admission and in those with risk factors for healthcare-associated pneumonia (HCAP). In such patients, the probability of finding a pathogen resistant to usual CAP empirical therapy (e.g. Staphylococcus aureus or Pseudomonas aeruginosa) is increased, and identification of a specific pathogen can lead to tailored antimicrobials, thus decreasing cost and exposure to unnecessary medications [5] .",
            "cite_spans": [
                {
                    "start": 475,
                    "end": 478,
                    "text": "[5]",
                    "ref_id": "BIBREF4"
                }
            ],
            "ref_spans": [],
            "section": "Diagnostic Testing"
        },
        {
            "text": "In a patient invasively ventilated, direct access to the lower respiratory tract provides the opportunity to perform an endotracheal aspirate or bronchoalveolar lavage (BAL). Moreover, bronchoscopic BAL can be useful in those where sputum or blood cultures do not yield a pathogen. In a prospective study of 262 patients admitted with CAP, fiberoptic bronchoscopic BAL provided additional diagnostic value in 49 % of patients who could not expectorate sputum and 52 % who had treatment failure 72 h after admission [6] .",
            "cite_spans": [
                {
                    "start": 515,
                    "end": 518,
                    "text": "[6]",
                    "ref_id": "BIBREF5"
                }
            ],
            "ref_spans": [],
            "section": "Diagnostic Testing"
        },
        {
            "text": "Blood and sputum cultures generally have low sensitivity but should still be performed upon transfer to the ICU, even in the non-intubated patient. Growth inhibition by antibiotics decreases the diagnostic yield of both tests but less so when S. aureus or gram-negative bacilli are the predominant pathogen [2] . Pleural fluid sampling is necessary in a CAP patient with a large pleural effusion (either upon admission or one which develops after empirical treatment for CAP), as a complicated pleural space requires adequate drainage.",
            "cite_spans": [
                {
                    "start": 307,
                    "end": 310,
                    "text": "[2]",
                    "ref_id": "BIBREF1"
                }
            ],
            "ref_spans": [],
            "section": "Diagnostic Testing"
        },
        {
            "text": "Urinary antigen testing has reasonable sensitivity and excellent specificity for detecting Streptococcus pneumoniae and Legionella pneumophila serogroup 1. The test can stay positive for over 3 days in patients with S. pneumoniae and for weeks with L. pneumophila [2] . Although antibiotic sensitivity data cannot be obtained, the test is qualitatively important to verify that an antibiotic regimen adequately covers such pathogens.",
            "cite_spans": [
                {
                    "start": 264,
                    "end": 267,
                    "text": "[2]",
                    "ref_id": "BIBREF1"
                }
            ],
            "ref_spans": [],
            "section": "Diagnostic Testing"
        },
        {
            "text": "Viral testing is important, especially in the appropriate season. A positive influenza test in a critically-ill patient should be an impetus for antiviral therapy, which can hasten disease resolution and decrease spread.",
            "cite_spans": [],
            "ref_spans": [],
            "section": "Diagnostic Testing"
        },
        {
            "text": "Microorganisms responsible for CAP in the ICU mirror those of the outpatient setting, with the addition of gram-negative pathogens and MRSA. A review of 9 studies of patients with CAP admitted to the ICU showed that the most common typical bacterial pathogens were S. pneumoniae, L. pneumophila, Haemophilus influenzae, aerobic gram-negative bacilli, and S. aureus [7] . The relative frequency of atypical pathogens in the ICU setting is unclear because of heterogeneity in diagnostic technique but is approximately 20 % [2] . Respiratory viruses, either as a pure or co-infection, can be detected in up to 49 % of severe pneumonias. Common culprits include parainfluenza virus, human metapneumovirus, influenza A and B, respiratory syncytial virus, and adenovirus [8, 9] . Much less common viral pathogens include coronaviruses, such as the SARS virus and Middle East respiratory syndrome coronavirus (MERS-CoV), parechoviruses, and enteroviruses. Epidemiologic risk factors are helpful to suggest less common etiologies (Table 20. 2). Structural lung disease (e.g. COPD with repeated exacerbations or bronchiectasis), prior hospitalization and healthcare exposure pose an increased risk of Pseudomonas, chronic alcoholism is a risk for other gram-negative pathogens (Klebsiella pneumoniae or Acinetobacter species), and end-stage renal disease, injection drug use, prior influenza infection, and prior treatment with fluoroquinolones pose an increased risk of S. aureus [2] .",
            "cite_spans": [
                {
                    "start": 365,
                    "end": 368,
                    "text": "[7]",
                    "ref_id": "BIBREF6"
                },
                {
                    "start": 521,
                    "end": 524,
                    "text": "[2]",
                    "ref_id": "BIBREF1"
                },
                {
                    "start": 765,
                    "end": 768,
                    "text": "[8,",
                    "ref_id": "BIBREF7"
                },
                {
                    "start": 769,
                    "end": 771,
                    "text": "9]",
                    "ref_id": "BIBREF8"
                },
                {
                    "start": 1472,
                    "end": 1475,
                    "text": "[2]",
                    "ref_id": "BIBREF1"
                }
            ],
            "ref_spans": [
                {
                    "start": 1022,
                    "end": 1032,
                    "text": "(Table 20.",
                    "ref_id": "TABREF0"
                }
            ],
            "section": "Microbial Culprits"
        },
        {
            "text": "With severe CAP, timely diagnosis and adequate empirical antimicrobial therapy are paramount. Retrospective analysis of 2731 adult patients with septic shock, the majority of whom had a pulmonary primary site of infection, demonstrated that each hour delay in initiation of appropriate antibiotic therapy after the onset of hypotension was associated with a mean decrease in survival of 7.6 % [10] . Consideration of the need to alter an empirical regimen to cover specific (and perhaps drug-resistant) organisms is a major consideration when a patient is transferred to the ICU while already on standard empirical antimicrobial coverage for CAP.",
            "cite_spans": [
                {
                    "start": 393,
                    "end": 397,
                    "text": "[10]",
                    "ref_id": "BIBREF9"
                }
            ],
            "ref_spans": [],
            "section": "Empirical Versus Pathogen-Directed Therapy"
        },
        {
            "text": "In the absence of risk factors for HCAP or drugresistant pathogens, adequate coverage of S. pneumoniae and L. pneumophila is crucial. Combination antibiotics with a beta-lactam (cefotaxime, ceftriaxone, or ampicillin-sulbactam) and either a macrolide or fluoroquinolone is recommended. A recent prospective randomized trial demonstrated improved clinical outcomes for combination therapy compared to beta-lactam monotherapy, confirming multiple observational studies showing better clinical outcomes and decreased mortality with combination therapy, especially for bacteremic pneumococcal pneumonia [2] .",
            "cite_spans": [
                {
                    "start": 599,
                    "end": 602,
                    "text": "[2]",
                    "ref_id": "BIBREF1"
                }
            ],
            "ref_spans": [],
            "section": "Empirical Versus Pathogen-Directed Therapy"
        },
        {
            "text": "For suspected Pseudomonas CAP, dual therapy is required and can take the form of one of three initial combinations:",
            "cite_spans": [],
            "ref_spans": [],
            "section": "Empirical Versus Pathogen-Directed Therapy"
        },
        {
            "text": "1. anti-pneumococcal anti-pseudomonas betalactam (piperacillin-tazobactam, cefepime, imipenem, or meropenem) plus fluoroquinolone (ciprofloxacin or levofloxacin), or 2. beta-lactam plus an aminoglycoside and azithromycin, or 3. beta-lactam plus an aminoglycoside and an anti-pneumococcal fluoroquinolone For MRSA pneumonia linezolid is superior to vancomycin, particularly if a toxin-secreting community-acquired strain is the culprit [2] . A randomized double-blind trial comparing linezolid to dose-adjusted vancomycin for treatment of MRSA-proven HAP or HCAP demonstrated eradication of MRSA and clinical cure were statistically better with linezolid, and linezolid had less incidence of nephrotoxicity [11] . In the setting of methicillin-susceptible S. aureus, betalactam therapy is still the treatment of choice.",
            "cite_spans": [
                {
                    "start": 435,
                    "end": 438,
                    "text": "[2]",
                    "ref_id": "BIBREF1"
                },
                {
                    "start": 706,
                    "end": 710,
                    "text": "[11]",
                    "ref_id": "BIBREF10"
                }
            ],
            "ref_spans": [],
            "section": "Empirical Versus Pathogen-Directed Therapy"
        },
        {
            "text": "In the presence of a CAP-related pleural effusion, thoracentesis can distinguish between uncomplicated parapneumonic effusion (UPPE), complicated parapneumonic effusion (CPPE) or empyema [12] . Frank pus or a positive pleural fluid gram stain or culture indicate an infected pleural space and need for immediate drainage. However, pleural fluid gram stain and culture can be negative in CPPE or empyema. In such situations, pleural fluid chemistry is the most efficient way to assess the effusion [12] . A meta-analysis showed pleural fluid pH to have the highest diagnostic accuracy in detecting a complicated effusion, followed by glucose and lactate dehydrogenase (LDH) [13] . While optimal thresholds are still a matter of debate, a pH <7.28, glucose <40 mg/dL and/or LDH level >1000 IU/L suggests CPPE or empyema and the necessity for pleural drainage to achieve a good outcome [12, 14] .",
            "cite_spans": [
                {
                    "start": 187,
                    "end": 191,
                    "text": "[12]",
                    "ref_id": "BIBREF11"
                },
                {
                    "start": 497,
                    "end": 501,
                    "text": "[12]",
                    "ref_id": "BIBREF11"
                },
                {
                    "start": 673,
                    "end": 677,
                    "text": "[13]",
                    "ref_id": "BIBREF12"
                },
                {
                    "start": 883,
                    "end": 887,
                    "text": "[12,",
                    "ref_id": "BIBREF11"
                },
                {
                    "start": 888,
                    "end": 891,
                    "text": "14]",
                    "ref_id": "BIBREF13"
                }
            ],
            "ref_spans": [],
            "section": "Parapneumonic Effusions"
        },
        {
            "text": "If the pleural space is not evacuated in CPPE, fibrinous adhesions develop, and neutrophils and bacteria accumulate leading to empyema. Optimal therapy for CPPE and empyema hinges on adequate antibiotic coverage and pleural drainage [15] . If pleural loculations develop, multiple thoracostomy tubes may be needed along with intrapleural instillation of fibrinolytic agents [12] . A randomized controlled trial of intrapleural DNase with concomitant tissue plasminogen activator (TPA) in patients with empyema showed a lower rate of surgical referral and hospital length of stay compared with placebo and individual agents alone [16] . Lysis of adhesions or decortication via video-assisted thoracoscopic surgery (VATS) or thoracotomy may be necessary if less invasive measures fail. The timing of surgical referral and type of surgical maneuver, though, largely depend on the patient and severity of illness.",
            "cite_spans": [
                {
                    "start": 233,
                    "end": 237,
                    "text": "[15]",
                    "ref_id": "BIBREF14"
                },
                {
                    "start": 374,
                    "end": 378,
                    "text": "[12]",
                    "ref_id": "BIBREF11"
                },
                {
                    "start": 629,
                    "end": 633,
                    "text": "[16]",
                    "ref_id": "BIBREF15"
                }
            ],
            "ref_spans": [],
            "section": "Parapneumonic Effusions"
        },
        {
            "text": "In contrast, uncomplicated parapneumonic effusions are usually exudates with pleural fluid pH >7.28 and normal glucose. As these effusions are reactive, they should resolve with continued antibiotic therapy.",
            "cite_spans": [],
            "ref_spans": [],
            "section": "Parapneumonic Effusions"
        },
        {
            "text": "Several aspects of severe CAP management remain without consensus, including the assessment of risk for multidrug resistant (MDR) pathogens, adjuvant assessment tools, and treatments.",
            "cite_spans": [],
            "ref_spans": [],
            "section": "Evidence Contour"
        },
        {
            "text": "Empirical antibiotic therapy for severe CAP hinges on the risk for drug resistant organisms. Over the last decade HCAP has been used to describe the entity wherein patients develop pneumonia outside the hospital yet have pathogens usually associated with HAP or VAP, such as MDR gram-negative bacilli and MRSA. Criteria for HCAP and the resultant number of patients who should get broad-spectrum empirical therapy remain subject to debate. Using any risk factor for drug-resistant pathogens (DRP) leads to antibiotic overtreatment, while ignoring risk factors is associated with undertreatment and adverse outcomes [5] . In a prospective observational study, Shindo et al. found six independent risk factors for pathogens resistant to the usual CAP antibiotics: (1) hospitalization \u2265 2 days during the previous 90 days, (2) antibiotic use during the previous 90 days, (3) non-ambulatory status, (4) tube feedings, (5) immunocompromised status, and (6) use of gastric acid suppression medications [17] . Presence of three or more risk factors should prompt a physician to consider broad-spectrum antibiotic therapy, as the frequency of drug resistant pathogens may be as high as 43 %. These criteria work equally well as the previous definition of HCAP, and a strategy for initial antibiotic selection based on these risk factors may result in far less empirical broad-spectrum therapy while still identifying the majority who need it.",
            "cite_spans": [
                {
                    "start": 615,
                    "end": 618,
                    "text": "[5]",
                    "ref_id": "BIBREF4"
                },
                {
                    "start": 820,
                    "end": 823,
                    "text": "(2)",
                    "ref_id": "BIBREF1"
                },
                {
                    "start": 868,
                    "end": 871,
                    "text": "(3)",
                    "ref_id": "BIBREF2"
                },
                {
                    "start": 996,
                    "end": 1000,
                    "text": "[17]",
                    "ref_id": "BIBREF16"
                }
            ],
            "ref_spans": [],
            "section": "Risk of Multidrug Resistant (MDR) Pathogens"
        },
        {
            "text": "A community-acquired MRSA (CA-MRSA) clone, distinct from that usually causing HCAP, HAP or VAP, has emerged as a cause of pneumonia with striking necrotizing features. Methicillin resistance results from a different staphylococcal cassette chromosome type (SCCmec type IV), which also includes a gene encoding Panton-Valentine leukocidin (PVL) and other exotoxins. Presence of PVL may explain the associated neutropenia while other exotoxins, such as alpha-hemolysin, may result in the characteristic severe pulmonary hemorrhage of both the MRSA and MSSA infections [18] . Antibiotic therapy that also suppresses toxin production provides better outcomes and improved survival, as illustrated in a retrospective study of PVL-positive CAP [19] . Clindamycin and linezolid have been shown to suppress in-vitro formation of PVL, alphahemolysin, and toxic shock syndrome toxin 1, whereas vancomycin and beta-lactams have no effect [18] . The benefit of clindamycin combined with a beta-lactam for MSSA CAP is unclear, with a recent prospective analysis demonstrating that nearly 18 % of CA-MRSA isolates were clindamycin resistant; whether antibiotic growth inhibition detected by MIC-susceptibility tests correlates with toxin-suppression activity, though, is unclear [20, 21] . While the preferred treatment for PVL-positive MSSA CAP is still unclear, linezolid appears the most reasonable choice for CA-MRSA CAP in light of its potential to suppress exotoxin and offer faster eradication of other MRSA clones. The rapid bactericidal activity of ceftaroline, a cephalosporin with MRSA activity, may obviate the need to suppress exotoxin production, but data are still very limited.",
            "cite_spans": [
                {
                    "start": 566,
                    "end": 570,
                    "text": "[18]",
                    "ref_id": "BIBREF17"
                },
                {
                    "start": 738,
                    "end": 742,
                    "text": "[19]",
                    "ref_id": "BIBREF18"
                },
                {
                    "start": 927,
                    "end": 931,
                    "text": "[18]",
                    "ref_id": "BIBREF17"
                },
                {
                    "start": 1265,
                    "end": 1269,
                    "text": "[20,",
                    "ref_id": "BIBREF19"
                },
                {
                    "start": 1270,
                    "end": 1273,
                    "text": "21]",
                    "ref_id": "BIBREF20"
                }
            ],
            "ref_spans": [],
            "section": "Drugs to Suppress Toxin with MRSA"
        },
        {
            "text": "Procalcitonin (PCT), a peptide released in response to bacterial infection but suppressed by interferons induced by viral infections, has the potential to distinguish between bacterial and viral causes of pneumonia and potentially guide antibiotic decisions. In a prospective study of CAP, clinicians were encouraged (PCT level >0.25 mcg/L) or discouraged (PCT level <0.1 mcg/L) from using antibiotics based on procalcitonin cutoffs. PCT guidance reduced total antibiotic exposure, antibiotic prescriptions on admission, and antibiotic treatment duration without adversely affecting clinical outcomes [22] . Further analysis has shown that persistently elevated PCT levels are associated with adverse outcomes such as the development of pneumonia complications and death [23] . A similar benefit on shortening antibiotic duration with a PCT-driven protocol has been found in several studies of severe sepsis. Despite these studies, PCT has not been FDA approved for this indication in the US.",
            "cite_spans": [
                {
                    "start": 601,
                    "end": 605,
                    "text": "[22]",
                    "ref_id": "BIBREF21"
                },
                {
                    "start": 771,
                    "end": 775,
                    "text": "[23]",
                    "ref_id": "BIBREF22"
                }
            ],
            "ref_spans": [],
            "section": "Procalcitonin"
        },
        {
            "text": "Death in CAP may result from either failure to eradicate the microorganism or from inappropriate (and perhaps exaggerated) host response to the infection. This has led investigators to attempt modulation of the inflammatory response in severe CAP with corticosteroids.",
            "cite_spans": [],
            "ref_spans": [],
            "section": "Corticosteroids"
        },
        {
            "text": "While a small prospective study [24] and several retrospective studies [25] support corticosteroid administration in severe CAP, a larger randomized double-blinded trial evaluating the efficacy of prednisolone to placebo in patients with severe CAP (PSI IV or V) failed to show a beneficial effect of corticosteroids [26] . Conversely, in a highly selected group of patients with very high C-reactive protein levels on admission, use of corticosteroids was associated with less treatment failure [27] .",
            "cite_spans": [
                {
                    "start": 32,
                    "end": 36,
                    "text": "[24]",
                    "ref_id": "BIBREF23"
                },
                {
                    "start": 71,
                    "end": 75,
                    "text": "[25]",
                    "ref_id": "BIBREF24"
                },
                {
                    "start": 317,
                    "end": 321,
                    "text": "[26]",
                    "ref_id": "BIBREF25"
                },
                {
                    "start": 496,
                    "end": 500,
                    "text": "[27]",
                    "ref_id": "BIBREF26"
                }
            ],
            "ref_spans": [],
            "section": "Corticosteroids"
        }
    ],
    "bib_entries": {
        "BIBREF0": {
            "ref_id": "b0",
            "title": "Association between timing of intensive care unit admission and outcomes for emergency department patients with community-acquired pneumonia",
            "authors": [
                {
                    "first": "B",
                    "middle": [],
                    "last": "Renaud",
                    "suffix": ""
                },
                {
                    "first": "A",
                    "middle": [],
                    "last": "Santin",
                    "suffix": ""
                },
                {
                    "first": "E",
                    "middle": [],
                    "last": "Coma",
                    "suffix": ""
                }
            ],
            "year": 2009,
            "venue": "Crit Care Med",
            "volume": "37",
            "issn": "11",
            "pages": "2867--74",
            "other_ids": {}
        },
        "BIBREF1": {
            "ref_id": "b1",
            "title": "Infectious Disease Society of America/American Thoracic Society Consensus Guidelines on the management of community-acquired pneumonia in adults",
            "authors": [
                {
                    "first": "L",
                    "middle": [
                        "A"
                    ],
                    "last": "Mandell",
                    "suffix": ""
                },
                {
                    "first": "R",
                    "middle": [
                        "G"
                    ],
                    "last": "Wunderink",
                    "suffix": ""
                },
                {
                    "first": "A",
                    "middle": [],
                    "last": "Anzueto",
                    "suffix": ""
                },
                {
                    "first": "J",
                    "middle": [
                        "G"
                    ],
                    "last": "Bartlett",
                    "suffix": ""
                },
                {
                    "first": "G",
                    "middle": [
                        "D"
                    ],
                    "last": "Campbell",
                    "suffix": ""
                },
                {
                    "first": "N",
                    "middle": [
                        "C"
                    ],
                    "last": "Dean",
                    "suffix": ""
                },
                {
                    "first": "S",
                    "middle": [
                        "F"
                    ],
                    "last": "Dowell",
                    "suffix": ""
                },
                {
                    "first": "T",
                    "middle": [
                        "M"
                    ],
                    "last": "File",
                    "suffix": ""
                },
                {
                    "first": "D",
                    "middle": [
                        "M"
                    ],
                    "last": "Musher",
                    "suffix": ""
                },
                {
                    "first": "M",
                    "middle": [
                        "S"
                    ],
                    "last": "Niederman",
                    "suffix": ""
                },
                {
                    "first": "A",
                    "middle": [],
                    "last": "Torres",
                    "suffix": ""
                },
                {
                    "first": "C",
                    "middle": [
                        "G"
                    ],
                    "last": "Whitney",
                    "suffix": ""
                }
            ],
            "year": 2007,
            "venue": "Clin Inf Dis",
            "volume": "44",
            "issn": "",
            "pages": "27--72",
            "other_ids": {}
        },
        "BIBREF2": {
            "ref_id": "b2",
            "title": "IDSA/ATS minor criteria aid pre-intensive care unit resuscitation in severe community-acquired pneumonia",
            "authors": [
                {
                    "first": "H",
                    "middle": [
                        "F"
                    ],
                    "last": "Lim",
                    "suffix": ""
                },
                {
                    "first": "J",
                    "middle": [],
                    "last": "Phua",
                    "suffix": ""
                },
                {
                    "first": "A",
                    "middle": [],
                    "last": "Mukhopadhyay",
                    "suffix": ""
                }
            ],
            "year": 2014,
            "venue": "Eur Respir J",
            "volume": "43",
            "issn": "",
            "pages": "852--62",
            "other_ids": {}
        },
        "BIBREF3": {
            "ref_id": "b3",
            "title": "SMART-COP: a tool for predicting the need for intensive respiratory or vasopressor support in community-acquired pneumonia",
            "authors": [
                {
                    "first": "Pgp",
                    "middle": [],
                    "last": "Charles",
                    "suffix": ""
                },
                {
                    "first": "R",
                    "middle": [],
                    "last": "Wolfe",
                    "suffix": ""
                },
                {
                    "first": "M",
                    "middle": [],
                    "last": "Whitby",
                    "suffix": ""
                }
            ],
            "year": 2008,
            "venue": "Clin Inf Dis",
            "volume": "47",
            "issn": "",
            "pages": "375--84",
            "other_ids": {}
        },
        "BIBREF4": {
            "ref_id": "b4",
            "title": "Community-acquired pneumonia",
            "authors": [
                {
                    "first": "R",
                    "middle": [
                        "G"
                    ],
                    "last": "Wunderink",
                    "suffix": ""
                },
                {
                    "first": "G",
                    "middle": [
                        "W"
                    ],
                    "last": "Waterer",
                    "suffix": ""
                }
            ],
            "year": 2014,
            "venue": "N Engl J Med",
            "volume": "370",
            "issn": "",
            "pages": "543--51",
            "other_ids": {}
        },
        "BIBREF5": {
            "ref_id": "b5",
            "title": "Value of intensive diagnostic microbiological investigation in low-and high-risk patients with communityacquired pneumonia",
            "authors": [
                {
                    "first": "M",
                    "middle": [
                        "M"
                    ],
                    "last": "Van Der Eerden",
                    "suffix": ""
                },
                {
                    "first": "F",
                    "middle": [],
                    "last": "Vlaspolder",
                    "suffix": ""
                },
                {
                    "first": "C",
                    "middle": [
                        "S"
                    ],
                    "last": "De Graaf",
                    "suffix": ""
                }
            ],
            "year": 2005,
            "venue": "Eur J Microbiol Infect Dis",
            "volume": "24",
            "issn": "",
            "pages": "241--250",
            "other_ids": {}
        },
        "BIBREF6": {
            "ref_id": "b6",
            "title": "Community-acquired pneumonia",
            "authors": [
                {
                    "first": "T",
                    "middle": [
                        "M"
                    ],
                    "last": "File",
                    "suffix": ""
                }
            ],
            "year": 1991,
            "venue": "Lancet",
            "volume": "362",
            "issn": "",
            "pages": "",
            "other_ids": {}
        },
        "BIBREF7": {
            "ref_id": "b7",
            "title": "Lower respiratory tract virus findings in mechanically ventilated patients with severe community-acquired pneumonia",
            "authors": [
                {
                    "first": "J",
                    "middle": [],
                    "last": "Karhu",
                    "suffix": ""
                },
                {
                    "first": "T",
                    "middle": [
                        "I"
                    ],
                    "last": "Ala-Kokko",
                    "suffix": ""
                },
                {
                    "first": "T",
                    "middle": [],
                    "last": "Vuorinen",
                    "suffix": ""
                }
            ],
            "year": 2014,
            "venue": "Clin Inf Dis",
            "volume": "59",
            "issn": "1",
            "pages": "62--70",
            "other_ids": {}
        },
        "BIBREF8": {
            "ref_id": "b8",
            "title": "Viral infection in patients with severe pneumonia requiring intensive care unit admission",
            "authors": [
                {
                    "first": "S",
                    "middle": [
                        "H"
                    ],
                    "last": "Choi",
                    "suffix": ""
                },
                {
                    "first": "S",
                    "middle": [
                        "B"
                    ],
                    "last": "Hong",
                    "suffix": ""
                },
                {
                    "first": "G",
                    "middle": [
                        "B"
                    ],
                    "last": "Ko",
                    "suffix": ""
                }
            ],
            "year": 2012,
            "venue": "Am J Respir Crit Care Med",
            "volume": "186",
            "issn": "",
            "pages": "325--357",
            "other_ids": {}
        },
        "BIBREF9": {
            "ref_id": "b9",
            "title": "Duration of hypotension before initiation of effective antimicrobial therapy is the critical determinant of survival in human septic shock",
            "authors": [
                {
                    "first": "A",
                    "middle": [],
                    "last": "Kumar",
                    "suffix": ""
                },
                {
                    "first": "D",
                    "middle": [],
                    "last": "Roberts",
                    "suffix": ""
                },
                {
                    "first": "K",
                    "middle": [],
                    "last": "Wood",
                    "suffix": ""
                }
            ],
            "year": 2006,
            "venue": "Crit Care Med",
            "volume": "34",
            "issn": "6",
            "pages": "1589--96",
            "other_ids": {}
        },
        "BIBREF10": {
            "ref_id": "b10",
            "title": "Linezolid in methicillin-resistant Staphylococcus aureus nosocomial pneumonia: a randomized, controlled study",
            "authors": [
                {
                    "first": "R",
                    "middle": [
                        "G"
                    ],
                    "last": "Wunderink",
                    "suffix": ""
                },
                {
                    "first": "M",
                    "middle": [
                        "S"
                    ],
                    "last": "Niederman",
                    "suffix": ""
                },
                {
                    "first": "M",
                    "middle": [],
                    "last": "Kollef",
                    "suffix": ""
                }
            ],
            "year": 2012,
            "venue": "Clin Inf Dis",
            "volume": "54",
            "issn": "5",
            "pages": "621--630",
            "other_ids": {}
        },
        "BIBREF11": {
            "ref_id": "b11",
            "title": "Diagnosis and management of parapneumonic effusions and empyema",
            "authors": [
                {
                    "first": "S",
                    "middle": [
                        "A"
                    ],
                    "last": "Sahn",
                    "suffix": ""
                }
            ],
            "year": 2007,
            "venue": "Clin Inf Dis",
            "volume": "45",
            "issn": "",
            "pages": "1480--1486",
            "other_ids": {}
        },
        "BIBREF12": {
            "ref_id": "b12",
            "title": "Pleural fluid chemical analysis in parapneumonic effusions",
            "authors": [
                {
                    "first": "J",
                    "middle": [
                        "E"
                    ],
                    "last": "Heffner",
                    "suffix": ""
                },
                {
                    "first": "L",
                    "middle": [
                        "K"
                    ],
                    "last": "Brown",
                    "suffix": ""
                },
                {
                    "first": "C",
                    "middle": [],
                    "last": "Barbieri",
                    "suffix": ""
                }
            ],
            "year": 1995,
            "venue": "Am J Respir Crit Care Med",
            "volume": "151",
            "issn": "",
            "pages": "1700--1708",
            "other_ids": {}
        },
        "BIBREF13": {
            "ref_id": "b13",
            "title": "Biomarkers of infection for the differential diagnosis of pleural effusions",
            "authors": [
                {
                    "first": "J",
                    "middle": [
                        "M"
                    ],
                    "last": "Porcel",
                    "suffix": ""
                },
                {
                    "first": "M",
                    "middle": [],
                    "last": "Vives",
                    "suffix": ""
                },
                {
                    "first": "G",
                    "middle": [],
                    "last": "Cao",
                    "suffix": ""
                }
            ],
            "year": 2009,
            "venue": "Eur Respir J",
            "volume": "34",
            "issn": "",
            "pages": "1383--1392",
            "other_ids": {}
        },
        "BIBREF14": {
            "ref_id": "b14",
            "title": "Aerobic and anaerobic microbiology of empyema",
            "authors": [
                {
                    "first": "I",
                    "middle": [],
                    "last": "Brook",
                    "suffix": ""
                },
                {
                    "first": "E",
                    "middle": [
                        "H"
                    ],
                    "last": "Frazier",
                    "suffix": ""
                }
            ],
            "year": 1993,
            "venue": "Chest",
            "volume": "103",
            "issn": "",
            "pages": "1502--1509",
            "other_ids": {}
        },
        "BIBREF15": {
            "ref_id": "b15",
            "title": "Intrapleural use of tissue plasminogen activator and DNase in pleural infection",
            "authors": [
                {
                    "first": "N",
                    "middle": [
                        "M"
                    ],
                    "last": "Rahman",
                    "suffix": ""
                },
                {
                    "first": "N",
                    "middle": [
                        "A"
                    ],
                    "last": "Maskell",
                    "suffix": ""
                },
                {
                    "first": "A",
                    "middle": [],
                    "last": "West",
                    "suffix": ""
                }
            ],
            "year": 2011,
            "venue": "N Engl J Med",
            "volume": "365",
            "issn": "",
            "pages": "518--544",
            "other_ids": {}
        },
        "BIBREF16": {
            "ref_id": "b16",
            "title": "Risk factors for drug-resistant pathogens in community-acquired and healthcare-associated pneumonia",
            "authors": [
                {
                    "first": "Y",
                    "middle": [],
                    "last": "Shindo",
                    "suffix": ""
                },
                {
                    "first": "R",
                    "middle": [],
                    "last": "Ito",
                    "suffix": ""
                },
                {
                    "first": "D",
                    "middle": [],
                    "last": "Kobayashi",
                    "suffix": ""
                }
            ],
            "year": 2013,
            "venue": "Am J Respir Crit Care Med",
            "volume": "188",
            "issn": "",
            "pages": "985--95",
            "other_ids": {}
        },
        "BIBREF17": {
            "ref_id": "b17",
            "title": "Pneumonia caused by methicillin-resistant Staphylococcus aureus",
            "authors": [
                {
                    "first": "E",
                    "middle": [],
                    "last": "Rubinstein",
                    "suffix": ""
                },
                {
                    "first": "M",
                    "middle": [],
                    "last": "Kollef",
                    "suffix": ""
                },
                {
                    "first": "D",
                    "middle": [],
                    "last": "Nathwani",
                    "suffix": ""
                }
            ],
            "year": 2008,
            "venue": "Clin Inf Dis",
            "volume": "46",
            "issn": "",
            "pages": "378--85",
            "other_ids": {}
        },
        "BIBREF18": {
            "ref_id": "b18",
            "title": "Methicillin resistance is not a predictor of severity in communityacquired Staphylococcus aureus necrotizing pneumonia--results of a prospective observational study",
            "authors": [
                {
                    "first": "N",
                    "middle": [],
                    "last": "Sicot",
                    "suffix": ""
                },
                {
                    "first": "N",
                    "middle": [],
                    "last": "Khanafer",
                    "suffix": ""
                },
                {
                    "first": "V",
                    "middle": [],
                    "last": "Meyssonnier",
                    "suffix": ""
                }
            ],
            "year": 2013,
            "venue": "Clin Microbiol Infect",
            "volume": "19",
            "issn": "",
            "pages": "142--150",
            "other_ids": {}
        },
        "BIBREF19": {
            "ref_id": "b19",
            "title": "Prevalence of methicillin-resistant Staphylococcus aureus as an etiology of community-acquired pneumonia",
            "authors": [
                {
                    "first": "G",
                    "middle": [
                        "J"
                    ],
                    "last": "Moran",
                    "suffix": ""
                },
                {
                    "first": "A",
                    "middle": [],
                    "last": "Krishnadasan",
                    "suffix": ""
                },
                {
                    "first": "R",
                    "middle": [
                        "J"
                    ],
                    "last": "Gorwitz",
                    "suffix": ""
                }
            ],
            "year": 2012,
            "venue": "Clin Inf Dis",
            "volume": "54",
            "issn": "8",
            "pages": "1126--1159",
            "other_ids": {}
        },
        "BIBREF20": {
            "ref_id": "b20",
            "title": "Methicillin-resistant Staphylococcus aureus and community-acquired pneumonia: an evolving relationship",
            "authors": [
                {
                    "first": "L",
                    "middle": [
                        "A"
                    ],
                    "last": "Mandell",
                    "suffix": ""
                },
                {
                    "first": "R",
                    "middle": [],
                    "last": "Wunderink",
                    "suffix": ""
                }
            ],
            "year": 2012,
            "venue": "Clin Inf Dis",
            "volume": "54",
            "issn": "8",
            "pages": "1134--1140",
            "other_ids": {}
        },
        "BIBREF21": {
            "ref_id": "b21",
            "title": "Procalcitonin guidance of antibiotic therapy in community-acquired pneumonia, a randomized trial",
            "authors": [
                {
                    "first": "M",
                    "middle": [],
                    "last": "Christ-Crain",
                    "suffix": ""
                },
                {
                    "first": "D",
                    "middle": [],
                    "last": "Stolz",
                    "suffix": ""
                },
                {
                    "first": "R",
                    "middle": [],
                    "last": "Bingisser",
                    "suffix": ""
                }
            ],
            "year": 2006,
            "venue": "Am J Respir Crit Care Med",
            "volume": "174",
            "issn": "",
            "pages": "84--93",
            "other_ids": {}
        },
        "BIBREF22": {
            "ref_id": "b22",
            "title": "Usefulness of procalcitonin levels in community-acquired pneumonia according to the patient's outcome research team pneumonia severity index",
            "authors": [
                {
                    "first": "M",
                    "middle": [],
                    "last": "Masia",
                    "suffix": ""
                },
                {
                    "first": "F",
                    "middle": [],
                    "last": "Gutierrez",
                    "suffix": ""
                },
                {
                    "first": "C",
                    "middle": [],
                    "last": "Shum",
                    "suffix": ""
                }
            ],
            "year": 2005,
            "venue": "Chest",
            "volume": "128",
            "issn": "",
            "pages": "2223--2232",
            "other_ids": {}
        },
        "BIBREF23": {
            "ref_id": "b23",
            "title": "Hydrocortisone infusion for severe communityacquired pneumonia, a preliminary randomized study",
            "authors": [
                {
                    "first": "M",
                    "middle": [],
                    "last": "Confalonieri",
                    "suffix": ""
                },
                {
                    "first": "R",
                    "middle": [],
                    "last": "Ubrino",
                    "suffix": ""
                },
                {
                    "first": "A",
                    "middle": [],
                    "last": "Potena",
                    "suffix": ""
                }
            ],
            "year": 2005,
            "venue": "Am J Respir Crit Care Med",
            "volume": "171",
            "issn": "",
            "pages": "242--250",
            "other_ids": {}
        },
        "BIBREF24": {
            "ref_id": "b24",
            "title": "Effects of systemic steroids in patients with severe communityacquired pneumonia",
            "authors": [
                {
                    "first": "C",
                    "middle": [],
                    "last": "Garcia-Vidal",
                    "suffix": ""
                },
                {
                    "first": "E",
                    "middle": [],
                    "last": "Calbo",
                    "suffix": ""
                },
                {
                    "first": "V",
                    "middle": [],
                    "last": "Pascual",
                    "suffix": ""
                }
            ],
            "year": 2007,
            "venue": "Eur Respir J",
            "volume": "30",
            "issn": "",
            "pages": "951--957",
            "other_ids": {}
        },
        "BIBREF25": {
            "ref_id": "b25",
            "title": "Efficacy of corticosteroids in community-acquired pneumonia, a randomized double-blinded clinical trial",
            "authors": [
                {
                    "first": "D",
                    "middle": [],
                    "last": "Snijders",
                    "suffix": ""
                },
                {
                    "first": "J",
                    "middle": [],
                    "last": "Daniels",
                    "suffix": ""
                },
                {
                    "first": "C",
                    "middle": [
                        "S"
                    ],
                    "last": "De Graaff",
                    "suffix": ""
                }
            ],
            "year": 2010,
            "venue": "Am J Respir Crit Care Med",
            "volume": "181",
            "issn": "",
            "pages": "975--82",
            "other_ids": {}
        },
        "BIBREF26": {
            "ref_id": "b26",
            "title": "Effect of corticosteroids on treatment failure among hospitalized patients with severe community-acquired pneumonia and high inflammatory response: a randomized controlled trial",
            "authors": [
                {
                    "first": "A",
                    "middle": [],
                    "last": "Torres",
                    "suffix": ""
                },
                {
                    "first": "O",
                    "middle": [],
                    "last": "Sibila",
                    "suffix": ""
                },
                {
                    "first": "M",
                    "middle": [],
                    "last": "Ferrer",
                    "suffix": ""
                }
            ],
            "year": 2015,
            "venue": "JAMA",
            "volume": "333",
            "issn": "7",
            "pages": "677--86",
            "other_ids": {}
        }
    },
    "ref_entries": {
        "FIGREF0": {
            "text": "Representative image of the CT chest upon admission symptom severity or co-morbid conditions require ICU admission at presentation and (2) those who transfer to the ICU later because of progressive decline despite receiving inpatient therapy.",
            "latex": null,
            "type": "figure"
        },
        "TABREF0": {
            "text": "1 IDSA/ATS minor a criteria for severe community acquired pneumonia Respiratory rate b \u2265 30 breaths/min PaO 2 /FiO 2 ratio b \u2264 250 Multilobar infiltrates Confusion/disorientation Uremia (BUN level, \u226520 mg/dL) Leukopenia c (WBC count, <4000 cells/mm 3 ) Thrombocytopenia (platelet count, <100,000 cells/ mm 3 ) Hypothermia (core temperature, <36 \u00b0C) Hypotension requiring aggressive fluid resuscitation Modified and reproduced with permission from Oxford University Press on behalf of the Infectious Disease Society of America. Mandell et al. [2] Other considerations include hypoglycemia (in a nondiabetic patient), acute alcoholism/withdrawal, hyponatremia, unexplained metabolic acidosis, elevated lactate level, cirrhosis and asplenia b Need for noninvasive ventilation can substitute for a respiratory rate >30 breaths/min or PaO 2 /FiO 2 < 250 As a result of infection alone Table 20.2 Epidemiologic conditions and/or risk factors related to specific pathogens in community-acquired pneumonia Condition Commonly encountered pathogen(s) Alcoholism Streptococcus pneumoniae, oral anaerobes, Klebsiella pneumoniae, Acinetobacter species, Mycobacterium tuberculosis COPD and/or smoking Haemophilus influenzae, Pseudomonas aeruginosa, Legionella species, S. pneumoniae, Moraxella catarrhalis, Chlamydophila pneumoniae Aspiration Gram-negative enteric pathogens, oral anaerobes Lung abscess CA-MRSA, oral anaerobes, endemic fungal pneumonia, M. tuberculosis, atypical mycobacteria Exposure to bat or bird droppings",
            "latex": null,
            "type": "table"
        }
    },
    "back_matter": []
}