{
    "paper_id": "PMC7088212",
    "metadata": {
        "title": "Symptoms of Infection Caused by SARS Coronavirus in Laboratory Mice and Guinea Pigs",
        "authors": [
            {
                "first": "A.",
                "middle": [
                    "A."
                ],
                "last": "Chepurnov",
                "suffix": "",
                "email": null,
                "affiliation": {}
            },
            {
                "first": "A.",
                "middle": [
                    "A."
                ],
                "last": "Dadaeva",
                "suffix": "",
                "email": null,
                "affiliation": {}
            },
            {
                "first": "E.",
                "middle": [
                    "M."
                ],
                "last": "Malkova",
                "suffix": "",
                "email": null,
                "affiliation": {}
            },
            {
                "first": "of",
                "middle": [
                    "RAMS",
                    "S.",
                    "I."
                ],
                "last": "Kolesnikov",
                "suffix": "",
                "email": null,
                "affiliation": {}
            },
            {
                "first": "L.",
                "middle": [
                    "S."
                ],
                "last": "Sandakhchiev",
                "suffix": "",
                "email": null,
                "affiliation": {}
            }
        ]
    },
    "body_text": [],
    "ref_entries": {},
    "back_matter": [],
    "bib_entries": {
        "BIBREF0": {
            "title": "",
            "authors": [
                {
                    "first": "M.A.",
                    "middle": [],
                    "last": "Marra",
                    "suffix": ""
                },
                {
                    "first": "S.J.M.",
                    "middle": [],
                    "last": "Jones",
                    "suffix": ""
                },
                {
                    "first": "C.R.",
                    "middle": [],
                    "last": "Astell",
                    "suffix": ""
                }
            ],
            "year": 2003,
            "venue": "Science",
            "volume": "300",
            "issn": "",
            "pages": "1399-1404",
            "other_ids": {
                "DOI": []
            }
        },
        "BIBREF1": {
            "title": "",
            "authors": [
                {
                    "first": "P.A.",
                    "middle": [],
                    "last": "Rota",
                    "suffix": ""
                },
                {
                    "first": "M.S.",
                    "middle": [],
                    "last": "Oberste",
                    "suffix": ""
                },
                {
                    "first": "S.S.",
                    "middle": [],
                    "last": "Monroe",
                    "suffix": ""
                }
            ],
            "year": 2003,
            "venue": "Science",
            "volume": "300",
            "issn": "",
            "pages": "1394-1399",
            "other_ids": {
                "DOI": [
                    "10.1126/science.1085952"
                ]
            }
        },
        "BIBREF2": {
            "title": "",
            "authors": [
                {
                    "first": "T.",
                    "middle": [],
                    "last": "Kuiken",
                    "suffix": ""
                },
                {
                    "first": "R.A.",
                    "middle": [],
                    "last": "Fouchier",
                    "suffix": ""
                },
                {
                    "first": "M.",
                    "middle": [],
                    "last": "Schutten",
                    "suffix": ""
                }
            ],
            "year": 2003,
            "venue": "Lancet",
            "volume": "362",
            "issn": "",
            "pages": "263-270",
            "other_ids": {
                "DOI": []
            }
        },
        "BIBREF3": {
            "title": "",
            "authors": [],
            "year": null,
            "venue": "",
            "volume": "",
            "issn": "",
            "pages": null,
            "other_ids": {
                "DOI": []
            }
        },
        "BIBREF4": {
            "title": "",
            "authors": [],
            "year": 1969,
            "venue": "Diagnostic Procedures for Viral and Rickettsial Infections",
            "volume": "",
            "issn": "",
            "pages": null,
            "other_ids": {
                "DOI": []
            }
        }
    }
}