{
    "paper_id": "PMC7088853",
    "metadata": {
        "title": "Identifying key papers within a journal via network centrality measures",
        "authors": [
            {
                "first": "Saikou",
                "middle": [
                    "Y."
                ],
                "last": "Diallo",
                "suffix": "",
                "email": null,
                "affiliation": {}
            },
            {
                "first": "Christopher",
                "middle": [
                    "J."
                ],
                "last": "Lynch",
                "suffix": "",
                "email": "cjlynch@odu.edu",
                "affiliation": {}
            },
            {
                "first": "Ross",
                "middle": [],
                "last": "Gore",
                "suffix": "",
                "email": null,
                "affiliation": {}
            },
            {
                "first": "Jose",
                "middle": [
                    "J."
                ],
                "last": "Padilla",
                "suffix": "",
                "email": null,
                "affiliation": {}
            }
        ]
    },
    "body_text": [
        {
            "text": "Imagine researchers investigating a topic. With current scientometric knowledge, researchers can identify key journals, key authors, and several related journal level metrics that would allow them to assess the relative relevance of a journal on the topic of interest. However, even if the researchers can narrow their search to a reduced set of journals, they are left with the problem of filtering the thousands of articles in each journal to a meaningful initial set. The current practice for determining the importance of a paper is to track the number of times that the paper is cited (Abt 2000; Sikorav 1991; Zhu et al. 2004). However, citation counts are influenced by numerous variables and require years to accumulate even in the most highly regarded journals (Garfield 2006; Neylon and Wu 2009; Stringer et al. 2008). In addition, the reliance on citation counts only, could cause the researcher to overlook newly published papers as they have not yet had a chance to accumulate citations. Another approach is to rely on journal publisher and read the recommended articles. However these recommendations usually center on new articles at the exclusion of older ones. Ideally, researchers would have the ability to immediately identify important papers in a given journal such that they are aware of the existing body of knowledge that has accumulated in the journal over the years while being able to leverage new contributions as quickly as they are published.",
            "cite_spans": [
                {
                    "start": 595,
                    "end": 599,
                    "mention": "2000",
                    "ref_id": "BIBREF0"
                },
                {
                    "start": 609,
                    "end": 613,
                    "mention": "1991",
                    "ref_id": "BIBREF26"
                },
                {
                    "start": 626,
                    "end": 630,
                    "mention": "2004",
                    "ref_id": "BIBREF32"
                },
                {
                    "start": 779,
                    "end": 783,
                    "mention": "2006",
                    "ref_id": "BIBREF7"
                },
                {
                    "start": 799,
                    "end": 803,
                    "mention": "2009",
                    "ref_id": "BIBREF23"
                },
                {
                    "start": 821,
                    "end": 825,
                    "mention": "2008",
                    "ref_id": "BIBREF28"
                }
            ],
            "section": "Introduction",
            "ref_spans": []
        },
        {
            "text": "In this article we propose the adoption of established network centrality measures that compute the importance of journals to determine the extent to which an individual paper is important or key within a given journal. Historically, the number of citations that a paper accrues serves as the currency through which we measure the importance of a paper and a myriad of journal importance measures have been proposed. For the most part, three measures related to network centrality serve as effective guidelines for: (1) authors making choices about where to disseminate their research; and (2) libraries making purchasing decisions (Gross and Gross 1927). These three network centrality measures are: betweenness centrality, closeness centrality, and eigenvector centrality. Each of these centrality metrics utilize the network of citations formed between publications to determine (1) which journals are important (Barnett et al. 2011; Griffin et al. 2015), (2) which authors are important across journals (Liu et al. 2005; Yan and Ding 2009), or (3) to identify important sentences or keywords within documents (Beliga et al. 2015; Erkan and Radev 2004; Khan and Wood 2015). However, to our knowledge, the application of these metrics to filter out and determine the importance of papers within a single journal has not been explored. As a result, we apply these centrality metrics to the papers within PLOS in order to determine which of these metrics can be used to effectively filter out important papers in a journal. Specifically, we ask the following questions:Are important papers the papers that allow researchers to transition from one group of papers to another within a journal?Are important papers the papers that a researcher is more likely to find when starting from any randomly selected paper?Are important papers the papers that a researcher can reach from other important papers?\n",
            "cite_spans": [
                {
                    "start": 649,
                    "end": 653,
                    "mention": "1927",
                    "ref_id": "BIBREF9"
                },
                {
                    "start": 931,
                    "end": 935,
                    "mention": "2011",
                    "ref_id": "BIBREF22"
                },
                {
                    "start": 952,
                    "end": 956,
                    "mention": "2015",
                    "ref_id": "BIBREF8"
                },
                {
                    "start": 1019,
                    "end": 1023,
                    "mention": "2005",
                    "ref_id": "BIBREF19"
                },
                {
                    "start": 1038,
                    "end": 1042,
                    "mention": "2009",
                    "ref_id": "BIBREF31"
                },
                {
                    "start": 1128,
                    "end": 1132,
                    "mention": "2015",
                    "ref_id": "BIBREF34"
                },
                {
                    "start": 1150,
                    "end": 1154,
                    "mention": "2004",
                    "ref_id": "BIBREF3"
                },
                {
                    "start": 1170,
                    "end": 1174,
                    "mention": "2015",
                    "ref_id": "BIBREF15"
                }
            ],
            "section": "Introduction",
            "ref_spans": []
        },
        {
            "text": "It is important to note that the types of papers enumerated in our research questions are not mutually exclusive and a paper can be important in more than one aspect. We restrict our analysis to creating networks for each paper within PLOS based on papers contained within PLOS. In order to verify our results, we investigate the correlation between a paper\u2019s citation count and its centrality value. The assumption here is that citation count is a good metric that indicates the historical value of a paper and therefore should correlate well with our recommended article-level metric.",
            "cite_spans": [],
            "section": "Introduction",
            "ref_spans": []
        },
        {
            "text": "The balance of the paper is organized as follows: In the \u201cState of the art in network centrality metrics\u201d section we conduct a literature review on network centrality metrics; In the \u201cWhat makes a paper key\u201d we describe the betweenness, closeness, and eigenvector centrality metrics in more detail and provide examples on how they identify the importance of a paper; In the \u201cMethodology\u201d section, we present our methodology; In the \u201cFinding key papers in PLOS\u201d section, we apply our methodology to identify (1) key papers in PLOS and (2) the most appropriate centrality metric for describing the keyness of a paper within its journal; In the \u201cDiscussion\u201d section, we present our findings and in the \u201cConclusions\u201d section, we present conclusions and future research.",
            "cite_spans": [],
            "section": "Introduction",
            "ref_spans": []
        },
        {
            "text": "Network centrality metrics identify the importance of publications within the scientific community by examining networks of papers based on their co-citation networks (links formed between papers based on their citations) or their co-author networks (links formed between papers based on their authors) for social network analysis based on the flow of information between publications (Leydesdorff 2007, 2011). Historically, point centrality seeks the identification of the person within a network that is structurally more central to the network than any other person in the network; however, a main difficult arises in determining if the central position is structurally unique (Freeman 1979). Therefore, the central node (be it a person or any other object within the network) represents the key position in the network. Various metrics have been introduced for determining whether a node is key based on (1) the node that is closest to all other papers (Freeman 1979), (2) the node positioned on the shortest path between the greatest number of other nodes (Freeman 1977; Leydesdorff 2007), and (3) the node that is key due to its connection to highly valued nodes (Bonacich 1987). These metrics are known as closeness centrality, betweenness centrality, and eigenvector centrality, respectively. They take into account the manner in which the citations: (1) accumulate over time for an individual journal; and (2) form a relationship among different journals.",
            "cite_spans": [
                {
                    "start": 398,
                    "end": 402,
                    "mention": "2007",
                    "ref_id": "BIBREF16"
                },
                {
                    "start": 404,
                    "end": 408,
                    "mention": "2011",
                    "ref_id": "BIBREF17"
                },
                {
                    "start": 689,
                    "end": 693,
                    "mention": "1979",
                    "ref_id": "BIBREF6"
                },
                {
                    "start": 966,
                    "end": 970,
                    "mention": "1979",
                    "ref_id": "BIBREF6"
                },
                {
                    "start": 1070,
                    "end": 1074,
                    "mention": "1977",
                    "ref_id": "BIBREF5"
                },
                {
                    "start": 1088,
                    "end": 1092,
                    "mention": "2007",
                    "ref_id": "BIBREF16"
                },
                {
                    "start": 1179,
                    "end": 1183,
                    "mention": "1987",
                    "ref_id": "BIBREF38"
                }
            ],
            "section": "State of the art in network centrality metrics",
            "ref_spans": []
        },
        {
            "text": "Betweenness centrality focuses on identifying nodes which are frequently found on the shortest path between two other nodes (Freeman 1977); thus, betweenness centrality produces a relational value based on the local positions of the node with respect to the position of the nodes that it sits between (Leydesdorff 2007). Nodes that sit on the path between two other nodes serve to control the flow of information between the other nodes ranging from complete control (when only one path exists between the two other nodes) to limited control (when multiple paths exist between nodes) (Freeman 1979). Deleting nodes with high Betweenness centrality values from a network serves to break the network into coherent clusters (Leydesdorff 2007). These nodes also control the flow of knowledge between other nodes (Li-chun et al. 2006). Leydesdorff (2011) shows the application of betweenness centrality, among other metrics, to analyze the fields of nanotechnology and communications within a journal\u2013journal citation network. Betweenness centrality computes the frequency with which a given journal is cited to create the shortest path (i.e. a bridge) between two other journals (Guns et al. 2011; Hanneman and Riddle 2005; Leydesdorff 2007).",
            "cite_spans": [
                {
                    "start": 133,
                    "end": 137,
                    "mention": "1977",
                    "ref_id": "BIBREF5"
                },
                {
                    "start": 314,
                    "end": 318,
                    "mention": "2007",
                    "ref_id": "BIBREF16"
                },
                {
                    "start": 593,
                    "end": 597,
                    "mention": "1979",
                    "ref_id": "BIBREF6"
                },
                {
                    "start": 734,
                    "end": 738,
                    "mention": "2007",
                    "ref_id": "BIBREF16"
                },
                {
                    "start": 824,
                    "end": 828,
                    "mention": "2006",
                    "ref_id": "BIBREF18"
                },
                {
                    "start": 844,
                    "end": 848,
                    "mention": "2011",
                    "ref_id": "BIBREF17"
                },
                {
                    "start": 1188,
                    "end": 1192,
                    "mention": "2011",
                    "ref_id": "BIBREF10"
                },
                {
                    "start": 1214,
                    "end": 1218,
                    "mention": "2005",
                    "ref_id": "BIBREF12"
                },
                {
                    "start": 1232,
                    "end": 1236,
                    "mention": "2007",
                    "ref_id": "BIBREF16"
                }
            ],
            "section": "State of the art in network centrality metrics",
            "ref_spans": []
        },
        {
            "text": "Closeness centrality measures the \u201cindependence\u201d of an individual paper with respect to the other papers within the target body of knowledge (Freeman 1979, p. 224). A paper that directly connects with many other papers has a high closeness centrality value while a paper with many indirect connections has a lower value. Articles that reside on the outer edges of a citation network are likely to have low closeness values since they require the presence of other intermediary articles in order to reach other articles (Siler 2013). As such, papers with high closeness centrality values extend their influence throughout the entire network (Li-chun et al. 2006) and can be seen as a measure of how long it will take for information to spread from a given node to the remainder of the network (Liu et al. 2015). Closeness centrality computes the shortest path from one journal to a different journal based on the citations of papers within each journal (Leydesdorff 2007).",
            "cite_spans": [
                {
                    "start": 150,
                    "end": 154,
                    "mention": "1979",
                    "ref_id": "BIBREF6"
                },
                {
                    "start": 526,
                    "end": 530,
                    "mention": "2013",
                    "ref_id": "BIBREF27"
                },
                {
                    "start": 656,
                    "end": 660,
                    "mention": "2006",
                    "ref_id": "BIBREF18"
                },
                {
                    "start": 804,
                    "end": 808,
                    "mention": "2015",
                    "ref_id": "BIBREF20"
                },
                {
                    "start": 965,
                    "end": 969,
                    "mention": "2007",
                    "ref_id": "BIBREF16"
                }
            ],
            "section": "State of the art in network centrality metrics",
            "ref_spans": []
        },
        {
            "text": "Eigenvector centrality provides a centrality value of a node (such as a journal article) based on the summation of its links to other nodes (such as the other journal articles that it cites) weighted by their centralities and the nodes\u2019 links are not necessarily weighted equally; therefore, nodes linked to higher value nodes receive a larger benefit than from lower value nodes (Bonacich 1987). However, in the special case where all of the nodes are weighted equally, the eigenvector centrality values may be identical to the betweenness or closeness centrality values (Bonacich 2007). Within a social network, such as a community of connected papers, the eigenvector centrality metric establishes the keyness of a paper based on its connections to other papers with high eigenvector centrality values.",
            "cite_spans": [
                {
                    "start": 390,
                    "end": 394,
                    "mention": "1987",
                    "ref_id": "BIBREF38"
                },
                {
                    "start": 582,
                    "end": 586,
                    "mention": "2007",
                    "ref_id": "BIBREF1"
                }
            ],
            "section": "State of the art in network centrality metrics",
            "ref_spans": []
        },
        {
            "text": "Eigenvector centrality computes the importance of a journal by determining how frequently it is cited in other important journals (Bergstrom 2007; Bonacich 2007; West, Bergstrom, and Bergstrom 2010). A benefit of this centrality metric is that it can be used with valued or signed networks which use non-binary relationships between nodes (Bonacich 2007). Eigenvector centrality has been applied to social networks for purposes such as predicting academic positions for faculty members whose positions require publishing (Feeley et al. 2010) as well as to examine the benefits gained within citation networks formed within different institutions on the basis that having knowledgeable coauthors provides a greater benefit to a paper (Liu et al. 2015). Additionally, eigenvector centrality has been applied to numerous other fields: Allesina and Pascual (2009) apply eigenvector centrality to forecast the effects of species\u2019 extinctions; Joyce et al. (2010) examine the ability of eigenvector centrality to identify critical nodes within brain networks; Kane (2009) applies eigenvector centrality to examine the influence of editors on the quality of articles within Wikipedia; and Lohmann et al. (2010) demonstrate that this centrality metric is efficient for representing the brain\u2019s neural architecture.",
            "cite_spans": [
                {
                    "start": 141,
                    "end": 145,
                    "mention": "2007",
                    "ref_id": "BIBREF35"
                },
                {
                    "start": 156,
                    "end": 160,
                    "mention": "2007",
                    "ref_id": "BIBREF1"
                },
                {
                    "start": 193,
                    "end": 197,
                    "mention": "2010",
                    "ref_id": "BIBREF29"
                },
                {
                    "start": 349,
                    "end": 353,
                    "mention": "2007",
                    "ref_id": "BIBREF1"
                },
                {
                    "start": 536,
                    "end": 540,
                    "mention": "2010",
                    "ref_id": "BIBREF4"
                },
                {
                    "start": 745,
                    "end": 749,
                    "mention": "2015",
                    "ref_id": "BIBREF20"
                },
                {
                    "start": 854,
                    "end": 858,
                    "mention": "2009",
                    "ref_id": "BIBREF11"
                },
                {
                    "start": 952,
                    "end": 956,
                    "mention": "2010",
                    "ref_id": "BIBREF13"
                },
                {
                    "start": 1060,
                    "end": 1064,
                    "mention": "2009",
                    "ref_id": "BIBREF14"
                },
                {
                    "start": 1198,
                    "end": 1202,
                    "mention": "2010",
                    "ref_id": "BIBREF21"
                }
            ],
            "section": "State of the art in network centrality metrics",
            "ref_spans": []
        },
        {
            "text": "The betweenness, closeness, and eigenvector centrality metrics each enumerate a distinct role for interpreting the importance of a node within a given network. Journals with high eigenvector centrality are frequently cited by other important journals and are considered important. Journals that frequently create shortest path bridges between different journals have high betweenness centrality and are considered important. Journals with low closeness centrality scores spread information to other journals quickly and are considered important. These metrics have been applied at the journal\u2013journal level to find key journals; at the journal\u2013journal level to find key authors across journals; at the paper level to find key words and sentences; and for analyzing various topic-specific bodies of knowledge (such as brain networks) to find key papers or authors within the given domain. However, there is a gap in the literature for applying these centrality metrics to determine key papers within an individual journal. This is the gap that we seek to fill by applying these metrics to find key papers within PLOS by examining the co-citation network formed within PLOS for PLOS papers cited by other PLOS papers. The following section provides the algorithms for each of these metrics and provides an example network configuration to better illustrate the determination of key papers for each metric.",
            "cite_spans": [],
            "section": "State of the art in network centrality metrics",
            "ref_spans": []
        },
        {
            "text": "The word \u201ckey\u201d is ambiguous when referring to an article as different criteria are applicable, such as most downloaded, most cited, etc. Neylon and Wu (2009) discuss this issue and the need for measures beyond citation count, download numbers, and comments. Our work addresses this need through the adaption of network centrality measures to identify different types of key papers within a journal. Here, we define our network representation of the papers within a journal and each of the three centrality measures to quantify the keyness of an individual paper within a journal: (1) betweenness centrality, (2) closeness centrality, and (3) eigenvector centrality.",
            "cite_spans": [
                {
                    "start": 152,
                    "end": 156,
                    "mention": "2009",
                    "ref_id": "BIBREF23"
                }
            ],
            "section": "What makes a paper key",
            "ref_spans": []
        },
        {
            "text": "Our network representation of the papers within a journal is constructed as follows. A given paper x in a journal Y is initially represented as unconnected. Then, for all papers y\ni within Y that explicitly cite x, an edge is drawn from y\ni to x. Next, for all papers z\ni that explicitly cite y\ni an edge is drawn from z\ni to x. This process continues until no more papers in the journal can be linked to paper x and is repeated for each paper. This results in a Journal Citation Network that allows for the application of metrics to determine the status of the journal as a whole (Bollen et al. 2006) or the status, or keyness, of individual articles within the journal. The construction of our network assumes that research interest in a paper is conveyed via citation and that information flows from one paper to another along the shortest citation path.",
            "cite_spans": [
                {
                    "start": 596,
                    "end": 600,
                    "mention": "2006",
                    "ref_id": "BIBREF36"
                }
            ],
            "section": "What makes a paper key",
            "ref_spans": []
        },
        {
            "text": "As such, our network representation of a journal is a set of papers, (V) connected via edges (E). Given a network (V, E), Eq. 1 defines the betweenness centrality of a paper:1\\documentclass[12pt]{minimal}\n\t\t\t\t\\usepackage{amsmath}\n\t\t\t\t\\usepackage{wasysym} \n\t\t\t\t\\usepackage{amsfonts} \n\t\t\t\t\\usepackage{amssymb} \n\t\t\t\t\\usepackage{amsbsy}\n\t\t\t\t\\usepackage{mathrsfs}\n\t\t\t\t\\usepackage{upgreek}\n\t\t\t\t\\setlength{\\oddsidemargin}{-69pt}\n\t\t\t\t\\begin{document}$$g\\left( v \\right) = \\mathop \\sum \\limits_{s \\ne t \\ne v} \\frac{{\\sigma_{s,t} \\left( v \\right)}}{{\\sigma_{st} }}$$\\end{document}gv=\u2211s\u2260t\u2260v\u03c3s,tv\u03c3st\n",
            "cite_spans": [],
            "section": "What makes a paper key",
            "ref_spans": []
        },
        {
            "text": "In Eq. 1, \\documentclass[12pt]{minimal}\n\t\t\t\t\\usepackage{amsmath}\n\t\t\t\t\\usepackage{wasysym} \n\t\t\t\t\\usepackage{amsfonts} \n\t\t\t\t\\usepackage{amssymb} \n\t\t\t\t\\usepackage{amsbsy}\n\t\t\t\t\\usepackage{mathrsfs}\n\t\t\t\t\\usepackage{upgreek}\n\t\t\t\t\\setlength{\\oddsidemargin}{-69pt}\n\t\t\t\t\\begin{document}$$\\sigma_{st}$$\\end{document}\u03c3st is the number of shortest paths from paper s to paper t and \\documentclass[12pt]{minimal}\n\t\t\t\t\\usepackage{amsmath}\n\t\t\t\t\\usepackage{wasysym} \n\t\t\t\t\\usepackage{amsfonts} \n\t\t\t\t\\usepackage{amssymb} \n\t\t\t\t\\usepackage{amsbsy}\n\t\t\t\t\\usepackage{mathrsfs}\n\t\t\t\t\\usepackage{upgreek}\n\t\t\t\t\\setlength{\\oddsidemargin}{-69pt}\n\t\t\t\t\\begin{document}$$\\sigma_{s,t} \\left( v \\right)$$\\end{document}\u03c3s,tv is the number of those paths that pass through paper v. A paper with high betweenness centrality frequently transfers information between two different papers by serving as a bridge between them. Such a paper is key because it acts as a \u201cGlue\u201d paper by connecting many different papers in the publication.",
            "cite_spans": [],
            "section": "What makes a paper key",
            "ref_spans": []
        },
        {
            "text": "Equation 2 formally defines the closeness centrality of a paper. Once again our network is a set of papers (V) connected via edges (E).2\\documentclass[12pt]{minimal}\n\t\t\t\t\\usepackage{amsmath}\n\t\t\t\t\\usepackage{wasysym} \n\t\t\t\t\\usepackage{amsfonts} \n\t\t\t\t\\usepackage{amssymb} \n\t\t\t\t\\usepackage{amsbsy}\n\t\t\t\t\\usepackage{mathrsfs}\n\t\t\t\t\\usepackage{upgreek}\n\t\t\t\t\\setlength{\\oddsidemargin}{-69pt}\n\t\t\t\t\\begin{document}$$g\\left( v \\right) = \\mathop \\sum \\limits_{u \\in N,u \\ne v} \\frac{{\\gamma \\left( {u,v} \\right)}}{N}$$\\end{document}gv=\u2211u\u2208N,u\u2260v\u03b3u,vN\n",
            "cite_spans": [],
            "section": "What makes a paper key",
            "ref_spans": []
        },
        {
            "text": "In Eq. 2, \\documentclass[12pt]{minimal}\n\t\t\t\t\\usepackage{amsmath}\n\t\t\t\t\\usepackage{wasysym} \n\t\t\t\t\\usepackage{amsfonts} \n\t\t\t\t\\usepackage{amssymb} \n\t\t\t\t\\usepackage{amsbsy}\n\t\t\t\t\\usepackage{mathrsfs}\n\t\t\t\t\\usepackage{upgreek}\n\t\t\t\t\\setlength{\\oddsidemargin}{-69pt}\n\t\t\t\t\\begin{document}$$\\gamma \\left( {u,v} \\right)$$\\end{document}\u03b3u,v is the minimum number of papers and citations required to traverse the network when moving from \\documentclass[12pt]{minimal}\n\t\t\t\t\\usepackage{amsmath}\n\t\t\t\t\\usepackage{wasysym} \n\t\t\t\t\\usepackage{amsfonts} \n\t\t\t\t\\usepackage{amssymb} \n\t\t\t\t\\usepackage{amsbsy}\n\t\t\t\t\\usepackage{mathrsfs}\n\t\t\t\t\\usepackage{upgreek}\n\t\t\t\t\\setlength{\\oddsidemargin}{-69pt}\n\t\t\t\t\\begin{document}$$\\left( u \\right)$$\\end{document}u to \\documentclass[12pt]{minimal}\n\t\t\t\t\\usepackage{amsmath}\n\t\t\t\t\\usepackage{wasysym} \n\t\t\t\t\\usepackage{amsfonts} \n\t\t\t\t\\usepackage{amssymb} \n\t\t\t\t\\usepackage{amsbsy}\n\t\t\t\t\\usepackage{mathrsfs}\n\t\t\t\t\\usepackage{upgreek}\n\t\t\t\t\\setlength{\\oddsidemargin}{-69pt}\n\t\t\t\t\\begin{document}$$\\left( v \\right)$$\\end{document}v and N is the number of papers in the network. Within the network, papers with low closeness centrality transfer knowledge, on average, to other papers along a very short path of connected edges (Kevin Bacon effect). As a result they are considered key \u201cKevin Bacon\u201d papers because the knowledge encapsulated in their paper is disseminated efficiently in the network.",
            "cite_spans": [],
            "section": "What makes a paper key",
            "ref_spans": []
        },
        {
            "text": "Formally, Eq. 3 defines the eigenvector centrality of a paper.3\\documentclass[12pt]{minimal}\n\t\t\t\t\\usepackage{amsmath}\n\t\t\t\t\\usepackage{wasysym} \n\t\t\t\t\\usepackage{amsfonts} \n\t\t\t\t\\usepackage{amssymb} \n\t\t\t\t\\usepackage{amsbsy}\n\t\t\t\t\\usepackage{mathrsfs}\n\t\t\t\t\\usepackage{upgreek}\n\t\t\t\t\\setlength{\\oddsidemargin}{-69pt}\n\t\t\t\t\\begin{document}$$Ax = \\lambda x, \\quad \\lambda x_{i} = \\mathop \\sum \\limits_{j = 1}^{n} a_{ij} x_{j } , \\quad i = 1, \\ldots ,n$$\\end{document}Ax=\u03bbx,\u03bbxi=\u2211j=1naijxj,i=1,\u2026,n\n",
            "cite_spans": [],
            "section": "What makes a paper key",
            "ref_spans": []
        },
        {
            "text": "In Eq. 3, x is the eigenvector centrality, A is the adjacency matrix of the network, \\documentclass[12pt]{minimal}\n\t\t\t\t\\usepackage{amsmath}\n\t\t\t\t\\usepackage{wasysym} \n\t\t\t\t\\usepackage{amsfonts} \n\t\t\t\t\\usepackage{amssymb} \n\t\t\t\t\\usepackage{amsbsy}\n\t\t\t\t\\usepackage{mathrsfs}\n\t\t\t\t\\usepackage{upgreek}\n\t\t\t\t\\setlength{\\oddsidemargin}{-69pt}\n\t\t\t\t\\begin{document}$$\\lambda$$\\end{document}\u03bb is the largest eigenvalue of A, and n is the number of vertices. Given our network representation, papers with high eigenvector centrality are the most connected to other highly connected papers. Given the number of explicit and implicit citations these papers receive from their other well-cited paper peers, they are considered key (Big Fish) papers in Fig. 1. Eigenvector centrality also measures the keyness of a paper based on the overlap of the papers that it cites within its own journal and papers that it cites within other journals (Bonacich 1972). Bonacich (1972) finds that overlaps with central groups provides a greater benefit than overlaps with isolated groups. Figure 1 provides an example of key papers within a network for each of the three centrality metrics.\n",
            "cite_spans": [
                {
                    "start": 931,
                    "end": 935,
                    "mention": "1972",
                    "ref_id": "BIBREF37"
                },
                {
                    "start": 948,
                    "end": 952,
                    "mention": "1972",
                    "ref_id": "BIBREF37"
                }
            ],
            "section": "What makes a paper key",
            "ref_spans": [
                {
                    "start": 739,
                    "end": 740,
                    "mention": "1",
                    "ref_id": "FIGREF0"
                },
                {
                    "start": 1064,
                    "end": 1065,
                    "mention": "1",
                    "ref_id": "FIGREF0"
                }
            ]
        },
        {
            "text": "Figure 1 displays the same network three times colored differently for each of the centrality metrics. Figure 1a displays the key Glue paper for the network. Node N9 represents the key paper in this network based on betweenness Centrality since it lies on the greatest number of shortest paths between other nodes within the network. Nodes N2, N3, N5, N6, N7, and N8 all have betweenness values of 0 (dark blue) since they are not located between any other nodes within the network. N1 has a slightly higher value and is shown in light red since is falls on four shortest paths that each start at N8 and end at N5, N6, N7, and N9. N4 contains a slightly redder color since it falls on five shortest paths that each start at N3 and end at N2, N5, N6, N7, and N9. N9 has a value of 1 (dark red) and is found on the shortest path between 13 nodes: starting at N1, N2, and N8 and ending at N5, N6, and N7; and starting at N3 and N4 and ending at N6 and N7.",
            "cite_spans": [],
            "section": "What makes a paper key",
            "ref_spans": [
                {
                    "start": 7,
                    "end": 8,
                    "mention": "1",
                    "ref_id": "FIGREF0"
                },
                {
                    "start": 110,
                    "end": 111,
                    "mention": "1",
                    "ref_id": "FIGREF0"
                }
            ]
        },
        {
            "text": "For the same network configuration, Fig. 1b displays the Kevin Bacon papers based on the closeness centrality metric. N4 is now the key paper (dark red) with three direct links (distance between nodes equals one) and two indirect links with distance between nodes equal to two. N9 has the second highest value (medium red) with three direct links and zero indirect links. N3 is in third (light red) with one direct link, three indirect links with distance between nodes equal to two, and two indirect links with distance between nodes equals three. N1 and N2 are both light blue with one direct link and three indirect links each. N8 is medium blue with one direct link, one indirect with a distance of two, and three order links with a distance of three. N5, N6, and N7 are dark blue with no links to any other nodes.",
            "cite_spans": [],
            "section": "What makes a paper key",
            "ref_spans": [
                {
                    "start": 41,
                    "end": 42,
                    "mention": "1",
                    "ref_id": "FIGREF0"
                }
            ]
        },
        {
            "text": "Figure 1c displays the Big Fish paper based on the eigenvector centrality metric, again using the same network configuration as the previous two networks. Assuming that N3 and N8 (dark blue) provide very low-scoring nodes, they provide very little benefit to N4 and N1 (medium blue), respectively. N2 (light blue) receives a slight benefit from N4 which it conveys to N9 along with small benefits from N1 and N4. Therefore, due to the culmination of benefits from its incoming nodes N9 is moderately important (medium red) within the network. N9 provides its benefit to N6 and N7 (each shown in light red) as well as N5. N5 is the key node based on its eigenvector centrality value due to the cumulative benefits from N4 and N9. Therefore, each centrality metric identifies a different key node within the same network. There are network configurations that can lead to the same node being the key paper for different metrics (Bonacich 2007). In the next section, we present how these centrality metrics fit into our methodology for examining papers within PLOS.",
            "cite_spans": [
                {
                    "start": 936,
                    "end": 940,
                    "mention": "2007",
                    "ref_id": "BIBREF1"
                }
            ],
            "section": "What makes a paper key",
            "ref_spans": [
                {
                    "start": 7,
                    "end": 8,
                    "mention": "1",
                    "ref_id": "FIGREF0"
                }
            ]
        },
        {
            "text": "We employ a two-step approach for filtering and finding key papers within a publication. We start by modeling the publication as a co-citation network consisting of the papers within the publication as nodes and the relationships (the citations) between each of the papers as links. To generate this network, we first retrieve the list of citations for each paper within the journal. Next, we check each of the cited papers to identify if each cited paper comes from the same publication. For each of these papers, we then check their citations to see if they also originate from the same publication. We repeat this process until there are no additional citations that originate from the same journal as the initial paper. This procedure results in a directed network with the flow of information originating from the cited paper into the paper doing the citing. Therefore, we form a dataset of papers A\nn citing papers B\nAx, where n is the number of papers within the publication and B\nAX is the set of papers within the publication that A\ni cites (where i is the current paper). Figure 2 displays the methodology for creating the network and for analyzing the papers within the network.\n",
            "cite_spans": [],
            "section": "Methodology",
            "ref_spans": [
                {
                    "start": 1089,
                    "end": 1090,
                    "mention": "2",
                    "ref_id": "FIGREF1"
                }
            ]
        },
        {
            "text": "In Step 2, we load the set of papers for each publication into an open source graph and network analysis software tool named Gephi. Gephi provides a means to explore networks through \u201cspatializing, filtering, navigating, manipulating and clustering\u201d nodes under a variety of visualizations (Bastian et al. 2009, p. 1). Among other types of network analysis metrics, Gephi can calculate the eigenvector, betweenness, and closeness centrality metrics of each node within a directed network. Therefore, we use Gephi to read in the dataset of papers and to calculate these three centrality values for every paper within a publication. We then sort the papers from high to low values in order to determine the key papers for each of these centrality metrics. The best filter is one that returns the smallest non-zero number of papers.",
            "cite_spans": [
                {
                    "start": 306,
                    "end": 310,
                    "mention": "2009",
                    "ref_id": "BIBREF33"
                }
            ],
            "section": "Methodology",
            "ref_spans": []
        },
        {
            "text": "In order to determine which centrality metric can be used to identify key papers, we analyze the papers within the network to determine the centrality metric that best correlates with the citation counts for each paper. Our assumption is that since citation count is the standard metric, any good metric should correlate well with the number of citations. The approach is as follows. For each key paper obtained we identify (1) the total number of times the paper has been cited in any journal, (2) the total number of times the paper was cited within the journal it was published, and (3) the number of times the paper was cited by other papers within its publishing journal in the first five years of its publication. We use the Spearman correlation coefficient to measure the degree of association between each metric and these three citation counts for each key paper in order to compare the rank of a paper\u2019s centrality to its respective citation count. Spearman correlation functions by sorting the papers by high to low centrality value and assigning them a numerical value based on their ranked position after being sorted. Then, the papers are sorted by high to low value based on their citation counts and assigned a numerical value indicating their ranking after being sorted. These two sets of ranking values are then checked for correlation. This correlation approach normalizes the non-linearities between the two sets of data and also accounts for ties within the data sets (i.e. multiple papers with 1 citation). In the following section we apply this methodology to find key papers within PLOS.",
            "cite_spans": [],
            "section": "Methodology",
            "ref_spans": []
        },
        {
            "text": "We apply the eigenvector, betweenness, and closeness centrality metrics to identify key papers within each of the discipline-specific PLOS periodicals: PLOS Biology, PLOS Computational Biology, PLOS Genetics, PLOS Medicine, PLOS Pathogens, and PLOS Neglected Tropical Diseases. To accomplish this task, we first create a model of PLOS as a co-citation network that displays the papers as nodes and the links (via citations) as the connections between the nodes. The inception dates of these journals vary from 2003 to 2005, but each journal has continued to be published through 2014. For each of these journals, we construct a network representation of the papers using the approach described in the \u201cMethodology\u201d section, resulting in six unique co-citation networks. The process of creating each of these domain-specific networks starts by taking only the papers within the current periodical and then linking each paper to each other paper that it cites within any of the PLOS journals. This process repeats for each of the cited papers, and then for each of the cited papers\u2019 cited PLOS papers, and so on until there are no more cited papers that cite a PLOS paper. Additionally, while we do not create a co-citation network for PLOS One (since PLOS One is not domain specific) the cited papers that reside in PLOS One are included in the co-citation network.",
            "cite_spans": [],
            "section": "Finding key papers in PLOS",
            "ref_spans": []
        },
        {
            "text": "As an example, to create a co-citation network for PLOS Biology, we start with a paper within PLOS Biology PB\n1, extract its citation list, and identify that three of its cited papers are contained within a PLOS journal: two from PLOS Biology; and one from PLOS One. These three papers are added as nodes to the network and linked to PB\n1 using directed links that point towards PB\n1. Then we take the citation lists for each of these three papers and add them as nodes with links pointing towards the papers that they cite. This process repeats until no more citations exist within PLOS. Then, we take the next paper within PLOS Biology that is not already contained within the network and start this process again, each time adding to the existing network for PLOS Biology. Using these six co-citation networks, we compute the betweenness, closeness, and eigenvector centrality values of each paper within the six PLOS periodicals. Table 1 provides the characteristics for each of the created co-citation networks.\n",
            "cite_spans": [],
            "section": "Finding key papers in PLOS",
            "ref_spans": [
                {
                    "start": 940,
                    "end": 941,
                    "mention": "1",
                    "ref_id": "TABREF0"
                }
            ]
        },
        {
            "text": "We observe that the networks for all journals are scale-free and the paper to citation ratio (nodes to links in Table 1) follows a Power law. This means that that the citation counts do not increase proportionally with the increasing number of papers. This finding is consistent with Redner (1998) and Price (1965) about scientific papers in general and indicates that PLOS papers that are highly cited tend to get more cited over time (Price 1965) which might overvalue some papers when relying solely on citation count. We summarize our findings in Table 2 which shows the Glue, Kevin\nBacon, and Big\nFish papers within PLOS for each of the six journals. As expected, there are many Kevin Bacon papers for each of the periodicals; therefore, the total number of Kevin Bacon papers is given in place of the paper titles.\n",
            "cite_spans": [
                {
                    "start": 292,
                    "end": 296,
                    "mention": "1998",
                    "ref_id": "BIBREF25"
                },
                {
                    "start": 309,
                    "end": 313,
                    "mention": "1965",
                    "ref_id": "BIBREF24"
                },
                {
                    "start": 443,
                    "end": 447,
                    "mention": "1965",
                    "ref_id": "BIBREF24"
                }
            ],
            "section": "Finding key papers in PLOS",
            "ref_spans": [
                {
                    "start": 118,
                    "end": 119,
                    "mention": "1",
                    "ref_id": "TABREF0"
                },
                {
                    "start": 557,
                    "end": 558,
                    "mention": "2",
                    "ref_id": "TABREF1"
                }
            ]
        },
        {
            "text": "In terms of filtering, we observe that betweenness centrality (Glue Paper) is not an effective filter especially in cases where there are no distinct communities of papers. In the case of the journals that we analyzed, this filter returns zero papers. Closeness centrality (Kevin Bacon Paper) is also not a good filter because it yields a large number of papers. This finding confirms the recency bias discussed in Price (1965) and points to the lack of existence of the \u201csuper classic\u201d paper that was posited in Price (1965). In other words, there is no foundational set of papers that are cited at a relatively higher frequency in the journals that we analyzed. Eigenvector centrality (Big Fish Paper) yields a small set of papers and therefore is the best filter that can be used as an initial starting point. A key observation is that the papers we discover as Big Fish are relatively recent (2007-2014). This finding fits the metric since eigenvector centrality looks at the importance of a paper based on the papers that it cites. The transitive property of eigenvector centrality dictates that newer papers mentioning several important works gains more importance regardless of length of time between the publications. We also observe that although the papers identified as key have a low number of citations, the number of downloads is very high (average 1704 and median 1082 downloads). Table 3 provides additional information on the Big Fish papers for each of the six domain specific PLOS journals.\n",
            "cite_spans": [
                {
                    "start": 422,
                    "end": 426,
                    "mention": "1965",
                    "ref_id": "BIBREF24"
                },
                {
                    "start": 520,
                    "end": 524,
                    "mention": "1965",
                    "ref_id": "BIBREF24"
                }
            ],
            "section": "Discussion",
            "ref_spans": [
                {
                    "start": 1402,
                    "end": 1403,
                    "mention": "3",
                    "ref_id": "TABREF2"
                }
            ]
        },
        {
            "text": "In terms of using eigenvector centrality as a metric, papers with high eigenvector values have an advantage over papers with low values since an increasing citation count for a paper in a network causes the eigenvector value of all of its connected papers to also increase. However, since it has been shown that papers that get cited tend to get cited more (scale-free property), papers connected to those with high eigenvector centrality value will get an indirect boost in relative importance. As a result, eigenvector centrality is a good filter but we need to investigate more in order to determine if it also serves as a good metric for determining which papers are key.",
            "cite_spans": [],
            "section": "Discussion",
            "ref_spans": []
        },
        {
            "text": "As stated in the \u201cFinding key papers in PLOS\u201d section, we explore the correlation between centrality metrics and citation counts to determine which metrics serve as good filters. We will focus only on eigenvector centrality since it is the best filter according to our criteria. Specifically, we explore the extent to which eigenvector centrality explains: (1) the number of times the paper was cited within PLOS in the first 5 years of its publication; (2) the total number of times that the paper was cited within PLOS; and (3) the total number of times the paper has been cited in any publication according to Google Scholar. The numbers of citations for (1) and (2) will be equal for papers that are not yet 5 years old. We use the Spearman correlation coefficient to measure the degree of association between the eigenvector centrality of a paper and the three collected citation counts to compare the rank of a paper\u2019s centrality to the rank of its respective citation count. This is preferable to comparing the value of a paper\u2019s centrality measure to the value of its respective citation counts because each of the three citation counts follows a logarithmic distribution. Since we know that the citation count follows a power law, ranking each of the variables normalizes these non-linearities between the data sets. Table 4 shows that for all six discipline-specific PLOS journals there is a positive statistically significant Spearman correlation between the eigenvector centrality of a paper within our network and each of the three citation counts. Furthermore, almost all the correlations are of moderate strength (>0.50) and many related to the number of citations within the journal are strong (>0.80). The eigenvector centrality values correlate well within discipline key papers within 5 years of publication and at least moderately predictive for all other citations. As a result, we conclude that eigenvector centrality is the most appropriate centrality metric for filtering papers and measuring the relative importance of a paper within a journal.\n",
            "cite_spans": [],
            "section": "Discussion",
            "ref_spans": [
                {
                    "start": 1332,
                    "end": 1333,
                    "mention": "4",
                    "ref_id": "TABREF3"
                }
            ]
        },
        {
            "text": "Eigenvector centrality identifies the papers frequently cited by other important papers within other disciplines of the same journal for papers within a specific discipline. A high Spearman ranking correlation between eigenvector centrality values and citation counts indicates that papers with high eigenvector centrality values also have high citation counts relative to the other papers within the journal. Recall that Spearman ranking correlation accounts for the ranking of eigenvector values against the ranking of the citation counts for the papers. This might indicate that people are more likely to cite (1) papers within the outlet that they are trying to publish in because the authors are aware of the existing research or they feel pressured to cite papers within this outlet as discussed in Wilhite and Fong (2012) and (2) papers within their first 5 years of publication since they are on the cutting edge of research as observed in Price (1965).",
            "cite_spans": [
                {
                    "start": 823,
                    "end": 827,
                    "mention": "2012",
                    "ref_id": "BIBREF30"
                },
                {
                    "start": 955,
                    "end": 959,
                    "mention": "1965",
                    "ref_id": "BIBREF24"
                }
            ],
            "section": "Discussion",
            "ref_spans": []
        },
        {
            "text": "The strength of the Spearman Correlation coefficient decreases (despite remaining statistically significant) when we examine the rank of the eigenvector values against the rank of the total Google Scholar citation counts. This may occur due to the authors being less aware of the papers, being less inclined to search for papers outside of the journal that they are publishing in, or feeling less pressured to cite papers within the current outlet thereby denoting a real non-spurious relationship between the two measures. The papers with low eigenvector centrality values are less likely to be cited by researchers going forward as these papers may not be at the forefront of the research within that discipline, as evidenced by the high correlation between low eigenvector values and low citation counts. However, these papers remain likely to be cited since the correlations remain strong. These finding is also in line with those of Price (1965). In short, Eigenvalue is a good metric for in-journal article ranking with the limitation that the value of a paper can be inflated as the papers it relates grows in citation count.",
            "cite_spans": [
                {
                    "start": 945,
                    "end": 949,
                    "mention": "1965",
                    "ref_id": "BIBREF24"
                }
            ],
            "section": "Discussion",
            "ref_spans": []
        },
        {
            "text": "In this paper, we examine the extent to which the metrics are useful for identifying important papers within a journal and we identify 12 Big Fish papers within PLOS. We show that the co-citation network within PLOS follows a power law similar to that of the citation count of a paper over time. Consequently, closeness centrality is not very useful for filtering the papers within a journal because it yields too many important papers and betweenness centrality is not a useful metric when there are no communities of papers to connect. Results show that eigenvector centrality is a good metric for identifying important papers in a journal. Our results are critical in that eigenvector centrality is time-independent and allows for the identification of key papers at the time of their publication. While a newly published paper may be classified as a key paper with respect to eigenvector centrality, the paper will not yet have had a chance to be read by the scientific community; therefore, the eigenvector centrality metric serves as a starting hypothesis that the paper is indeed a key paper. These Big Fish papers link with highly regarded papers and having passed through a peer reviewed process may indeed serve as a key paper within the same networks as the papers that they cite.",
            "cite_spans": [],
            "section": "Conclusions",
            "ref_spans": []
        },
        {
            "text": "We recommend that journals calculate and include the eigenvector centrality of each paper within the publication to provide both researchers and students an idea of the relative importance of the paper within its own publication or within a larger body of knowledge. We also recommend that journals publish and update the top 10 or top 25 papers in decreasing order of eigenvector centrality each time a new issue of the journal is published. This top 10 or top 25 can constitute the initial set of papers that the journal recommends a researcher use as a starting point for exploring the journal. The peer-review process remains critical in preventing unworthy papers from being published even if they cite a large number of key papers. Chan et al. (2015) note that the quality of the scientific contribution of a work can be biased due to factors such as institutional affiliation and the time of publication. Therefore, the eigenvector centrality metric identifies papers that are reachable from other key papers, but it does not serve as an absolute metric on the quality of identified Big Fish papers. Furthermore, in terms of proposal submission and promotion, researchers can show the importance of new publications before they accumulate citations by employing eigenvector centrality. Finally, each researcher can create a co-citation network of their publication and measure the relative importance of their work based on the eigenvector centrality rather than the total citation count. By doing so, researchers can identify other important work that is related to their most important work and thus explore fruitful lines of work and areas of collaboration with other researchers working in the same domain.",
            "cite_spans": [
                {
                    "start": 751,
                    "end": 755,
                    "mention": "2015",
                    "ref_id": "BIBREF2"
                }
            ],
            "section": "Conclusions",
            "ref_spans": []
        },
        {
            "text": "Future work includes further exploring the connections between Big Fish papers and their download counts over time. Of particular interest to eigenvector centrality is the potential to explore the usefulness of a weighted-eigenvector metric that accounts for the total download counts or frequency of downloads over time for each paper within the network. Additionally, the centrality values of the papers obtained using citations within the journals that they are published in can be compared against their centrality values using citations from all sources to examine the effect on the determination of keyness for a paper between these two sources.",
            "cite_spans": [],
            "section": "Conclusions",
            "ref_spans": []
        }
    ],
    "ref_entries": {
        "TABREF0": {
            "text": "Table\u00a01: Network configuration of each of the discipline-specific PLOS periodicals\nThe number of links shown in Column 4 are the number of links connecting any PLOS paper to another PLOS paper within the dataset",
            "type": "table"
        },
        "TABREF1": {
            "text": "Table\u00a02: Comparative view of key papers based on each centrality metric\nColumn 1 provides each journal within PLOS along with the year that the journal was established. Columns 2, 3, and 4 present the Glue, Kevin\nBacon, and Big\nFish papers within each journal, respectively. Column 3 also indicates which journals the Kevin Bacon papers originate from including PLOS One. Column 5 provides the Eigenvector values for the Big Fish papers. Due to the large number of Kevin Bacon papers within each journal the total number of Kevin Bacon papers is provided in place of the titles",
            "type": "table"
        },
        "TABREF2": {
            "text": "Table\u00a03: Analysis of key Big Fish papers for each PLOS journal\nColumn 1 provides the title of the key paper. Column 2 displays the journal containing the key paper. Column 3 shows the year that the journal was established. Column 4 displays the year that the key paper was published. Column 5 shows the number of times that the paper is cited by other papers within PLOS as of February 19, 2015. Column 6 shows the total number of times that the paper has been downloaded from the PLOS website in either PDF or XML formats as of February 20, 2015",
            "type": "table"
        },
        "TABREF3": {
            "text": "Table\u00a04: Correlation of eigenvector centrality metrics for papers in each publication within PLOS\nColumn 1 displays the name of the PLOS journal. Column 2 displays the correlation between the eigenvector centrality value and the number of citations that the paper has accumulated by other papers within PLOS after 5 years. Column 3 displays the correlation between the eigenvector centrality value and the number of citations that the paper has accumulated by other papers within PLOS by the year 2014. Column 4 displays the correlation between the eigenvector centrality value and the total number of citations from any source that the paper has accumulated by the end of year 2014 according to Google Scholar",
            "type": "table"
        },
        "FIGREF0": {
            "text": "Fig.\u00a01: Example of \u201ckey\u201d papers based on the selected centrality metric for directed networks. A color scheme represents the keyness of each paper in the network with the most \u201ckey\u201d papers shown in dark red (maximum value) and the least key papers shown in dark blue (minimum value). a N9 falls on the greatest number of shortest paths between other nodes within the network and serves as the Glue paper. b N4 contains the greatest number of connections (direct plus indirect) to the other nodes and serves as the Kevin Bacon paper. c N5 connects to higher valued papers and serves as the Big Fish paper. (Color figure online)",
            "type": "figure"
        },
        "FIGREF1": {
            "text": "Fig.\u00a02: Two-step process for determining the \u201ckey\u201d papers within a publication based on the three centrality metrics. Step 1 involves creating the citation network for all of the papers within each publication. Step 2 involves calculating the centrality values for each paper within the network in order to identify the \u201ckey\u201d papers based on each centrality metric",
            "type": "figure"
        }
    },
    "back_matter": [],
    "bib_entries": {
        "BIBREF0": {
            "title": "Do important papers produce high citation counts?",
            "authors": [
                {
                    "first": "HA",
                    "middle": [],
                    "last": "Abt",
                    "suffix": ""
                }
            ],
            "year": 2000,
            "venue": "Scientometrics",
            "volume": "48",
            "issn": "1",
            "pages": "65-70",
            "other_ids": {
                "DOI": [
                    "10.1023/A:1005680318379"
                ]
            }
        },
        "BIBREF1": {
            "title": "Some unique properties of eigenvector centrality",
            "authors": [
                {
                    "first": "P",
                    "middle": [],
                    "last": "Bonacich",
                    "suffix": ""
                }
            ],
            "year": 2007,
            "venue": "Social Networks",
            "volume": "29",
            "issn": "4",
            "pages": "555-564",
            "other_ids": {
                "DOI": [
                    "10.1016/j.socnet.2007.04.002"
                ]
            }
        },
        "BIBREF2": {
            "title": "The inner quality of an article: Will time tell?",
            "authors": [
                {
                    "first": "HF",
                    "middle": [],
                    "last": "Chan",
                    "suffix": ""
                },
                {
                    "first": "M",
                    "middle": [],
                    "last": "Guillot",
                    "suffix": ""
                },
                {
                    "first": "L",
                    "middle": [],
                    "last": "Page",
                    "suffix": ""
                },
                {
                    "first": "B",
                    "middle": [],
                    "last": "Torgler",
                    "suffix": ""
                }
            ],
            "year": 2015,
            "venue": "Scientometrics",
            "volume": "104",
            "issn": "1",
            "pages": "19-41",
            "other_ids": {
                "DOI": [
                    "10.1007/s11192-015-1581-y"
                ]
            }
        },
        "BIBREF3": {
            "title": "LexRank: Graph-based lexical centrality as salience in text summarization",
            "authors": [
                {
                    "first": "G",
                    "middle": [],
                    "last": "Erkan",
                    "suffix": ""
                },
                {
                    "first": "DR",
                    "middle": [],
                    "last": "Radev",
                    "suffix": ""
                }
            ],
            "year": 2004,
            "venue": "Journal of Artificial Intelligence Research",
            "volume": "22",
            "issn": "",
            "pages": "457-479",
            "other_ids": {
                "DOI": []
            }
        },
        "BIBREF4": {
            "title": "Predicting faculty job centrality in communication",
            "authors": [
                {
                    "first": "TH",
                    "middle": [],
                    "last": "Feeley",
                    "suffix": ""
                },
                {
                    "first": "KH",
                    "middle": [],
                    "last": "LaVail",
                    "suffix": ""
                },
                {
                    "first": "GA",
                    "middle": [],
                    "last": "Barnett",
                    "suffix": ""
                }
            ],
            "year": 2010,
            "venue": "Scientometrics",
            "volume": "87",
            "issn": "2",
            "pages": "303-314",
            "other_ids": {
                "DOI": [
                    "10.1007/s11192-010-0324-3"
                ]
            }
        },
        "BIBREF5": {
            "title": "A set of measures of centrality based on betweenness",
            "authors": [
                {
                    "first": "LC",
                    "middle": [],
                    "last": "Freeman",
                    "suffix": ""
                }
            ],
            "year": 1977,
            "venue": "Sociometry",
            "volume": "40",
            "issn": "1",
            "pages": "35-41",
            "other_ids": {
                "DOI": [
                    "10.2307/3033543"
                ]
            }
        },
        "BIBREF6": {
            "title": "Centrality in social networks conceptual clarification",
            "authors": [
                {
                    "first": "LC",
                    "middle": [],
                    "last": "Freeman",
                    "suffix": ""
                }
            ],
            "year": 1979,
            "venue": "Social Networks",
            "volume": "1",
            "issn": "3",
            "pages": "215-239",
            "other_ids": {
                "DOI": [
                    "10.1016/0378-8733(78)90021-7"
                ]
            }
        },
        "BIBREF7": {
            "title": "The history and meaning of the journal impact factor",
            "authors": [
                {
                    "first": "E",
                    "middle": [],
                    "last": "Garfield",
                    "suffix": ""
                }
            ],
            "year": 2006,
            "venue": "The Journal of the American Medical Association",
            "volume": "295",
            "issn": "1",
            "pages": "90-93",
            "other_ids": {
                "DOI": [
                    "10.1001/jama.295.1.90"
                ]
            }
        },
        "BIBREF8": {
            "title": "Central journals and authors in communication using a publication network",
            "authors": [
                {
                    "first": "DJ",
                    "middle": [],
                    "last": "Griffin",
                    "suffix": ""
                },
                {
                    "first": "S",
                    "middle": [],
                    "last": "Bolkan",
                    "suffix": ""
                },
                {
                    "first": "JL",
                    "middle": [],
                    "last": "Holmgren",
                    "suffix": ""
                },
                {
                    "first": "F",
                    "middle": [],
                    "last": "Tutzauer",
                    "suffix": ""
                }
            ],
            "year": 2015,
            "venue": "Scientometrics",
            "volume": "",
            "issn": "",
            "pages": null,
            "other_ids": {
                "DOI": []
            }
        },
        "BIBREF9": {
            "title": "College libraries and chemical education",
            "authors": [
                {
                    "first": "PLK",
                    "middle": [],
                    "last": "Gross",
                    "suffix": ""
                },
                {
                    "first": "EM",
                    "middle": [],
                    "last": "Gross",
                    "suffix": ""
                }
            ],
            "year": 1927,
            "venue": "Science",
            "volume": "66",
            "issn": "1713",
            "pages": "385-389",
            "other_ids": {
                "DOI": [
                    "10.1126/science.66.1713.385"
                ]
            }
        },
        "BIBREF10": {
            "title": "Q-measures and betweenness centrality in a collaboration network: A case study of the field of informetrics",
            "authors": [
                {
                    "first": "R",
                    "middle": [],
                    "last": "Guns",
                    "suffix": ""
                },
                {
                    "first": "YX",
                    "middle": [],
                    "last": "Liu",
                    "suffix": ""
                },
                {
                    "first": "D",
                    "middle": [],
                    "last": "Mahbuba",
                    "suffix": ""
                }
            ],
            "year": 2011,
            "venue": "Scientometrics",
            "volume": "87",
            "issn": "1",
            "pages": "133-147",
            "other_ids": {
                "DOI": [
                    "10.1007/s11192-010-0332-3"
                ]
            }
        },
        "BIBREF11": {
            "title": "Googling food webs: Can an eigenvector measure species\u2019 importance for coextinctions",
            "authors": [
                {
                    "first": "S",
                    "middle": [],
                    "last": "Allesina",
                    "suffix": ""
                },
                {
                    "first": "M",
                    "middle": [],
                    "last": "Pascual",
                    "suffix": ""
                }
            ],
            "year": 2009,
            "venue": "PLoS Computational Biology",
            "volume": "5",
            "issn": "9",
            "pages": null,
            "other_ids": {
                "DOI": [
                    "10.1371/journal.pcbi.1000494"
                ]
            }
        },
        "BIBREF12": {
            "title": "",
            "authors": [
                {
                    "first": "RA",
                    "middle": [],
                    "last": "Hanneman",
                    "suffix": ""
                },
                {
                    "first": "M",
                    "middle": [],
                    "last": "Riddle",
                    "suffix": ""
                }
            ],
            "year": 2005,
            "venue": "Introduction to social network methods",
            "volume": "",
            "issn": "",
            "pages": null,
            "other_ids": {
                "DOI": []
            }
        },
        "BIBREF13": {
            "title": "A new measure of centrality for brain networks",
            "authors": [
                {
                    "first": "KE",
                    "middle": [],
                    "last": "Joyce",
                    "suffix": ""
                },
                {
                    "first": "PJ",
                    "middle": [],
                    "last": "Laurienti",
                    "suffix": ""
                },
                {
                    "first": "JH",
                    "middle": [],
                    "last": "Burdette",
                    "suffix": ""
                },
                {
                    "first": "S",
                    "middle": [],
                    "last": "Hayasaka",
                    "suffix": ""
                }
            ],
            "year": 2010,
            "venue": "PLoS ONE",
            "volume": "5",
            "issn": "8",
            "pages": null,
            "other_ids": {
                "DOI": [
                    "10.1371/journal.pone.0012200"
                ]
            }
        },
        "BIBREF14": {
            "title": "",
            "authors": [],
            "year": null,
            "venue": "",
            "volume": "",
            "issn": "",
            "pages": null,
            "other_ids": {
                "DOI": []
            }
        },
        "BIBREF15": {
            "title": "Information technology management domain: Emerging themes and keyword analysis",
            "authors": [
                {
                    "first": "GF",
                    "middle": [],
                    "last": "Khan",
                    "suffix": ""
                },
                {
                    "first": "J",
                    "middle": [],
                    "last": "Wood",
                    "suffix": ""
                }
            ],
            "year": 2015,
            "venue": "Scientometrics",
            "volume": "",
            "issn": "",
            "pages": null,
            "other_ids": {
                "DOI": []
            }
        },
        "BIBREF16": {
            "title": "Betweenness centrality as an indicator of the interdisciplinarity of scientific journals",
            "authors": [
                {
                    "first": "L",
                    "middle": [],
                    "last": "Leydesdorff",
                    "suffix": ""
                }
            ],
            "year": 2007,
            "venue": "Journal of the American Society for Information Science and Technology",
            "volume": "58",
            "issn": "9",
            "pages": "1303-1319",
            "other_ids": {
                "DOI": [
                    "10.1002/asi.20614"
                ]
            }
        },
        "BIBREF17": {
            "title": "\u201cStructuration\u201d by intellectual organization: the configuration of knowledge in relations among structural components in networks of science",
            "authors": [
                {
                    "first": "L",
                    "middle": [],
                    "last": "Leydesdorff",
                    "suffix": ""
                }
            ],
            "year": 2011,
            "venue": "Scientometrics",
            "volume": "88",
            "issn": "2",
            "pages": "499-520",
            "other_ids": {
                "DOI": [
                    "10.1007/s11192-011-0397-7"
                ]
            }
        },
        "BIBREF18": {
            "title": "Connection and stratification in research collaboration: An analysis of the COLLNET network",
            "authors": [
                {
                    "first": "Y",
                    "middle": [],
                    "last": "Li-chun",
                    "suffix": ""
                },
                {
                    "first": "H",
                    "middle": [],
                    "last": "Kretschmer",
                    "suffix": ""
                },
                {
                    "first": "RA",
                    "middle": [],
                    "last": "Hanneman",
                    "suffix": ""
                },
                {
                    "first": "ZY",
                    "middle": [],
                    "last": "Liu",
                    "suffix": ""
                }
            ],
            "year": 2006,
            "venue": "Information Processing and Management",
            "volume": "42",
            "issn": "6",
            "pages": "1599-1613",
            "other_ids": {
                "DOI": [
                    "10.1016/j.ipm.2006.03.021"
                ]
            }
        },
        "BIBREF19": {
            "title": "Co-authorship networks in the digital library research community",
            "authors": [
                {
                    "first": "X",
                    "middle": [],
                    "last": "Liu",
                    "suffix": ""
                },
                {
                    "first": "J",
                    "middle": [],
                    "last": "Bollen",
                    "suffix": ""
                },
                {
                    "first": "ML",
                    "middle": [],
                    "last": "Nelson",
                    "suffix": ""
                },
                {
                    "first": "H",
                    "middle": [],
                    "last": "Van de Sompel",
                    "suffix": ""
                }
            ],
            "year": 2005,
            "venue": "Information Processing and Management",
            "volume": "41",
            "issn": "6",
            "pages": "1462-1480",
            "other_ids": {
                "DOI": [
                    "10.1016/j.ipm.2005.03.012"
                ]
            }
        },
        "BIBREF20": {
            "title": "Modeling knowledge diffusion in scientific innovation networks: an institutional comparison between China and US with illustration for nanotechnology",
            "authors": [
                {
                    "first": "X",
                    "middle": [],
                    "last": "Liu",
                    "suffix": ""
                },
                {
                    "first": "S",
                    "middle": [],
                    "last": "Jiang",
                    "suffix": ""
                },
                {
                    "first": "H",
                    "middle": [],
                    "last": "Chen",
                    "suffix": ""
                },
                {
                    "first": "CA",
                    "middle": [],
                    "last": "Larson",
                    "suffix": ""
                },
                {
                    "first": "MC",
                    "middle": [],
                    "last": "Roco",
                    "suffix": ""
                }
            ],
            "year": 2015,
            "venue": "Scientometrics",
            "volume": "",
            "issn": "",
            "pages": null,
            "other_ids": {
                "DOI": []
            }
        },
        "BIBREF21": {
            "title": "Eigenvector centrality mapping for analyzing connectivity patterns in fMRI data of the human brain",
            "authors": [
                {
                    "first": "G",
                    "middle": [],
                    "last": "Lohmann",
                    "suffix": ""
                },
                {
                    "first": "DS",
                    "middle": [],
                    "last": "Margulies",
                    "suffix": ""
                },
                {
                    "first": "A",
                    "middle": [],
                    "last": "Horstmann",
                    "suffix": ""
                },
                {
                    "first": "B",
                    "middle": [],
                    "last": "Pleger",
                    "suffix": ""
                },
                {
                    "first": "J",
                    "middle": [],
                    "last": "Lepsien",
                    "suffix": ""
                },
                {
                    "first": "D",
                    "middle": [],
                    "last": "Goldhahn",
                    "suffix": ""
                },
                {
                    "first": "H",
                    "middle": [],
                    "last": "Schloegl",
                    "suffix": ""
                },
                {
                    "first": "M",
                    "middle": [],
                    "last": "Stumvoll",
                    "suffix": ""
                },
                {
                    "first": "A",
                    "middle": [],
                    "last": "Villringer",
                    "suffix": ""
                },
                {
                    "first": "R",
                    "middle": [],
                    "last": "Turner",
                    "suffix": ""
                }
            ],
            "year": 2010,
            "venue": "PLoS ONE",
            "volume": "5",
            "issn": "4",
            "pages": "e10232-e10232",
            "other_ids": {
                "DOI": [
                    "10.1371/journal.pone.0010232"
                ]
            }
        },
        "BIBREF22": {
            "title": "Citations among communication journals and other disciplines: A network analysis",
            "authors": [
                {
                    "first": "GA",
                    "middle": [],
                    "last": "Barnett",
                    "suffix": ""
                },
                {
                    "first": "C",
                    "middle": [],
                    "last": "Huh",
                    "suffix": ""
                },
                {
                    "first": "Y",
                    "middle": [],
                    "last": "Kim",
                    "suffix": ""
                },
                {
                    "first": "HW",
                    "middle": [],
                    "last": "Park",
                    "suffix": ""
                }
            ],
            "year": 2011,
            "venue": "Scientometrics",
            "volume": "88",
            "issn": "2",
            "pages": "449-469",
            "other_ids": {
                "DOI": [
                    "10.1007/s11192-011-0381-2"
                ]
            }
        },
        "BIBREF23": {
            "title": "Article-level metrics and the evolution of scientific impact",
            "authors": [
                {
                    "first": "C",
                    "middle": [],
                    "last": "Neylon",
                    "suffix": ""
                },
                {
                    "first": "S",
                    "middle": [],
                    "last": "Wu",
                    "suffix": ""
                }
            ],
            "year": 2009,
            "venue": "PLoS Biology",
            "volume": "",
            "issn": "",
            "pages": null,
            "other_ids": {
                "DOI": []
            }
        },
        "BIBREF24": {
            "title": "Networks of scientific papers",
            "authors": [
                {
                    "first": "D",
                    "middle": [],
                    "last": "Price",
                    "suffix": ""
                }
            ],
            "year": 1965,
            "venue": "Science",
            "volume": "149",
            "issn": "",
            "pages": "510-515",
            "other_ids": {
                "DOI": [
                    "10.1126/science.149.3683.510"
                ]
            }
        },
        "BIBREF25": {
            "title": "How popular is your paper? An empirical study of the citation distribution",
            "authors": [
                {
                    "first": "S",
                    "middle": [],
                    "last": "Redner",
                    "suffix": ""
                }
            ],
            "year": 1998,
            "venue": "The European Physical Journal B-Condensed Matter and Complex Systems",
            "volume": "4",
            "issn": "2",
            "pages": "131-134",
            "other_ids": {
                "DOI": [
                    "10.1007/s100510050359"
                ]
            }
        },
        "BIBREF26": {
            "title": "The utility of scientific papers",
            "authors": [
                {
                    "first": "JL",
                    "middle": [],
                    "last": "Sikorav",
                    "suffix": ""
                }
            ],
            "year": 1991,
            "venue": "Scientometrics",
            "volume": "21",
            "issn": "1",
            "pages": "49-68",
            "other_ids": {
                "DOI": [
                    "10.1007/BF02019182"
                ]
            }
        },
        "BIBREF27": {
            "title": "Citation choice and innovation in science studies",
            "authors": [
                {
                    "first": "K",
                    "middle": [],
                    "last": "Siler",
                    "suffix": ""
                }
            ],
            "year": 2013,
            "venue": "Scientometrics",
            "volume": "95",
            "issn": "1",
            "pages": "385-415",
            "other_ids": {
                "DOI": [
                    "10.1007/s11192-012-0881-8"
                ]
            }
        },
        "BIBREF28": {
            "title": "Effectiveness of journal ranking schemes as a tool for locating information",
            "authors": [
                {
                    "first": "MJ",
                    "middle": [],
                    "last": "Stringer",
                    "suffix": ""
                },
                {
                    "first": "M",
                    "middle": [],
                    "last": "Sales-Pardo",
                    "suffix": ""
                },
                {
                    "first": "LAN",
                    "middle": [],
                    "last": "Amaral",
                    "suffix": ""
                }
            ],
            "year": 2008,
            "venue": "PLoS ONE",
            "volume": "",
            "issn": "",
            "pages": null,
            "other_ids": {
                "DOI": []
            }
        },
        "BIBREF29": {
            "title": "The eigenfactor metrics\u2122: A network approach to assessing scholarly journals",
            "authors": [
                {
                    "first": "JD",
                    "middle": [],
                    "last": "West",
                    "suffix": ""
                },
                {
                    "first": "TC",
                    "middle": [],
                    "last": "Bergstrom",
                    "suffix": ""
                },
                {
                    "first": "CT",
                    "middle": [],
                    "last": "Bergstrom",
                    "suffix": ""
                }
            ],
            "year": 2010,
            "venue": "College & Research Libraries",
            "volume": "71",
            "issn": "3",
            "pages": "236-244",
            "other_ids": {
                "DOI": [
                    "10.5860/0710236"
                ]
            }
        },
        "BIBREF30": {
            "title": "Coercive citation in academic publishing",
            "authors": [
                {
                    "first": "AW",
                    "middle": [],
                    "last": "Wilhite",
                    "suffix": ""
                },
                {
                    "first": "EA",
                    "middle": [],
                    "last": "Fong",
                    "suffix": ""
                }
            ],
            "year": 2012,
            "venue": "Science",
            "volume": "335",
            "issn": "6068",
            "pages": "542-543",
            "other_ids": {
                "DOI": [
                    "10.1126/science.1212540"
                ]
            }
        },
        "BIBREF31": {
            "title": "Applying centrality measures to impact analysis: A coauthorship network analysis",
            "authors": [
                {
                    "first": "E",
                    "middle": [],
                    "last": "Yan",
                    "suffix": ""
                },
                {
                    "first": "Y",
                    "middle": [],
                    "last": "Ding",
                    "suffix": ""
                }
            ],
            "year": 2009,
            "venue": "Journal of the American Society for Information Science and Technology",
            "volume": "60",
            "issn": "10",
            "pages": "2107-2118",
            "other_ids": {
                "DOI": [
                    "10.1002/asi.21128"
                ]
            }
        },
        "BIBREF32": {
            "title": "Highly cited research papers and the evaluation of a research university: A case study: Peking University 1974\u20132003",
            "authors": [
                {
                    "first": "X",
                    "middle": [],
                    "last": "Zhu",
                    "suffix": ""
                },
                {
                    "first": "Q",
                    "middle": [],
                    "last": "Wu",
                    "suffix": ""
                },
                {
                    "first": "Y",
                    "middle": [],
                    "last": "Zheng",
                    "suffix": ""
                },
                {
                    "first": "X",
                    "middle": [],
                    "last": "Ma",
                    "suffix": ""
                }
            ],
            "year": 2004,
            "venue": "Scientometrics",
            "volume": "60",
            "issn": "2",
            "pages": "237-347",
            "other_ids": {
                "DOI": [
                    "10.1023/B:SCIE.0000027795.69665.09"
                ]
            }
        },
        "BIBREF33": {
            "title": "Gephi: An open source software for exploring and manipulating networks",
            "authors": [
                {
                    "first": "M",
                    "middle": [],
                    "last": "Bastian",
                    "suffix": ""
                },
                {
                    "first": "S",
                    "middle": [],
                    "last": "Heymann",
                    "suffix": ""
                },
                {
                    "first": "M",
                    "middle": [],
                    "last": "Jacomy",
                    "suffix": ""
                }
            ],
            "year": 2009,
            "venue": "In Proceedings of the Third International AAAI Conference on Weblogs and Social Media (ICWSM)",
            "volume": "8",
            "issn": "",
            "pages": "361-362",
            "other_ids": {
                "DOI": []
            }
        },
        "BIBREF34": {
            "title": "An overview of graph-based keyword extraction methods and approaches",
            "authors": [
                {
                    "first": "S",
                    "middle": [],
                    "last": "Beliga",
                    "suffix": ""
                },
                {
                    "first": "A",
                    "middle": [],
                    "last": "Me\u0161trovi\u0107",
                    "suffix": ""
                },
                {
                    "first": "S",
                    "middle": [],
                    "last": "Martin\u010di\u0107-Ip\u0161i\u0107",
                    "suffix": ""
                }
            ],
            "year": 2015,
            "venue": "Journal of Information and Organizational Sciences",
            "volume": "39",
            "issn": "1",
            "pages": "1-20",
            "other_ids": {
                "DOI": []
            }
        },
        "BIBREF35": {
            "title": "Measuring the value and prestige of scholarly journals",
            "authors": [
                {
                    "first": "C",
                    "middle": [],
                    "last": "Bergstrom",
                    "suffix": ""
                }
            ],
            "year": 2007,
            "venue": "College & Research Libraries News",
            "volume": "68",
            "issn": "5",
            "pages": null,
            "other_ids": {
                "DOI": []
            }
        },
        "BIBREF36": {
            "title": "Journal status",
            "authors": [
                {
                    "first": "J",
                    "middle": [],
                    "last": "Bollen",
                    "suffix": ""
                },
                {
                    "first": "MA",
                    "middle": [],
                    "last": "Rodriguez",
                    "suffix": ""
                },
                {
                    "first": "H",
                    "middle": [],
                    "last": "Van de Sompel",
                    "suffix": ""
                }
            ],
            "year": 2006,
            "venue": "Scientometrics",
            "volume": "69",
            "issn": "3",
            "pages": "669-687",
            "other_ids": {
                "DOI": [
                    "10.1007/s11192-006-0176-z"
                ]
            }
        },
        "BIBREF37": {
            "title": "Technique for analyzing overlapping memberships",
            "authors": [
                {
                    "first": "P",
                    "middle": [],
                    "last": "Bonacich",
                    "suffix": ""
                }
            ],
            "year": 1972,
            "venue": "Sociological Methodology",
            "volume": "4",
            "issn": "",
            "pages": "176-185",
            "other_ids": {
                "DOI": [
                    "10.2307/270732"
                ]
            }
        },
        "BIBREF38": {
            "title": "Power and centrality: A family of measures",
            "authors": [
                {
                    "first": "P",
                    "middle": [],
                    "last": "Bonacich",
                    "suffix": ""
                }
            ],
            "year": 1987,
            "venue": "American Journal of Sociology",
            "volume": "92",
            "issn": "5",
            "pages": "1170-1182",
            "other_ids": {
                "DOI": [
                    "10.1086/228631"
                ]
            }
        }
    }
}