{
    "paper_id": "PMC7086679",
    "metadata": {
        "title": "Detection of bovine coronavirus in feces by reversed passive hemagglutination",
        "authors": [
            {
                "first": "K.",
                "middle": [],
                "last": "Sato",
                "suffix": "",
                "email": null,
                "affiliation": {}
            },
            {
                "first": "Y.",
                "middle": [],
                "last": "Inaba",
                "suffix": "",
                "email": null,
                "affiliation": {}
            },
            {
                "first": "S.",
                "middle": [],
                "last": "Tokuhisa",
                "suffix": "",
                "email": null,
                "affiliation": {}
            },
            {
                "first": "Y.",
                "middle": [],
                "last": "Miura",
                "suffix": "",
                "email": null,
                "affiliation": {}
            },
            {
                "first": "N.",
                "middle": [],
                "last": "Kaneko",
                "suffix": "",
                "email": null,
                "affiliation": {}
            },
            {
                "first": "M.",
                "middle": [],
                "last": "Asagi",
                "suffix": "",
                "email": null,
                "affiliation": {}
            },
            {
                "first": "M.",
                "middle": [],
                "last": "Matumoto",
                "suffix": "",
                "email": null,
                "affiliation": {}
            }
        ]
    },
    "body_text": [],
    "ref_entries": {},
    "back_matter": [],
    "bib_entries": {
        "BIBREF0": {
            "title": "Chemical Coupling of peptides and proteins to polysaccharides by means of cyanogen halides",
            "authors": [
                {
                    "first": "R.",
                    "middle": [],
                    "last": "Ax\u00e9n",
                    "suffix": ""
                },
                {
                    "first": "J.",
                    "middle": [],
                    "last": "Forath",
                    "suffix": ""
                },
                {
                    "first": "S.",
                    "middle": [],
                    "last": "Ernback",
                    "suffix": ""
                }
            ],
            "year": 1967,
            "venue": "Nature",
            "volume": "214",
            "issn": "",
            "pages": "1302-1304",
            "other_ids": {
                "DOI": []
            }
        },
        "BIBREF1": {
            "title": "Neonatal calf diarrhea: propagation, attenuation and characteristics of a coronavirus-like agent",
            "authors": [
                {
                    "first": "C.",
                    "middle": [
                        "A."
                    ],
                    "last": "Mebus",
                    "suffix": ""
                },
                {
                    "first": "E.",
                    "middle": [
                        "L."
                    ],
                    "last": "Stair",
                    "suffix": ""
                },
                {
                    "first": "M.",
                    "middle": [
                        "B."
                    ],
                    "last": "Rhodes",
                    "suffix": ""
                },
                {
                    "first": "M.",
                    "middle": [
                        "J."
                    ],
                    "last": "Twiehaus",
                    "suffix": ""
                }
            ],
            "year": 1973,
            "venue": "Am. J. Vet. Res.",
            "volume": "34",
            "issn": "",
            "pages": "145-150",
            "other_ids": {
                "DOI": []
            }
        },
        "BIBREF2": {
            "title": "Pathology of neonatal calf diarrhea induced by a coronavirus-like agent",
            "authors": [
                {
                    "first": "C.",
                    "middle": [
                        "A."
                    ],
                    "last": "Mebus",
                    "suffix": ""
                },
                {
                    "first": "E.",
                    "middle": [
                        "L."
                    ],
                    "last": "Stair",
                    "suffix": ""
                },
                {
                    "first": "M.",
                    "middle": [
                        "J."
                    ],
                    "last": "Twiehaus",
                    "suffix": ""
                }
            ],
            "year": 1973,
            "venue": "Vet. Pathol.",
            "volume": "10",
            "issn": "",
            "pages": "45-64",
            "other_ids": {
                "DOI": []
            }
        },
        "BIBREF3": {
            "title": "Detection of rotavirus from feces by reversed passive haemagglutination method",
            "authors": [
                {
                    "first": "T.",
                    "middle": [],
                    "last": "Sanekata",
                    "suffix": ""
                },
                {
                    "first": "Y.",
                    "middle": [],
                    "last": "Yoshida",
                    "suffix": ""
                },
                {
                    "first": "K.",
                    "middle": [],
                    "last": "Oda",
                    "suffix": ""
                }
            ],
            "year": 1979,
            "venue": "J. Clin. Pathol.",
            "volume": "32",
            "issn": "",
            "pages": null,
            "other_ids": {
                "DOI": []
            }
        },
        "BIBREF4": {
            "title": "Detection of rotavirus from infantile gastroenteritis patient's stools by means of reversed passive haemagglutination",
            "authors": [
                {
                    "first": "T.",
                    "middle": [],
                    "last": "Sanekata",
                    "suffix": ""
                },
                {
                    "first": "Y.",
                    "middle": [],
                    "last": "Yoshida",
                    "suffix": ""
                },
                {
                    "first": "Y.",
                    "middle": [],
                    "last": "Saito",
                    "suffix": ""
                },
                {
                    "first": "T.",
                    "middle": [],
                    "last": "Takei",
                    "suffix": ""
                },
                {
                    "first": "T.",
                    "middle": [],
                    "last": "Takahashi",
                    "suffix": ""
                }
            ],
            "year": 1979,
            "venue": "Igaku no Ayumi",
            "volume": "109",
            "issn": "",
            "pages": "319-321",
            "other_ids": {
                "DOI": []
            }
        },
        "BIBREF5": {
            "title": "Hemagglutination by calf diarrhea coronavirus",
            "authors": [
                {
                    "first": "K.",
                    "middle": [],
                    "last": "Sato",
                    "suffix": ""
                },
                {
                    "first": "Y.",
                    "middle": [],
                    "last": "Inaba",
                    "suffix": ""
                },
                {
                    "first": "H.",
                    "middle": [],
                    "last": "Kurogi",
                    "suffix": ""
                },
                {
                    "first": "E.",
                    "middle": [],
                    "last": "Takahashi",
                    "suffix": ""
                },
                {
                    "first": "K.",
                    "middle": [],
                    "last": "Satoda",
                    "suffix": ""
                },
                {
                    "first": "T.",
                    "middle": [],
                    "last": "Omori",
                    "suffix": ""
                },
                {
                    "first": "M.",
                    "middle": [],
                    "last": "Matumoto",
                    "suffix": ""
                }
            ],
            "year": 1977,
            "venue": "Vet. Microbiol.",
            "volume": "2",
            "issn": "",
            "pages": "83-87",
            "other_ids": {
                "DOI": []
            }
        },
        "BIBREF6": {
            "title": "Isolation of a reovirus-like agent (rotavirus) from neonatal calf diarrhea in Japan",
            "authors": [
                {
                    "first": "K.",
                    "middle": [],
                    "last": "Sato",
                    "suffix": ""
                },
                {
                    "first": "Y.",
                    "middle": [],
                    "last": "Inaba",
                    "suffix": ""
                },
                {
                    "first": "E.",
                    "middle": [],
                    "last": "Takahashi",
                    "suffix": ""
                },
                {
                    "first": "Y.",
                    "middle": [],
                    "last": "Ito",
                    "suffix": ""
                },
                {
                    "first": "H.",
                    "middle": [],
                    "last": "Kurogi",
                    "suffix": ""
                },
                {
                    "first": "H.",
                    "middle": [],
                    "last": "Akashi",
                    "suffix": ""
                },
                {
                    "first": "K.",
                    "middle": [],
                    "last": "Satoda",
                    "suffix": ""
                },
                {
                    "first": "T.",
                    "middle": [],
                    "last": "Omori",
                    "suffix": ""
                },
                {
                    "first": "M.",
                    "middle": [],
                    "last": "Matumoto",
                    "suffix": ""
                }
            ],
            "year": 1978,
            "venue": "Microbiol. Immunol.",
            "volume": "22",
            "issn": "",
            "pages": "499-503",
            "other_ids": {
                "DOI": []
            }
        },
        "BIBREF7": {
            "title": "Characterization of a calf diarrheal coronavirus",
            "authors": [
                {
                    "first": "R.",
                    "middle": [
                        "L."
                    ],
                    "last": "Sharpee",
                    "suffix": ""
                },
                {
                    "first": "C.",
                    "middle": [
                        "A."
                    ],
                    "last": "Mebus",
                    "suffix": ""
                },
                {
                    "first": "E.",
                    "middle": [
                        "P."
                    ],
                    "last": "Bass",
                    "suffix": ""
                }
            ],
            "year": 1976,
            "venue": "Am. J. Vet. Res.",
            "volume": "37",
            "issn": "",
            "pages": "1031-1041",
            "other_ids": {
                "DOI": []
            }
        },
        "BIBREF8": {
            "title": "Neonatal calf diarrhea: purification and electron microscopy of a coronavirus-like agent",
            "authors": [
                {
                    "first": "E.",
                    "middle": [
                        "L."
                    ],
                    "last": "Stair",
                    "suffix": ""
                },
                {
                    "first": "M.",
                    "middle": [
                        "B."
                    ],
                    "last": "Rhodes",
                    "suffix": ""
                },
                {
                    "first": "R.",
                    "middle": [
                        "G."
                    ],
                    "last": "White",
                    "suffix": ""
                },
                {
                    "first": "C.",
                    "middle": [
                        "A."
                    ],
                    "last": "Mebus",
                    "suffix": ""
                }
            ],
            "year": 1972,
            "venue": "Amer. J. Vet. Res.",
            "volume": "33",
            "issn": "",
            "pages": "1147-1156",
            "other_ids": {
                "DOI": []
            }
        },
        "BIBREF9": {
            "title": "Epizootic diarrhea of adult cattle associated with a coronavirus-like agent",
            "authors": [
                {
                    "first": "E.",
                    "middle": [],
                    "last": "Takahashi",
                    "suffix": ""
                },
                {
                    "first": "Y.",
                    "middle": [],
                    "last": "Inaba",
                    "suffix": ""
                },
                {
                    "first": "K.",
                    "middle": [],
                    "last": "Sato",
                    "suffix": ""
                },
                {
                    "first": "Y.",
                    "middle": [],
                    "last": "Ito",
                    "suffix": ""
                },
                {
                    "first": "H.",
                    "middle": [],
                    "last": "Kurogi",
                    "suffix": ""
                },
                {
                    "first": "H.",
                    "middle": [],
                    "last": "Akashi",
                    "suffix": ""
                },
                {
                    "first": "K.",
                    "middle": [],
                    "last": "Satoda",
                    "suffix": ""
                },
                {
                    "first": "T.",
                    "middle": [],
                    "last": "Omori",
                    "suffix": ""
                }
            ],
            "year": 1980,
            "venue": "Vet. Microbiol.",
            "volume": "5",
            "issn": "",
            "pages": "151-154",
            "other_ids": {
                "DOI": []
            }
        },
        "BIBREF10": {
            "title": "Isolation of coronaviruses from neonatal calf diarrhea in Great Britain and Denmark",
            "authors": [
                {
                    "first": "J.",
                    "middle": [
                        "C."
                    ],
                    "last": "Bridger",
                    "suffix": ""
                },
                {
                    "first": "G.",
                    "middle": [
                        "N."
                    ],
                    "last": "Woode",
                    "suffix": ""
                },
                {
                    "first": "A.",
                    "middle": [],
                    "last": "Meyling",
                    "suffix": ""
                }
            ],
            "year": 1978,
            "venue": "Vet. Microbiol.",
            "volume": "3",
            "issn": "",
            "pages": "101-113",
            "other_ids": {
                "DOI": []
            }
        },
        "BIBREF11": {
            "title": "Selective enzyme purification by affinity chromatography",
            "authors": [
                {
                    "first": "P.",
                    "middle": [],
                    "last": "Cuatrecasas",
                    "suffix": ""
                },
                {
                    "first": "M.",
                    "middle": [],
                    "last": "Wilchek",
                    "suffix": ""
                },
                {
                    "first": "C.",
                    "middle": [
                        "B."
                    ],
                    "last": "Anfinsen",
                    "suffix": ""
                }
            ],
            "year": 1968,
            "venue": "Proc. Natl. Acad. Sci. U.S.A.",
            "volume": "61",
            "issn": "",
            "pages": "636-643",
            "other_ids": {
                "DOI": []
            }
        },
        "BIBREF12": {
            "title": "Rotavirus and coronavirus associated diarrhea in domestic animals",
            "authors": [
                {
                    "first": "P.",
                    "middle": [
                        "J.",
                        "K."
                    ],
                    "last": "Durham",
                    "suffix": ""
                },
                {
                    "first": "B.",
                    "middle": [
                        "J."
                    ],
                    "last": "Stevenson",
                    "suffix": ""
                },
                {
                    "first": "B.",
                    "middle": [
                        "C."
                    ],
                    "last": "Farquharson",
                    "suffix": ""
                }
            ],
            "year": 1979,
            "venue": "N. Z. Vet. J.",
            "volume": "27",
            "issn": "",
            "pages": "30-32",
            "other_ids": {
                "DOI": []
            }
        },
        "BIBREF13": {
            "title": "A coronavirus-like agent present in feces of cows with diarrhea",
            "authors": [
                {
                    "first": "G.",
                    "middle": [
                        "W."
                    ],
                    "last": "Horner",
                    "suffix": ""
                },
                {
                    "first": "R.",
                    "middle": [],
                    "last": "Hunter",
                    "suffix": ""
                },
                {
                    "first": "C.",
                    "middle": [
                        "A."
                    ],
                    "last": "Kirkbride",
                    "suffix": ""
                }
            ],
            "year": 1976,
            "venue": "N. Z. Vet. J.",
            "volume": "23",
            "issn": "",
            "pages": null,
            "other_ids": {
                "DOI": []
            }
        },
        "BIBREF14": {
            "title": "BFl virus: a new cytopathogenic virus isolated from cattle. I. Isolation and properties",
            "authors": [
                {
                    "first": "Y.",
                    "middle": [],
                    "last": "Inaba",
                    "suffix": ""
                },
                {
                    "first": "T.",
                    "middle": [],
                    "last": "Omori",
                    "suffix": ""
                },
                {
                    "first": "M.",
                    "middle": [],
                    "last": "Kono",
                    "suffix": ""
                },
                {
                    "first": "S.",
                    "middle": [],
                    "last": "Ishii",
                    "suffix": ""
                },
                {
                    "first": "M.",
                    "middle": [],
                    "last": "Matumoto",
                    "suffix": ""
                }
            ],
            "year": 1962,
            "venue": "Jpn. J. Exp. Med.",
            "volume": "32",
            "issn": "",
            "pages": "77-92",
            "other_ids": {
                "DOI": []
            }
        },
        "BIBREF15": {
            "title": "Replication of bovine coronavirus in cell line BEK-1 culture",
            "authors": [
                {
                    "first": "Y.",
                    "middle": [],
                    "last": "Inaba",
                    "suffix": ""
                },
                {
                    "first": "K.",
                    "middle": [],
                    "last": "Sato",
                    "suffix": ""
                },
                {
                    "first": "H.",
                    "middle": [],
                    "last": "Kurogi",
                    "suffix": ""
                },
                {
                    "first": "E.",
                    "middle": [],
                    "last": "Takahashi",
                    "suffix": ""
                },
                {
                    "first": "Y.",
                    "middle": [],
                    "last": "Ito",
                    "suffix": ""
                },
                {
                    "first": "T.",
                    "middle": [],
                    "last": "Omori",
                    "suffix": ""
                },
                {
                    "first": "Y.",
                    "middle": [],
                    "last": "Goto",
                    "suffix": ""
                },
                {
                    "first": "M.",
                    "middle": [],
                    "last": "Matumoto",
                    "suffix": ""
                }
            ],
            "year": 1976,
            "venue": "Arch. Virol.",
            "volume": "50",
            "issn": "",
            "pages": "339-342",
            "other_ids": {
                "DOI": []
            }
        },
        "BIBREF16": {
            "title": "Protein measurement with the Folin phenol reagent",
            "authors": [
                {
                    "first": "O.",
                    "middle": [
                        "H."
                    ],
                    "last": "Lowry",
                    "suffix": ""
                },
                {
                    "first": "N.",
                    "middle": [
                        "J."
                    ],
                    "last": "Rosebrough",
                    "suffix": ""
                },
                {
                    "first": "A.",
                    "middle": [
                        "L."
                    ],
                    "last": "Farr",
                    "suffix": ""
                },
                {
                    "first": "R.",
                    "middle": [
                        "J."
                    ],
                    "last": "Randall",
                    "suffix": ""
                }
            ],
            "year": 1951,
            "venue": "J. Biol. Chem.",
            "volume": "193",
            "issn": "",
            "pages": "265-275",
            "other_ids": {
                "DOI": []
            }
        },
        "BIBREF17": {
            "title": "Neonatal calf diarrhea: results of a field trial using a reovirus-like virus vaccine",
            "authors": [
                {
                    "first": "C.",
                    "middle": [
                        "A."
                    ],
                    "last": "Mebus",
                    "suffix": ""
                },
                {
                    "first": "R.",
                    "middle": [
                        "G."
                    ],
                    "last": "White",
                    "suffix": ""
                },
                {
                    "first": "E.",
                    "middle": [
                        "L."
                    ],
                    "last": "Stair",
                    "suffix": ""
                },
                {
                    "first": "M.",
                    "middle": [
                        "B."
                    ],
                    "last": "Rhodes",
                    "suffix": ""
                },
                {
                    "first": "M.",
                    "middle": [
                        "J."
                    ],
                    "last": "Twiehaus",
                    "suffix": ""
                }
            ],
            "year": 1972,
            "venue": "Vet. Med. Small Anim. Clin.",
            "volume": "67",
            "issn": "",
            "pages": "173-178",
            "other_ids": {
                "DOI": []
            }
        }
    }
}