{
    "paper_id": "ab261bc634cec78e9e3b853f306198eccc6388f3",
    "metadata": {
        "title": "Epidemiologic Analysis of Respiratory Viral Infections Mainly in Hospitalized Children and Adults in a Midwest University Medical Center After the Implementation of a 14-Virus Multiplex Nucleic Acid Amplification Test",
        "authors": [
            {
                "first": "Sophie",
                "middle": [],
                "last": "Arbefeville",
                "suffix": "",
                "affiliation": {
                    "laboratory": "",
                    "institution": "University of Minnesota Medical School",
                    "location": {
                        "region": "Minneapolis"
                    }
                },
                "email": ""
            },
            {
                "first": "Patricia",
                "middle": [],
                "last": "Ferrieri",
                "suffix": "",
                "affiliation": {
                    "laboratory": "",
                    "institution": "University of Minnesota Medical School",
                    "location": {
                        "region": "Minneapolis"
                    }
                },
                "email": ""
            }
        ]
    },
    "abstract": [
        {
            "text": "Objectives: To investigate the etiology of viral respiratory tract infections mainly in hospitalized children and adults over a 12-month consecutive period after implementation of a 14-virus multiplex nucleic acid amplification test. , a total of 2,237 respiratory samples were analyzed with the US Food and Drug Administration-cleared eSensor Respiratory Viral Panel (GenMark Diagnostics, Carlsbad, CA).",
            "cite_spans": [],
            "ref_spans": [],
            "section": "Abstract"
        }
    ],
    "body_text": [
        {
            "text": "Results: Of the 2,237 specimens tested, 788 specimens were positive for at least one virus, giving a positivity rate of 35.2%, and because of viral codetection, a total of 862 viral targets were identified. The age groups with the highest positivity rates were the 0-to 1-year (73.5%) and 2-to 6- year (78.4%) age groups. The overall viral codetection rate was 9.1%. Human rhinovirus (HRV) was the most prevalent respiratory virus found in children and adults. The peak of HRV seen in September 2014 represented a combination of HRV and enterovirus D68, 2014 epidemic respiratory infections.",
            "cite_spans": [
                {
                    "start": 294,
                    "end": 296,
                    "text": "6-",
                    "ref_id": null
                }
            ],
            "ref_spans": [],
            "section": ""
        },
        {
            "text": "Conclusion: The ability to detect a wider range of respiratory viruses gave us a better understanding of the etiology of respiratory infections in our population, particularly for HRV and enhanced our ability to detect viral coinfection.",
            "cite_spans": [],
            "ref_spans": [],
            "section": ""
        },
        {
            "text": "Viral infections of the respiratory tract are the most frequent illnesses seen in humans, and annually, millions of people are afflicted worldwide. [1] [2] [3] They affect all age groups but particularly the very young, the elderly, and those with chronic medical conditions. [2] [3] [4] [5] [6] In these specific risk groups, respiratory viral infections may predispose them to secondary bacterial infections, including pneumonia, otitis media, and sinusitis, which can lead to severe outcomes, such as hospitalization and death. 7, 8 Emergence of new respiratory viral pathogens, such as severe acute respiratory syndrome coronavirus, avian H5N1 influenza, pandemic (h1N1) 2009 influenza, and the discovery of novel viruses known to cause respiratory tract infections in humans, such as human metapneumovirus (hMPV), have increased our understanding of life-threatening illness associated with respiratory infections. 2, 9 The current pharmacologic interventions for respiratory viral infections are largely limited, and no vaccines or therapeutics of proven value are currently available for respiratory viruses other than for influenza. To develop effective vaccines and antiviral therapies, a better understanding of disease etiology and epidemiology is necessary. This has driven some clinical diagnostic laboratories to move from traditional viral cultures that were time-consuming and had a limited repertoire to new molecular diagnostic technologies that are relatively rapid and permit the detection of a wider spectrum of viral respiratory pathogens.",
            "cite_spans": [
                {
                    "start": 148,
                    "end": 151,
                    "text": "[1]",
                    "ref_id": "BIBREF0"
                },
                {
                    "start": 152,
                    "end": 155,
                    "text": "[2]",
                    "ref_id": "BIBREF1"
                },
                {
                    "start": 156,
                    "end": 159,
                    "text": "[3]",
                    "ref_id": "BIBREF2"
                },
                {
                    "start": 276,
                    "end": 279,
                    "text": "[2]",
                    "ref_id": "BIBREF1"
                },
                {
                    "start": 280,
                    "end": 283,
                    "text": "[3]",
                    "ref_id": "BIBREF2"
                },
                {
                    "start": 284,
                    "end": 287,
                    "text": "[4]",
                    "ref_id": "BIBREF3"
                },
                {
                    "start": 288,
                    "end": 291,
                    "text": "[5]",
                    "ref_id": "BIBREF4"
                },
                {
                    "start": 292,
                    "end": 295,
                    "text": "[6]",
                    "ref_id": "BIBREF5"
                },
                {
                    "start": 531,
                    "end": 533,
                    "text": "7,",
                    "ref_id": "BIBREF6"
                },
                {
                    "start": 920,
                    "end": 922,
                    "text": "2,",
                    "ref_id": "BIBREF1"
                }
            ],
            "ref_spans": [],
            "section": ""
        },
        {
            "text": "The US Food and Drug Administration (FDA) has cleared several nucleic acid amplification respiratory viral panels able to detect multiple respiratory viruses in a single test. In September 2012, GenMark Diagnostics (Carlsbad, CA) received clearance from the FDA for its eSensor Respiratory Viral Panel that is able to detect up to 14 different viral targets in a single test on nasopharyngeal specimens.",
            "cite_spans": [],
            "ref_spans": [],
            "section": ""
        },
        {
            "text": "The objective of this investigational study was to study the etiology and epidemiology of respiratory virus infections and, in particular, to determine the virus-specific positivity rates, age and sex distribution, viral codetection, and seasonality, mainly in hospitalized children and adults in a Midwest university medical center after implementation of the eSensor Respiratory Viral Panel over a 12-month consecutive period.",
            "cite_spans": [],
            "ref_spans": [],
            "section": ""
        },
        {
            "text": "Samples From January 7, 2014, through January 1, 2015, prospectively, for each specimen tested (nasopharyngeal swabs, nasal washes, and bronchoalveolar lavages) on the eSensor Respiratory Viral Panel, the age, the sex of the patient, the specimen type, the date of collection, and the test result were recorded. Most of the respiratory specimens tested were from hospitalized patients from the University of Minnesota Medical Center and the University of Minnesota Children's Hospital. Ordering guidelines stating that the assay was to be ordered only on hospitalized patients in respiratory distress and for the evaluation of severely immunocompromised or critically ill patients with respiratory symptoms were put in place to avoid misuse of the assay. The assay was discouraged in patients seen in the emergency department (ED) or in clinics, and respiratory viral cultures and/or rapid antigen tests for respiratory viruses were recommended as alternative testing. Despite this, some specimens were submitted from the ED and outpatient clinics per physician orders.",
            "cite_spans": [],
            "ref_spans": [],
            "section": "Materials and Methods"
        },
        {
            "text": "The eSensor Respiratory Viral Panel is FDA approved for nasopharyngeal swabs only, and thus the laboratory performed validations of the bronchoalveolar lavages and nasal wash specimens to assess the performance characteristics of the assay in detecting the intended viral targets in these specimen types. The validation showed that the performance characteristics of the assay for these specimen types were acceptable and in agreement with published data. 10 For any other respiratory specimen types than nasopharyngeal swabs, bronchoalveolar lavages, and nasal wash, a disclaimer, stating that this particular specimen type had not been validated and needed to be interpreted accordingly, was attached with the result.",
            "cite_spans": [],
            "ref_spans": [],
            "section": "Materials and Methods"
        },
        {
            "text": "To determine the period of time necessary to differentiate between a new infection and prolonged virus presence/persistence of a previous infection, a review of the literature was performed and indicated that, in most cases, viral nucleic acid was not detected beyond 30 days after initial viral infection. 11, 12 It was decided for this study that patients with repeat specimens sent for testing in a 4-week period were excluded for analysis if they were repeatedly negative or repeatedly positive with the same virus.",
            "cite_spans": [
                {
                    "start": 307,
                    "end": 310,
                    "text": "11,",
                    "ref_id": "BIBREF10"
                }
            ],
            "ref_spans": [],
            "section": "Materials and Methods"
        },
        {
            "text": "The eSensor Respiratory Viral Panel is a qualitative nucleic acid multiplex in vitro diagnostic test that uses the eSensor XT-8 system for the simultaneous detection and identification of the following virus types and subtypes: influenza A (all subtypes), influenza A H1 seasonal subtype, influenza A H3 seasonal subtype, influenza A 2009 H1N1 subtype, influenza B, respiratory syncytial virus subtype A (RSV A), respiratory syncytial virus subtype B (RSV B), parainfluenza virus 1 (PIV-1), parainfluenza virus 2 (PIV-2), parainfluenza virus 3 (PIV-3), hMPV, human rhinovirus (HRV), adenovirus species B/E (ADV B/E), and adenovirus species C (ADV C).",
            "cite_spans": [],
            "ref_spans": [],
            "section": "Detection of Respiratory Viruses"
        },
        {
            "text": "The NucliSENS EasyMAG automated extractor (bioMerieux, Durham, NC) was used for the isolation of viral nucleic acid to be compliant with the FDA-approved extraction method for the eSensor Respiratory Viral Panel.",
            "cite_spans": [],
            "ref_spans": [],
            "section": "Detection of Respiratory Viruses"
        },
        {
            "text": "Categorical variables were compared using v 2 . All tests were two-tailed, and P values .05 or less were considered significant.",
            "cite_spans": [],
            "ref_spans": [],
            "section": "Statistical Analysis"
        },
        {
            "text": "An institutional review board application (study 1510E78822), submitted to the University of Minnesota Human Research Protection Program, was reviewed and approved.",
            "cite_spans": [],
            "ref_spans": [],
            "section": "Ethical Approval"
        },
        {
            "text": "From January 2014 through January 2015, a total of 2,237 respiratory samples consisting of 1,634 (73.0%) nasopharyngeal swabs, 579 (25.9%) bronchoalveolar lavages, and 24 (1.1%) nasal washes were analyzed with the eSensor Respiratory Viral Panel. Of the 2,237 specimens tested, 752 (33.6%) were from pediatric patients (aged 1 day to 19 years), and 1,485 (66.4%) were from adult patients (aged 20-94 years).",
            "cite_spans": [],
            "ref_spans": [],
            "section": "Results"
        },
        {
            "text": "There were 788 positive specimens, giving a positivity rate of 35.2%, and because some specimens were positive for more than one virus, a total of 862 viruses were detected, and the distribution among the total viruses was as follows: 449 (52.0%) HRV; 102 (11.8%) RSV A and RSV B; 89 (10.3%) PIV-1, PIV-2, and PIV-3; 85 (9.9%) influenza A (all subtypes); 73 (8.5%) hMPV; 50 (5.8%) ADV B/E and ADV C; and 14 (1.6%) influenza B Table 1 . The age groups with the highest positivity rates (total positive viruses per age group/total tested specimens per age group) were 0 to 1 years (73.5%) and 2 to 6 years (78.4%), followed by 7 to 12 years (56.6%) Table 2 .",
            "cite_spans": [],
            "ref_spans": [
                {
                    "start": 426,
                    "end": 433,
                    "text": "Table 1",
                    "ref_id": "TABREF0"
                },
                {
                    "start": 647,
                    "end": 654,
                    "text": "Table 2",
                    "ref_id": "TABREF1"
                }
            ],
            "section": "Results"
        },
        {
            "text": "The number of pediatric specimens tested (752 specimens, 33.6%) was smaller than those from adults (1,485 specimens, 66.4%), but they had the highest number of detected viruses, 495 detected viruses vs 367 detected, respectively.",
            "cite_spans": [],
            "ref_spans": [],
            "section": "Results"
        },
        {
            "text": "HRV was the most common virus detected in all age groups except for those 80 years or older. The highest HRV prevalence was seen in the 0-to 1-year age group (123 positive for HRV). RSV A was the most common virus isolated after HRV in the 0-to 1-year age group (36 positive for RSV A) and 2-to 6-years (14 positive for RSV A) age group. Influenza A was the main cause of respiratory infection after HRV, for the remaining age groups, and was equivalent to HRV in the age group 80 years or older, although the numbers were small ( Table 2 ). The influenza A subtypes detected were H3 and H1N1 2009. The influenza A seasonal subtype H1 was not detected during the study period.",
            "cite_spans": [],
            "ref_spans": [
                {
                    "start": 531,
                    "end": 538,
                    "text": "Table 2",
                    "ref_id": "TABREF1"
                }
            ],
            "section": "Results"
        },
        {
            "text": "ADV C was more prevalent than ADV B/E (42 detected vs 8) ( Table 1 ). The highest number of positive ADV C (23) was seen in the 0-to 1-year age group (Table 2) .",
            "cite_spans": [],
            "ref_spans": [
                {
                    "start": 59,
                    "end": 66,
                    "text": "Table 1",
                    "ref_id": "TABREF0"
                },
                {
                    "start": 150,
                    "end": 159,
                    "text": "(Table 2)",
                    "ref_id": "TABREF1"
                }
            ],
            "section": "Results"
        },
        {
            "text": "PIV-3 was the most prevalent of the PIV subtypes with 62 positive specimens vs 20 positives for PIV-2 and 7 positives for PIV-1 (Table 1) .",
            "cite_spans": [],
            "ref_spans": [
                {
                    "start": 128,
                    "end": 137,
                    "text": "(Table 1)",
                    "ref_id": "TABREF0"
                }
            ],
            "section": "Results"
        },
        {
            "text": "Of the 2,237 specimens tested, 1,042 (46.6%) were from female patients and 1,195 (53.4%) were from male patients. The total positivity rate for the female patients was 37.1% (total female positive viral targets [387]/total female specimens tested) and 39.7% for the male patients (total male positive viral targets [475]/total male specimens tested) (P \u00bc .39). The numbers of positive viral targets in males were higher than in females for all age groups, except for the 40-to 59-year and the 80-year or older age groups, where females had a higher number of positive viral targets than the males. The age group with the greatest difference between male and female positivity rates was the 13-to 19year age group with a positivity rate of 34.0% and 20.3%, respectively (P \u00bc .11).",
            "cite_spans": [],
            "ref_spans": [],
            "section": "Results"
        },
        {
            "text": "Seventy-two specimens had more than one virus detected, thus giving codetection rates of 9.1% for the total 788 positive specimens or 3.2% for the total 2,237 specimens tested Table 3 . The infant (0-1 year) and young children (2-6 years) age groups had the highest codetection rates, 9.9% (34/344) and 7.2% (14/195), respectively ( Table 3 ). The most frequent codetection combinations were HRV with ADV C and HRV with PIV-3.",
            "cite_spans": [],
            "ref_spans": [
                {
                    "start": 176,
                    "end": 183,
                    "text": "Table 3",
                    "ref_id": "TABREF3"
                },
                {
                    "start": 333,
                    "end": 340,
                    "text": "Table 3",
                    "ref_id": "TABREF3"
                }
            ],
            "section": "Results"
        },
        {
            "text": "RSV and influenza were more prevalent during the colder months of the year. PIV-2 showed a peak in November, and PIV-3 was present most of the year with peaks in the spring months. Adenovirus C was seen all year around with peaks in the late fall into the winter. hMPV was seen in all age groups, all year around, with the highest number of positives in December, March, April, and May ",
            "cite_spans": [],
            "ref_spans": [],
            "section": "Results"
        },
        {
            "text": "The introduction of nucleic acid testing in our clinical virology laboratories has enhanced our ability to detect viruses that we were not able to recover with traditional viral culture methods and thus permitted us to identify the \"hidden\" burden of viral respiratory infections in our patient population.",
            "cite_spans": [],
            "ref_spans": [],
            "section": "Discussion"
        },
        {
            "text": "HRV was the most prevalent respiratory virus in our population, with 449 specimens positive for HRV, which represented 20% of all specimen tested. Of these, 290 were from hospitalized patients that included 100 children aged 1 year and younger. HRV, previously considered a respiratory virus with minimal pathogenicity, has emerged as a cause of severe respiratory illness in healthy individuals, those with underlying asthma, and in vulnerable populations (very young, elderly, and immunocompromised). 13, 14 HRV is responsible for most common colds and more likely to be symptomatic in children than in adults, as shown by the Better Identification of Germs Longitudinal Viral Epidemiology study. 13 The HRV family includes three species: HRV-A, HRV-B, and HRV-C, and within each species, there are multiple serotypes, types, and strains. The most recent described species, HRV-C, has been associated with serious lower respiratory disease in infants and young children, elderly persons, and immunocompromised patients. 14 In our study, the large peak of positive HRV detection seen in September 2014 raised questions, particularly because it coincided with the enterovirus D68 outbreak. 15 Upon further investigation, it was demonstrated that the GenMark Diagnostics HRV primers and probe used in the eSensor Respiratory Viral Panel were cross-reacting with the enterovirus D68. 16 Thus, the high positive HRV peak seen in September represented a combination of HRV and epidemic enterovirus D68. 16 We also demonstrated that the pediatric population had a higher burden of viral respiratory infections compared with adults; 33.6% (752) of the tested specimens were from pediatric patients, but they had the highest number of detected viruses, with 495 detected viruses compared with 367 detected viruses in the 1,485 tested adult specimens (P < .05).",
            "cite_spans": [
                {
                    "start": 503,
                    "end": 506,
                    "text": "13,",
                    "ref_id": "BIBREF12"
                }
            ],
            "ref_spans": [],
            "section": "Discussion"
        },
        {
            "text": "RSV was the most common virus detected in the young children (0-to 1-year and 2-to 6-year age groups) after HRV. RSV can cause severe infections in infants and young children and is the most important etiologic agent of acute lower respiratory tract infection in infants and young children in the United States and worldwide. 17 In our study, hMPV was more prevalent in infants and young children and in the older population (60-to 79-year age group), which is consistent with previous studies. 18 hMPV has a high prevalence in bronchiolitis and pneumonia in hospitalized infants and young children. Advanced age and underlying cardiopulmonary diseases are two risk factors for severe hMPV infection in the older population. 19 Influenza A H3  5  6  11  5  16  10  12  6  Influenza A H1N1 2009  0  1  0  2  5  3  3  0  Influenza B  1  1  0  1  3  3  5  0  R S V A  3 6  1 4  0  0  1  6  6  1  R S V B  1 1  8  2  1  2  8  5  1  PIV-1  2  0  2  0  2  0  1  0  PIV-2  4  1  2  0  5  5  3  0  PIV-3  26  7  1  0  6  13  9  0  hMPV  20  13  6  3  5  9  1 Of all the parainfluenza virus subtypes, PIV-3 is the subtype that is the most commonly associated with bronchiolitis, bronchitis, and pneumonia and thus often requires hospital admission for clinical management. In our study, most of the respiratory specimens were from hospitalized patients, and PIV-3 was the most prevalent of the PIV subtypes. PIV-1 and PIV-2 cause cold-like symptoms in infected people, and PIV-4 may cause mild to severe respiratory tract illnesses in infected patients. We could not assess the prevalence of PIV-4 in our study as this target was not included in the eSensor Respiratory Viral Panel.",
            "cite_spans": [],
            "ref_spans": [
                {
                    "start": 728,
                    "end": 1050,
                    "text": "Influenza A H3  5  6  11  5  16  10  12  6  Influenza A H1N1 2009  0  1  0  2  5  3  3  0  Influenza B  1  1  0  1  3  3  5  0  R S V A  3 6  1 4  0  0  1  6  6  1  R S V B  1 1  8  2  1  2  8  5  1  PIV-1  2  0  2  0  2  0  1  0  PIV-2  4  1  2  0  5  5  3  0  PIV-3  26  7  1  0  6  13  9  0  hMPV  20  13  6  3  5  9  1",
                    "ref_id": "TABREF0"
                }
            ],
            "section": "Discussion"
        },
        {
            "text": "ADV, an important pathogen in infants, was also detected frequently and is responsible for approximately 7% to 8% of reported childhood viral respiratory infections globally and causes a broad spectrum of clinical disease, including respiratory tract infection. 20 In an immunocompromised host, ADV can cause severe localized disease or disseminated disease with multiorgan failure. 21 Viral codetection, which is defined as the detection of more than one viral pathogen in the same specimen, is a phenomenon that was underestimated when using viral cultures. Since the introduction of new technologies that have moved diagnosis abilities forward, the capability to detect more than one virus per specimen has greatly increased our understanding of the true incidence of viral coinfection. Viral codetection was seen in 72 (9.1%) of the 788 positive specimens in our study. HRV was the virus most commonly associated with other viruses. The clinical significance of such viral codetection and thus possible coinfection is unclear, and review of the literature is conflicting. Some studies link viral coinfection with more severe clinical outcomes, and some show no overall difference between single respiratory virus infection and viral coinfections. 3, [22] [23] [24] [25] [26] [27] Also, as shown in our study (Table 3) , viral codetection appeared to be more commonly seen in pediatric patients than in adults. 24 The reasons for this difference are not known. Even though the impact of viral coinfection on severity of disease is unclear, the need for rapid and accurate detection of a wide spectrum of viral respiratory pathogens is desirable to understand their correlation with clinical illness and for epidemiologic and hospital infection control reasons.",
            "cite_spans": [
                {
                    "start": 1251,
                    "end": 1253,
                    "text": "3,",
                    "ref_id": "BIBREF2"
                },
                {
                    "start": 1254,
                    "end": 1258,
                    "text": "[22]",
                    "ref_id": "BIBREF21"
                },
                {
                    "start": 1259,
                    "end": 1263,
                    "text": "[23]",
                    "ref_id": "BIBREF22"
                },
                {
                    "start": 1264,
                    "end": 1268,
                    "text": "[24]",
                    "ref_id": "BIBREF23"
                },
                {
                    "start": 1269,
                    "end": 1273,
                    "text": "[25]",
                    "ref_id": "BIBREF24"
                },
                {
                    "start": 1274,
                    "end": 1278,
                    "text": "[26]",
                    "ref_id": null
                },
                {
                    "start": 1279,
                    "end": 1283,
                    "text": "[27]",
                    "ref_id": "BIBREF25"
                }
            ],
            "ref_spans": [
                {
                    "start": 1312,
                    "end": 1321,
                    "text": "(Table 3)",
                    "ref_id": "TABREF3"
                }
            ],
            "section": "Discussion"
        },
        {
            "text": "The field of clinical virology has changed dramatically since introduction of new diagnostic techniques in the clinical laboratory. Newer assays are still being developed to expand the number of detected targets to include viral and bacterial respiratory pathogens such as PIV-4, coronavirus, and Bordetella species with decreased turnaround time. This will further increase our understanding of the circulating respiratory pathogens during different seasons of the year and in different health care settings (hospital based vs community based) and potentially help in the development of new vaccines.",
            "cite_spans": [],
            "ref_spans": [],
            "section": "Discussion"
        },
        {
            "text": "Continued advances in diagnostic technology have enabled diagnostic microbiology laboratories to expand their capability of detecting respiratory viruses and thus help understand the epidemiology of respiratory viruses. It is evident that many unanswered questions still need to be addressed: for example, what is the scientific reason behind the seasonality of the different respiratory viruses, and which antiviral treatments should be used, if any, to treat these viral respiratory tract infections? Despite progress made in the 20th and 21st centuries, there is still no common oral antiviral therapy available for the treatment of these respiratory viruses except for influenza. Further studies need to be conducted to answer these questions.",
            "cite_spans": [],
            "ref_spans": [],
            "section": "Discussion"
        },
        {
            "text": "The study was limited by the fact that no clinical data were associated with test results; thus, we could not assess symptoms associated with viral infection or coinfection disease progression, treatment plans, and response to treatment.",
            "cite_spans": [],
            "ref_spans": [],
            "section": "Discussion"
        },
        {
            "text": "Note: Nineteen specimens composed of tracheal aspirates, sputum, and throat swabs were excluded from this analysis. The performance characteristics of these specimens types had not been validated on the eSensor Respiratory Viral Panel, and thus the accuracy of the results could not be verified.",
            "cite_spans": [],
            "ref_spans": [],
            "section": "Discussion"
        }
    ],
    "bib_entries": {
        "BIBREF0": {
            "ref_id": "b0",
            "title": "Epidemiology of viral respiratory infections",
            "authors": [
                {
                    "first": "A",
                    "middle": [
                        "S"
                    ],
                    "last": "Monto",
                    "suffix": ""
                }
            ],
            "year": 2002,
            "venue": "Am J Med",
            "volume": "112",
            "issn": "",
            "pages": "4--12",
            "other_ids": {}
        },
        "BIBREF1": {
            "ref_id": "b1",
            "title": "Respiratory viral infections in infants: causes, clinical symptoms, virology, and immunology",
            "authors": [
                {
                    "first": "J",
                    "middle": [
                        "S"
                    ],
                    "last": "Tregoning",
                    "suffix": ""
                },
                {
                    "first": "J",
                    "middle": [],
                    "last": "Schwarze",
                    "suffix": ""
                }
            ],
            "year": 2010,
            "venue": "Clin Microbiol Rev",
            "volume": "23",
            "issn": "",
            "pages": "74--98",
            "other_ids": {}
        },
        "BIBREF2": {
            "ref_id": "b2",
            "title": "Co-infections with influenza and other respiratory viruses",
            "authors": [
                {
                    "first": "I",
                    "middle": [],
                    "last": "Stefanska",
                    "suffix": ""
                },
                {
                    "first": "M",
                    "middle": [],
                    "last": "Romanowska",
                    "suffix": ""
                },
                {
                    "first": "S",
                    "middle": [],
                    "last": "Donevski",
                    "suffix": ""
                }
            ],
            "year": 2013,
            "venue": "Adv Exp Med Biol",
            "volume": "756",
            "issn": "",
            "pages": "291--301",
            "other_ids": {}
        },
        "BIBREF3": {
            "ref_id": "b3",
            "title": "A summer outbreak of human metapneumovirus infection in a long-term-care facility",
            "authors": [
                {
                    "first": "J",
                    "middle": [
                        "K"
                    ],
                    "last": "Louie",
                    "suffix": ""
                },
                {
                    "first": "D",
                    "middle": [
                        "P"
                    ],
                    "last": "Schnurr",
                    "suffix": ""
                },
                {
                    "first": "C",
                    "middle": [
                        "Y"
                    ],
                    "last": "Pan",
                    "suffix": ""
                }
            ],
            "year": 2007,
            "venue": "J Infect Dis",
            "volume": "196",
            "issn": "",
            "pages": "705--708",
            "other_ids": {}
        },
        "BIBREF4": {
            "ref_id": "b4",
            "title": "Community respiratory virus infections in immunocompromised patients with cancer",
            "authors": [
                {
                    "first": "E",
                    "middle": [],
                    "last": "Whimbey",
                    "suffix": ""
                },
                {
                    "first": "J",
                    "middle": [
                        "A"
                    ],
                    "last": "Englund",
                    "suffix": ""
                },
                {
                    "first": "R",
                    "middle": [
                        "B"
                    ],
                    "last": "Couch",
                    "suffix": ""
                }
            ],
            "year": 1997,
            "venue": "Am J Med",
            "volume": "102",
            "issn": "",
            "pages": "10--18",
            "other_ids": {}
        },
        "BIBREF5": {
            "ref_id": "b5",
            "title": "Common community respiratory viruses in patients with cancer: more than just \"common colds",
            "authors": [
                {
                    "first": "K",
                    "middle": [
                        "L"
                    ],
                    "last": "Hicks",
                    "suffix": ""
                },
                {
                    "first": "R",
                    "middle": [
                        "F"
                    ],
                    "last": "Chemaly",
                    "suffix": ""
                },
                {
                    "first": "D",
                    "middle": [
                        "P"
                    ],
                    "last": "Kontoyiannis",
                    "suffix": ""
                }
            ],
            "year": 2003,
            "venue": "Cancer",
            "volume": "97",
            "issn": "",
            "pages": "2576--2587",
            "other_ids": {}
        },
        "BIBREF6": {
            "ref_id": "b6",
            "title": "Respiratory viruses predisposing to bacterial infections: role of neuraminidase",
            "authors": [
                {
                    "first": "V",
                    "middle": [
                        "T"
                    ],
                    "last": "Peltola",
                    "suffix": ""
                },
                {
                    "first": "J",
                    "middle": [
                        "A"
                    ],
                    "last": "Mccullers",
                    "suffix": ""
                }
            ],
            "year": 2004,
            "venue": "Pediatr Infect Dis J",
            "volume": "23",
            "issn": "",
            "pages": "87--97",
            "other_ids": {}
        },
        "BIBREF7": {
            "ref_id": "b7",
            "title": "Viral upper respiratory tract infection and otitis media complication in young children",
            "authors": [
                {
                    "first": "T",
                    "middle": [],
                    "last": "Chonmaitree",
                    "suffix": ""
                },
                {
                    "first": "K",
                    "middle": [],
                    "last": "Revai",
                    "suffix": ""
                },
                {
                    "first": "J",
                    "middle": [
                        "J"
                    ],
                    "last": "Grady",
                    "suffix": ""
                }
            ],
            "year": 2008,
            "venue": "Clin Infect Dis",
            "volume": "46",
            "issn": "",
            "pages": "815--823",
            "other_ids": {}
        },
        "BIBREF8": {
            "ref_id": "b8",
            "title": "New respiratory viruses of humans",
            "authors": [
                {
                    "first": "Adme",
                    "middle": [],
                    "last": "Osterhaus",
                    "suffix": ""
                }
            ],
            "year": 2008,
            "venue": "Pediatr Infect Dis J",
            "volume": "27",
            "issn": "",
            "pages": "71--74",
            "other_ids": {}
        },
        "BIBREF9": {
            "ref_id": "b9",
            "title": "Evaluation of the BioFire FilmArray respiratory panel and the GenMark eSensor respiratory viral panel on lower respiratory tract specimens",
            "authors": [
                {
                    "first": "P",
                    "middle": [],
                    "last": "Ruggiero",
                    "suffix": ""
                },
                {
                    "first": "T",
                    "middle": [],
                    "last": "Mcmillen",
                    "suffix": ""
                },
                {
                    "first": "Y",
                    "middle": [
                        "W"
                    ],
                    "last": "Tang",
                    "suffix": ""
                }
            ],
            "year": 2014,
            "venue": "J Clin Microbiol",
            "volume": "52",
            "issn": "",
            "pages": "288--290",
            "other_ids": {}
        },
        "BIBREF10": {
            "ref_id": "b10",
            "title": "Duration of rhinovirus shedding in the upper respiratory tract in the first year of life",
            "authors": [
                {
                    "first": "M",
                    "middle": [
                        "J"
                    ],
                    "last": "Loeffelholz",
                    "suffix": ""
                },
                {
                    "first": "R",
                    "middle": [],
                    "last": "Trujillo",
                    "suffix": ""
                },
                {
                    "first": "R",
                    "middle": [
                        "B"
                    ],
                    "last": "Pyles",
                    "suffix": ""
                }
            ],
            "year": 2014,
            "venue": "Pediatrics",
            "volume": "134",
            "issn": "",
            "pages": "1144--1150",
            "other_ids": {}
        },
        "BIBREF11": {
            "ref_id": "b11",
            "title": "Duration of RT-PCR positivity in severe acute respiratory syndrome",
            "authors": [
                {
                    "first": "C",
                    "middle": [
                        "M"
                    ],
                    "last": "Chu",
                    "suffix": ""
                },
                {
                    "first": "W",
                    "middle": [
                        "S"
                    ],
                    "last": "Leung",
                    "suffix": ""
                },
                {
                    "first": "Vcc",
                    "middle": [],
                    "last": "Cheng",
                    "suffix": ""
                }
            ],
            "year": 2005,
            "venue": "Eur Respir J",
            "volume": "25",
            "issn": "",
            "pages": "12--14",
            "other_ids": {}
        },
        "BIBREF12": {
            "ref_id": "b12",
            "title": "Community surveillance of respiratory viruses among families in the Utah Better Identification of Germs-Longitudinal Viral Epidemiology (BIG-LoVE) Study",
            "authors": [
                {
                    "first": "C",
                    "middle": [
                        "L"
                    ],
                    "last": "Byington",
                    "suffix": ""
                },
                {
                    "first": "K",
                    "middle": [],
                    "last": "Ampofo",
                    "suffix": ""
                },
                {
                    "first": "C",
                    "middle": [],
                    "last": "Stockmann",
                    "suffix": ""
                }
            ],
            "year": 2015,
            "venue": "Clin Infect Dis",
            "volume": "61",
            "issn": "",
            "pages": "1217--1224",
            "other_ids": {}
        },
        "BIBREF13": {
            "ref_id": "b13",
            "title": "Human rhinoviruses",
            "authors": [
                {
                    "first": "S",
                    "middle": [
                        "E"
                    ],
                    "last": "Jacobs",
                    "suffix": ""
                },
                {
                    "first": "D",
                    "middle": [
                        "M"
                    ],
                    "last": "Lamson",
                    "suffix": ""
                },
                {
                    "first": "St",
                    "middle": [],
                    "last": "George",
                    "suffix": ""
                },
                {
                    "first": "K",
                    "middle": [],
                    "last": "",
                    "suffix": ""
                }
            ],
            "year": 2013,
            "venue": "Clin Microbiol Rev",
            "volume": "26",
            "issn": "",
            "pages": "135--162",
            "other_ids": {}
        },
        "BIBREF14": {
            "ref_id": "b14",
            "title": "Severe respiratory illness associated with enterovirus D68-Missouri and Illinois",
            "authors": [
                {
                    "first": "C",
                    "middle": [
                        "M"
                    ],
                    "last": "Midgley",
                    "suffix": ""
                },
                {
                    "first": "M",
                    "middle": [
                        "A"
                    ],
                    "last": "Jackson",
                    "suffix": ""
                },
                {
                    "first": "R",
                    "middle": [],
                    "last": "Selvarangan",
                    "suffix": ""
                }
            ],
            "year": 2014,
            "venue": "MMWR Morb Mortal Wkly Rep",
            "volume": "63",
            "issn": "",
            "pages": "798--799",
            "other_ids": {}
        },
        "BIBREF15": {
            "ref_id": "b15",
            "title": "Epidemic 2014 enterovirus D68 cross-reacts with human rhinovirus on a respiratory molecular diagnostic platform",
            "authors": [
                {
                    "first": "S",
                    "middle": [
                        "C"
                    ],
                    "last": "Mcallister",
                    "suffix": ""
                },
                {
                    "first": "M",
                    "middle": [
                        "R"
                    ],
                    "last": "Schleiss",
                    "suffix": ""
                },
                {
                    "first": "S",
                    "middle": [],
                    "last": "Arbefeville",
                    "suffix": ""
                }
            ],
            "year": 2015,
            "venue": "PLoS One",
            "volume": "10",
            "issn": "",
            "pages": "",
            "other_ids": {}
        },
        "BIBREF16": {
            "ref_id": "b16",
            "title": "Respiratory syncytial virus-United States",
            "authors": [
                {
                    "first": "A",
                    "middle": [
                        "K"
                    ],
                    "last": "Haynes",
                    "suffix": ""
                },
                {
                    "first": "M",
                    "middle": [
                        "M"
                    ],
                    "last": "Prill",
                    "suffix": ""
                },
                {
                    "first": "M",
                    "middle": [
                        "K"
                    ],
                    "last": "Iwane",
                    "suffix": ""
                }
            ],
            "year": 2012,
            "venue": "Centers for Disease Control and Prevention (CDC)",
            "volume": "63",
            "issn": "",
            "pages": "1133--1136",
            "other_ids": {}
        },
        "BIBREF17": {
            "ref_id": "b17",
            "title": "Human metapneumovirus: review of an important respiratory pathogen",
            "authors": [
                {
                    "first": "S",
                    "middle": [],
                    "last": "Panda",
                    "suffix": ""
                },
                {
                    "first": "N",
                    "middle": [
                        "K"
                    ],
                    "last": "Mohakud",
                    "suffix": ""
                },
                {
                    "first": "L",
                    "middle": [],
                    "last": "Pena",
                    "suffix": ""
                },
                {
                    "first": "S",
                    "middle": [],
                    "last": "Kumar",
                    "suffix": ""
                }
            ],
            "year": 2014,
            "venue": "Int Infect Dis",
            "volume": "25",
            "issn": "",
            "pages": "45--52",
            "other_ids": {}
        },
        "BIBREF18": {
            "ref_id": "b18",
            "title": "Outbreaks of human metapneumovirus in two skilled nursing facilities-West Virginia and Idaho",
            "authors": [],
            "year": 2011,
            "venue": "Centers for Disease Control and Prevention (CDC)",
            "volume": "62",
            "issn": "",
            "pages": "909--913",
            "other_ids": {}
        },
        "BIBREF19": {
            "ref_id": "b19",
            "title": "Epidemiological analysis of respiratory viral etiology for influenza-like illness during 2010 in Zhuhai, China",
            "authors": [
                {
                    "first": "H",
                    "middle": [],
                    "last": "Li",
                    "suffix": ""
                },
                {
                    "first": "Q",
                    "middle": [],
                    "last": "Wei",
                    "suffix": ""
                },
                {
                    "first": "A",
                    "middle": [],
                    "last": "Tan",
                    "suffix": ""
                }
            ],
            "year": 2013,
            "venue": "Virol J",
            "volume": "10",
            "issn": "",
            "pages": "1--9",
            "other_ids": {}
        },
        "BIBREF20": {
            "ref_id": "b20",
            "title": "Adenoviruses in immunocompromised hosts",
            "authors": [
                {
                    "first": "M",
                    "middle": [],
                    "last": "Echavarr Ia",
                    "suffix": ""
                }
            ],
            "year": 2008,
            "venue": "Clin Microbiol Rev",
            "volume": "21",
            "issn": "",
            "pages": "704--715",
            "other_ids": {}
        },
        "BIBREF21": {
            "ref_id": "b21",
            "title": "The use of a multiplex real-time PCR assay for diagnosing acute respiratory viral infections in children attending an emergency unit",
            "authors": [
                {
                    "first": "C",
                    "middle": [],
                    "last": "Mengelle",
                    "suffix": ""
                },
                {
                    "first": "J",
                    "middle": [
                        "M"
                    ],
                    "last": "Mansuy",
                    "suffix": ""
                },
                {
                    "first": "A",
                    "middle": [],
                    "last": "Pierre",
                    "suffix": ""
                }
            ],
            "year": 2014,
            "venue": "J Clin Virol",
            "volume": "61",
            "issn": "",
            "pages": "411--417",
            "other_ids": {}
        },
        "BIBREF22": {
            "ref_id": "b22",
            "title": "The role of infections and coinfections with newly identified and emerging respiratory viruses in children",
            "authors": [
                {
                    "first": "M",
                    "middle": [],
                    "last": "Debiaggi",
                    "suffix": ""
                },
                {
                    "first": "F",
                    "middle": [],
                    "last": "Canducci",
                    "suffix": ""
                },
                {
                    "first": "E",
                    "middle": [
                        "R"
                    ],
                    "last": "Ceresola",
                    "suffix": ""
                }
            ],
            "year": 2012,
            "venue": "Virol J",
            "volume": "9",
            "issn": "",
            "pages": "1--18",
            "other_ids": {}
        },
        "BIBREF23": {
            "ref_id": "b23",
            "title": "Viral infections in outpatients with medically attended acute respiratory illness during the 2012-2013 influenza season",
            "authors": [
                {
                    "first": "R",
                    "middle": [
                        "K"
                    ],
                    "last": "Zimmerman",
                    "suffix": ""
                },
                {
                    "first": "C",
                    "middle": [
                        "R"
                    ],
                    "last": "Rinaldo",
                    "suffix": ""
                },
                {
                    "first": "M",
                    "middle": [
                        "P"
                    ],
                    "last": "Nowalk",
                    "suffix": ""
                }
            ],
            "year": 2015,
            "venue": "BMC Infect Dis",
            "volume": "15",
            "issn": "",
            "pages": "1--13",
            "other_ids": {}
        },
        "BIBREF24": {
            "ref_id": "b24",
            "title": "Nitsch-Osuch A, Kuchar E, Topczewska-Cabanek A, et al. Incidence and clinical course of respiratory viral coinfections in children aged 0-59 months",
            "authors": [
                {
                    "first": "S",
                    "middle": [
                        "A"
                    ],
                    "last": "Asner",
                    "suffix": ""
                },
                {
                    "first": "M",
                    "middle": [
                        "E"
                    ],
                    "last": "Science",
                    "suffix": ""
                },
                {
                    "first": "D",
                    "middle": [],
                    "last": "Tran",
                    "suffix": ""
                }
            ],
            "year": 2014,
            "venue": "Adv Exp Med Biol",
            "volume": "9",
            "issn": "",
            "pages": "17--23",
            "other_ids": {}
        },
        "BIBREF25": {
            "ref_id": "b25",
            "title": "Epidemiology, coinfections, and outcomes of viral pneumonia in adults: an observational cohort study",
            "authors": [
                {
                    "first": "M",
                    "middle": [
                        "P"
                    ],
                    "last": "Crotty",
                    "suffix": ""
                },
                {
                    "first": "S",
                    "middle": [],
                    "last": "Meyers",
                    "suffix": ""
                },
                {
                    "first": "N",
                    "middle": [],
                    "last": "Hampton",
                    "suffix": ""
                }
            ],
            "year": 2015,
            "venue": "Medicine (Baltimore)",
            "volume": "94",
            "issn": "",
            "pages": "",
            "other_ids": {}
        }
    },
    "ref_entries": {
        "FIGREF0": {
            "text": "HRV was seen throughout the year, with major peaks in the spring and in the fall months of September, October, and November and was the most prevalent respiratory virus detected in children and adults with 449 positive targets. The hierarchy of virus isolation in our patients likely represented what was circulating in the community. Of the 449 patients with positive HRV, 290 were hospitalized, of whom 100 (34.4%) were children aged 1 year and younger.",
            "latex": null,
            "type": "figure"
        },
        "FIGREF1": {
            "text": "Virus detected according to month and year from January 2014 to January 2015. Observe the peaks of influenza A H3 and respiratory syncytial virus (RSV) A during November and December. Human metapneumovirus (hMPV) had two separate peaks of activity in March and December. Parainfluenza virus (PIV) 3 had a peak of activity in May and June. Human rhinovirus (HRV) had the highest activity in September, October, and November. ADV, adenovirus.",
            "latex": null,
            "type": "figure"
        },
        "TABREF0": {
            "text": "Positivity Rate per Viral Target and Virus Type (n \u00bc 862)",
            "latex": null,
            "type": "table"
        },
        "TABREF1": {
            "text": "Viral Targets Detected According to Age Group a",
            "latex": null,
            "type": "table"
        },
        "TABREF3": {
            "text": "Codetection Rate of Viral Targets per Age Group",
            "latex": null,
            "type": "table"
        }
    },
    "back_matter": []
}