{
    "paper_id": "PMC7090988",
    "metadata": {
        "title": "Simultaneous extraction and separation of liquiritin, glycyrrhizic acid, and glabridin from licorice root with analytical and preparative chromatography",
        "authors": [
            {
                "first": "Minglei",
                "middle": [],
                "last": "Tian",
                "suffix": "",
                "email": null,
                "affiliation": {}
            },
            {
                "first": "Hongyuan",
                "middle": [],
                "last": "Yan",
                "suffix": "",
                "email": null,
                "affiliation": {}
            },
            {
                "first": "Kyung",
                "middle": [
                    "Ho"
                ],
                "last": "Row",
                "suffix": "",
                "email": "rowkho@inha.ac.kr",
                "affiliation": {}
            }
        ]
    },
    "body_text": [],
    "ref_entries": {},
    "back_matter": [],
    "bib_entries": {
        "BIBREF0": {
            "title": "Determination of glabridin in human plasma by solid-phase extraction and LCMS/ MS",
            "authors": [
                {
                    "first": "F.",
                    "middle": [],
                    "last": "Aoki",
                    "suffix": ""
                },
                {
                    "first": "K.",
                    "middle": [],
                    "last": "Nakagawa",
                    "suffix": ""
                },
                {
                    "first": "A.",
                    "middle": [],
                    "last": "Tanaka",
                    "suffix": ""
                },
                {
                    "first": "K.",
                    "middle": [],
                    "last": "Matsuzaki",
                    "suffix": ""
                },
                {
                    "first": "N.",
                    "middle": [],
                    "last": "Arai",
                    "suffix": ""
                },
                {
                    "first": "T.",
                    "middle": [],
                    "last": "Mae",
                    "suffix": ""
                }
            ],
            "year": 2005,
            "venue": "J. Chromatogr. B",
            "volume": "828",
            "issn": "",
            "pages": "70-74",
            "other_ids": {
                "DOI": [
                    "10.1016/j.jchromb.2005.09.012"
                ]
            }
        },
        "BIBREF1": {
            "title": "Glycyrrhizin inhibits the lytic pathway of complement: possible mechanism of its antiinflammatory effect on liver",
            "authors": [
                {
                    "first": "Y.",
                    "middle": [],
                    "last": "ujisawa",
                    "suffix": ""
                },
                {
                    "first": "M.",
                    "middle": [],
                    "last": "Sakamoto",
                    "suffix": ""
                },
                {
                    "first": "M.",
                    "middle": [],
                    "last": "Matsushita",
                    "suffix": ""
                },
                {
                    "first": "T.",
                    "middle": [],
                    "last": "Fujita",
                    "suffix": ""
                },
                {
                    "first": "K.",
                    "middle": [],
                    "last": "Nishioka",
                    "suffix": ""
                }
            ],
            "year": 2000,
            "venue": "Microbiol. Immunol.",
            "volume": "44",
            "issn": "",
            "pages": "799-804",
            "other_ids": {
                "DOI": []
            }
        },
        "BIBREF2": {
            "title": "Antiulcer activities of liquorice and its derivatives in experimental gastric lesion induced by ibuprofen in rats",
            "authors": [
                {
                    "first": "A.",
                    "middle": [
                        "R."
                    ],
                    "last": "ehpour",
                    "suffix": ""
                },
                {
                    "first": "M.",
                    "middle": [
                        "E."
                    ],
                    "last": "Zolfaghari",
                    "suffix": ""
                },
                {
                    "first": "T.",
                    "middle": [],
                    "last": "Samadian",
                    "suffix": ""
                },
                {
                    "first": "F.",
                    "middle": [],
                    "last": "Kobarfard",
                    "suffix": ""
                },
                {
                    "first": "M.",
                    "middle": [],
                    "last": "Faizi",
                    "suffix": ""
                },
                {
                    "first": "M.",
                    "middle": [],
                    "last": "Assari",
                    "suffix": ""
                }
            ],
            "year": 1995,
            "venue": "Int. J. Pharm.",
            "volume": "119",
            "issn": "",
            "pages": "133-138",
            "other_ids": {
                "DOI": [
                    "10.1016/0378-5173(94)00377-H"
                ]
            }
        },
        "BIBREF3": {
            "title": "Glycyrrhizin, an active component of liquorice roots, and replication of SARS-associated coronavirus",
            "authors": [
                {
                    "first": "J.",
                    "middle": [],
                    "last": "Cinatl",
                    "suffix": ""
                },
                {
                    "first": "B.",
                    "middle": [],
                    "last": "Morgenstern",
                    "suffix": ""
                },
                {
                    "first": "G.",
                    "middle": [],
                    "last": "Bauer",
                    "suffix": ""
                },
                {
                    "first": "P.",
                    "middle": [],
                    "last": "Chandra",
                    "suffix": ""
                },
                {
                    "first": "H.",
                    "middle": [],
                    "last": "Rabenau",
                    "suffix": ""
                },
                {
                    "first": "H.",
                    "middle": [
                        "W."
                    ],
                    "last": "Doerr",
                    "suffix": ""
                }
            ],
            "year": 2003,
            "venue": "Lancet",
            "volume": "361",
            "issn": "",
            "pages": "2045-2046",
            "other_ids": {
                "DOI": [
                    "10.1016/S0140-6736(03)13615-X"
                ]
            }
        },
        "BIBREF4": {
            "title": "The application of macroporous resins in the separation of licorice flavonoids and glycyrrhizic acid",
            "authors": [
                {
                    "first": "B.",
                    "middle": [],
                    "last": "Fu",
                    "suffix": ""
                },
                {
                    "first": "J.",
                    "middle": [],
                    "last": "Liu",
                    "suffix": ""
                },
                {
                    "first": "H.",
                    "middle": [],
                    "last": "Li",
                    "suffix": ""
                },
                {
                    "first": "L.",
                    "middle": [],
                    "last": "Li",
                    "suffix": ""
                },
                {
                    "first": "F.",
                    "middle": [
                        "S.",
                        "C."
                    ],
                    "last": "Lee",
                    "suffix": ""
                },
                {
                    "first": "X.",
                    "middle": [],
                    "last": "Wang",
                    "suffix": ""
                }
            ],
            "year": 2005,
            "venue": "J. Chromatogr. A",
            "volume": "1089",
            "issn": "",
            "pages": "18-24",
            "other_ids": {
                "DOI": [
                    "10.1016/j.chroma.2005.06.051"
                ]
            }
        },
        "BIBREF5": {
            "title": "Glycyrrhizic acid suppresses type 2 11\u03b2-hydroxysteroid dehydrogenase expression in vivo",
            "authors": [
                {
                    "first": "T.",
                    "middle": [],
                    "last": "Tanahashi",
                    "suffix": ""
                },
                {
                    "first": "T.",
                    "middle": [],
                    "last": "Mune",
                    "suffix": ""
                },
                {
                    "first": "H.",
                    "middle": [],
                    "last": "Morita",
                    "suffix": ""
                },
                {
                    "first": "H.",
                    "middle": [],
                    "last": "Tanahashi",
                    "suffix": ""
                },
                {
                    "first": "Y.",
                    "middle": [],
                    "last": "Isomura",
                    "suffix": ""
                },
                {
                    "first": "T.",
                    "middle": [],
                    "last": "Suwa",
                    "suffix": ""
                },
                {
                    "first": "H.",
                    "middle": [],
                    "last": "Daido",
                    "suffix": ""
                },
                {
                    "first": "C.",
                    "middle": [
                        "E."
                    ],
                    "last": "Gomez-Sanchez",
                    "suffix": ""
                },
                {
                    "first": "K.",
                    "middle": [],
                    "last": "Yasuda",
                    "suffix": ""
                }
            ],
            "year": 2002,
            "venue": "J. Steroid Biochem. Mol. Biol.",
            "volume": "80",
            "issn": "",
            "pages": "441-447",
            "other_ids": {
                "DOI": [
                    "10.1016/S0960-0760(02)00033-X"
                ]
            }
        },
        "BIBREF6": {
            "title": "The licorice root derived isoflavan glabridin increases the function of osteoblastic MC3T3-E1 cells",
            "authors": [
                {
                    "first": "E.",
                    "middle": [
                        "M."
                    ],
                    "last": "Choi",
                    "suffix": ""
                }
            ],
            "year": 2005,
            "venue": "Biochem. Pharmacol.",
            "volume": "70",
            "issn": "",
            "pages": "363-368",
            "other_ids": {
                "DOI": [
                    "10.1016/j.bcp.2005.04.019"
                ]
            }
        },
        "BIBREF7": {
            "title": "Effect of mobile phase additives on resolution of some nucleic compounds in high performance liquid chromatography",
            "authors": [
                {
                    "first": "C.",
                    "middle": [
                        "H."
                    ],
                    "last": "Jin",
                    "suffix": ""
                },
                {
                    "first": "Y.",
                    "middle": [
                        "M."
                    ],
                    "last": "Koo",
                    "suffix": ""
                },
                {
                    "first": "D.",
                    "middle": [
                        "K."
                    ],
                    "last": "Choi",
                    "suffix": ""
                },
                {
                    "first": "K.",
                    "middle": [
                        "H."
                    ],
                    "last": "Row",
                    "suffix": ""
                }
            ],
            "year": 2007,
            "venue": "Biotechnol. Bioprocess Eng.",
            "volume": "12",
            "issn": "",
            "pages": "525-530",
            "other_ids": {
                "DOI": [
                    "10.1007/BF02931350"
                ]
            }
        },
        "BIBREF8": {
            "title": "Optimum operational conditions for chiral separation of tryptophan enatiomers using ligand exchange liquid chromatography",
            "authors": [
                {
                    "first": "H.",
                    "middle": [],
                    "last": "Yan",
                    "suffix": ""
                },
                {
                    "first": "K.",
                    "middle": [
                        "H."
                    ],
                    "last": "Row",
                    "suffix": ""
                }
            ],
            "year": 2007,
            "venue": "Biotechnol. Bioprocess Eng.",
            "volume": "12",
            "issn": "",
            "pages": "235-241",
            "other_ids": {
                "DOI": [
                    "10.1007/BF02931098"
                ]
            }
        },
        "BIBREF9": {
            "title": "Separation of racemic bupivacaine using simulated moving bed with mathematical model",
            "authors": [
                {
                    "first": "Y.",
                    "middle": [
                        "J."
                    ],
                    "last": "Choi",
                    "suffix": ""
                },
                {
                    "first": "S.",
                    "middle": [
                        "K."
                    ],
                    "last": "Han",
                    "suffix": ""
                },
                {
                    "first": "S.",
                    "middle": [
                        "T."
                    ],
                    "last": "Chung",
                    "suffix": ""
                },
                {
                    "first": "K.",
                    "middle": [
                        "H."
                    ],
                    "last": "Row",
                    "suffix": ""
                }
            ],
            "year": 2007,
            "venue": "Biotechnol. Bioprocess Eng.",
            "volume": "12",
            "issn": "",
            "pages": "625-633",
            "other_ids": {
                "DOI": [
                    "10.1007/BF02931078"
                ]
            }
        },
        "BIBREF10": {
            "title": "Separation of glycyrrhizic acid and liquiritin from Glycyrrhiza uralensis Fisch extract by three-liquid-phase extraction systems",
            "authors": [
                {
                    "first": "S.",
                    "middle": [],
                    "last": "Shen",
                    "suffix": ""
                },
                {
                    "first": "Z.",
                    "middle": [],
                    "last": "Chang",
                    "suffix": ""
                },
                {
                    "first": "J.",
                    "middle": [],
                    "last": "Liu",
                    "suffix": ""
                },
                {
                    "first": "X.",
                    "middle": [],
                    "last": "Sun",
                    "suffix": ""
                },
                {
                    "first": "X.",
                    "middle": [],
                    "last": "Hu",
                    "suffix": ""
                },
                {
                    "first": "H.",
                    "middle": [],
                    "last": "Liu",
                    "suffix": ""
                }
            ],
            "year": 2007,
            "venue": "Sep. Purif. Technol.",
            "volume": "53",
            "issn": "",
            "pages": "216-223",
            "other_ids": {
                "DOI": [
                    "10.1016/j.seppur.2006.07.003"
                ]
            }
        },
        "BIBREF11": {
            "title": "Fast determination of flavonoids in Glycyrrhizae radix by capillary zone electrophoresis",
            "authors": [
                {
                    "first": "T.",
                    "middle": [],
                    "last": "Bo",
                    "suffix": ""
                },
                {
                    "first": "K.",
                    "middle": [
                        "A."
                    ],
                    "last": "Li",
                    "suffix": ""
                },
                {
                    "first": "H.",
                    "middle": [],
                    "last": "Liu",
                    "suffix": ""
                }
            ],
            "year": 2002,
            "venue": "Anal. Chim. Acta",
            "volume": "458",
            "issn": "",
            "pages": "345-354",
            "other_ids": {
                "DOI": [
                    "10.1016/S0003-2670(02)00075-2"
                ]
            }
        },
        "BIBREF12": {
            "title": "Application of ionic liquids as mobile phase modifier in HPLC",
            "authors": [
                {
                    "first": "Y.",
                    "middle": [],
                    "last": "Polyakova",
                    "suffix": ""
                },
                {
                    "first": "Y.",
                    "middle": [
                        "M."
                    ],
                    "last": "Koo",
                    "suffix": ""
                },
                {
                    "first": "K.",
                    "middle": [
                        "H."
                    ],
                    "last": "Row",
                    "suffix": ""
                }
            ],
            "year": 2006,
            "venue": "Biotechnol. Bioprocess Eng.",
            "volume": "11",
            "issn": "",
            "pages": "1-6",
            "other_ids": {
                "DOI": [
                    "10.1007/BF02931860"
                ]
            }
        },
        "BIBREF13": {
            "title": "Effective extraction of astaxanthin pigment from shrimp using proteolytic enzymes",
            "authors": [
                {
                    "first": "S.",
                    "middle": [
                        "H."
                    ],
                    "last": "Lee",
                    "suffix": ""
                },
                {
                    "first": "S.",
                    "middle": [
                        "K."
                    ],
                    "last": "Roh",
                    "suffix": ""
                },
                {
                    "first": "K.",
                    "middle": [
                        "H."
                    ],
                    "last": "Park",
                    "suffix": ""
                },
                {
                    "first": "K.",
                    "middle": [
                        "R."
                    ],
                    "last": "Yoon",
                    "suffix": ""
                }
            ],
            "year": 1999,
            "venue": "Biotechnol. Bioprocess Eng.",
            "volume": "4",
            "issn": "",
            "pages": "199-204",
            "other_ids": {
                "DOI": [
                    "10.1007/BF02931929"
                ]
            }
        },
        "BIBREF14": {
            "title": "Separation and analysis of glycyrrhizin, 18\u03b2-glycyrrhetic acid and 18\u03b1-glycyrrhetic acid in liquorice roots by means of capillary zone electrophoresis",
            "authors": [
                {
                    "first": "C.",
                    "middle": [],
                    "last": "abbioni",
                    "suffix": ""
                },
                {
                    "first": "R.",
                    "middle": [],
                    "last": "Mandrioli",
                    "suffix": ""
                },
                {
                    "first": "A.",
                    "middle": [],
                    "last": "Ferranti",
                    "suffix": ""
                },
                {
                    "first": "F.",
                    "middle": [],
                    "last": "Bugamelli",
                    "suffix": ""
                },
                {
                    "first": "M.",
                    "middle": [
                        "A."
                    ],
                    "last": "Saracino",
                    "suffix": ""
                },
                {
                    "first": "G.",
                    "middle": [
                        "C."
                    ],
                    "last": "Forti",
                    "suffix": ""
                },
                {
                    "first": "S.",
                    "middle": [],
                    "last": "Fanali",
                    "suffix": ""
                },
                {
                    "first": "M.",
                    "middle": [
                        "A."
                    ],
                    "last": "Raggi",
                    "suffix": ""
                }
            ],
            "year": 2005,
            "venue": "J. Chromatogr. A",
            "volume": "1081",
            "issn": "",
            "pages": "65-71",
            "other_ids": {
                "DOI": [
                    "10.1016/j.chroma.2005.03.044"
                ]
            }
        },
        "BIBREF15": {
            "title": "Anti-human immunodeficiency virus phenolics from licorice",
            "authors": [
                {
                    "first": "T.",
                    "middle": [],
                    "last": "atano",
                    "suffix": ""
                },
                {
                    "first": "T.",
                    "middle": [],
                    "last": "Yasuhara",
                    "suffix": ""
                },
                {
                    "first": "K.",
                    "middle": [],
                    "last": "Miyamoto",
                    "suffix": ""
                },
                {
                    "first": "T.",
                    "middle": [],
                    "last": "Okuda",
                    "suffix": ""
                }
            ],
            "year": 1988,
            "venue": "Chem. Pharm. Bull.",
            "volume": "36",
            "issn": "",
            "pages": "2286-2288",
            "other_ids": {
                "DOI": []
            }
        },
        "BIBREF16": {
            "title": "Separation of liquiritin by simulated moving bed chromatography",
            "authors": [
                {
                    "first": "J.",
                    "middle": [],
                    "last": "ong",
                    "suffix": ""
                },
                {
                    "first": "B.",
                    "middle": [],
                    "last": "Lin",
                    "suffix": ""
                }
            ],
            "year": 2007,
            "venue": "J. Chromatogr. A",
            "volume": "1145",
            "issn": "",
            "pages": "190-194",
            "other_ids": {
                "DOI": [
                    "10.1016/j.chroma.2007.01.088"
                ]
            }
        },
        "BIBREF17": {
            "title": "Antioxidant constituents from licorice roots: isolation, structure elucidation and antioxidative capacity toward LDL oxidation",
            "authors": [
                {
                    "first": "J.",
                    "middle": [],
                    "last": "aya",
                    "suffix": ""
                },
                {
                    "first": "P.",
                    "middle": [
                        "A."
                    ],
                    "last": "Belinky",
                    "suffix": ""
                },
                {
                    "first": "M.",
                    "middle": [],
                    "last": "Aviram",
                    "suffix": ""
                }
            ],
            "year": 1997,
            "venue": "Free Radic. Biol. Med.",
            "volume": "23",
            "issn": "",
            "pages": "302-313",
            "other_ids": {
                "DOI": [
                    "10.1016/S0891-5849(97)00089-0"
                ]
            }
        },
        "BIBREF18": {
            "title": "Liquiritigenin, an aglycone of liquiritin in Glycyrrhizae radix, prevents acute liver injuries in rats induced by acetaminophen with or without buthionine sulfoximine",
            "authors": [
                {
                    "first": "Y.",
                    "middle": [
                        "W."
                    ],
                    "last": "im",
                    "suffix": ""
                },
                {
                    "first": "S.",
                    "middle": [
                        "H."
                    ],
                    "last": "Ki",
                    "suffix": ""
                },
                {
                    "first": "J.",
                    "middle": [
                        "R."
                    ],
                    "last": "Lee",
                    "suffix": ""
                },
                {
                    "first": "S.",
                    "middle": [
                        "J."
                    ],
                    "last": "Lee",
                    "suffix": ""
                },
                {
                    "first": "C.",
                    "middle": [
                        "W."
                    ],
                    "last": "Kim",
                    "suffix": ""
                },
                {
                    "first": "S.",
                    "middle": [
                        "C."
                    ],
                    "last": "Kim",
                    "suffix": ""
                },
                {
                    "first": "S.",
                    "middle": [
                        "G."
                    ],
                    "last": "Kim",
                    "suffix": ""
                }
            ],
            "year": 2006,
            "venue": "Chem. Biol. Interact.",
            "volume": "161",
            "issn": "",
            "pages": "125-138",
            "other_ids": {
                "DOI": [
                    "10.1016/j.cbi.2006.03.008"
                ]
            }
        },
        "BIBREF19": {
            "title": "A preliminary open trial on interferon stimulator (SNMC) derived from Glycyrrhiza glabra in the treatment of subacute hepatic failure",
            "authors": [
                {
                    "first": "S.",
                    "middle": [
                        "K."
                    ],
                    "last": "charya",
                    "suffix": ""
                },
                {
                    "first": "S.",
                    "middle": [],
                    "last": "Dasarathy",
                    "suffix": ""
                },
                {
                    "first": "A.",
                    "middle": [],
                    "last": "Tandon",
                    "suffix": ""
                },
                {
                    "first": "Y.",
                    "middle": [
                        "K."
                    ],
                    "last": "Joshi",
                    "suffix": ""
                },
                {
                    "first": "B.",
                    "middle": [
                        "N."
                    ],
                    "last": "Tandon",
                    "suffix": ""
                }
            ],
            "year": 1993,
            "venue": "Indian J. Med. Res.",
            "volume": "98",
            "issn": "",
            "pages": "69-74",
            "other_ids": {
                "DOI": []
            }
        },
        "BIBREF20": {
            "title": "Effects of modifiers on the supercritical CO2 extraction of glycyrrhizin from licorice and the morphology of licorice tissue after extraction",
            "authors": [
                {
                    "first": "H.",
                    "middle": [
                        "S."
                    ],
                    "last": "im",
                    "suffix": ""
                },
                {
                    "first": "S.",
                    "middle": [
                        "Y."
                    ],
                    "last": "Lee",
                    "suffix": ""
                },
                {
                    "first": "B.",
                    "middle": [
                        "Y."
                    ],
                    "last": "Kim",
                    "suffix": ""
                },
                {
                    "first": "E.",
                    "middle": [
                        "K."
                    ],
                    "last": "Lee",
                    "suffix": ""
                },
                {
                    "first": "J.",
                    "middle": [
                        "H."
                    ],
                    "last": "Ryu",
                    "suffix": ""
                },
                {
                    "first": "G.",
                    "middle": [
                        "B."
                    ],
                    "last": "Lim",
                    "suffix": ""
                }
            ],
            "year": 2004,
            "venue": "Biotechnol. Bioprocess Eng.",
            "volume": "9",
            "issn": "",
            "pages": "447-453",
            "other_ids": {
                "DOI": [
                    "10.1007/BF02933484"
                ]
            }
        }
    }
}