{
    "paper_id": "5cb33d273e94c1e09e8dc01af7c243ba6493f505",
    "metadata": {
        "title": "Molecular evidence of kobuviruses in free-ranging red foxes (Vulpes vulpes)",
        "authors": [
            {
                "first": "Barbara",
                "middle": [],
                "last": "Di",
                "suffix": "",
                "affiliation": {},
                "email": ""
            },
            {
                "first": "Martino",
                "middle": [
                    "\u2022"
                ],
                "last": "Federica",
                "suffix": "",
                "affiliation": {},
                "email": ""
            },
            {
                "first": "Di",
                "middle": [],
                "last": "Profio",
                "suffix": "",
                "affiliation": {},
                "email": ""
            },
            {
                "first": "Irene",
                "middle": [],
                "last": "Melegari",
                "suffix": "",
                "affiliation": {},
                "email": ""
            },
            {
                "first": "Serena",
                "middle": [],
                "last": "Robetto",
                "suffix": "",
                "affiliation": {},
                "email": ""
            },
            {
                "first": "Elisabetta",
                "middle": [
                    "Di"
                ],
                "last": "Felice",
                "suffix": "",
                "affiliation": {},
                "email": ""
            },
            {
                "first": "Riccardo",
                "middle": [],
                "last": "Orusa",
                "suffix": "",
                "affiliation": {},
                "email": ""
            },
            {
                "first": "Fulvio",
                "middle": [],
                "last": "Marsilio",
                "suffix": "",
                "affiliation": {},
                "email": ""
            },
            {
                "first": "B",
                "middle": [],
                "last": "Di",
                "suffix": "",
                "affiliation": {},
                "email": ""
            },
            {
                "first": "Martino",
                "middle": [],
                "last": "",
                "suffix": "",
                "affiliation": {},
                "email": "bdimartino@unite.it"
            },
            {
                "first": "F",
                "middle": [],
                "last": "Di Profio",
                "suffix": "",
                "affiliation": {},
                "email": ""
            },
            {
                "first": "I",
                "middle": [],
                "last": "Melegari",
                "suffix": "",
                "affiliation": {},
                "email": ""
            },
            {
                "first": "\u00c1",
                "middle": [
                    "F"
                ],
                "last": "Marsilio",
                "suffix": "",
                "affiliation": {},
                "email": ""
            },
            {
                "first": "S",
                "middle": [],
                "last": "Robetto",
                "suffix": "",
                "affiliation": {},
                "email": ""
            },
            {
                "first": "\u00c1",
                "middle": [
                    "R"
                ],
                "last": "Orusa",
                "suffix": "",
                "affiliation": {},
                "email": ""
            },
            {
                "first": "Struttura",
                "middle": [],
                "last": "Complessa Valle D&apos;aosta",
                "suffix": "",
                "affiliation": {},
                "email": ""
            },
            {
                "first": "Centro",
                "middle": [],
                "last": "Di",
                "suffix": "",
                "affiliation": {},
                "email": ""
            },
            {
                "first": "Referenza",
                "middle": [],
                "last": "Nazionale Per Le Malattie",
                "suffix": "",
                "affiliation": {},
                "email": ""
            },
            {
                "first": "Animali",
                "middle": [],
                "last": "Selvatici",
                "suffix": "",
                "affiliation": {},
                "email": ""
            },
            {
                "first": "E",
                "middle": [
                    "Di"
                ],
                "last": "Felice",
                "suffix": "",
                "affiliation": {},
                "email": ""
            }
        ]
    },
    "abstract": [
        {
            "text": "Red foxes (Vulpes vulpes) are susceptible to viral diseases of domestic carnivores. In this study, by screening rectal swabs collected from 34 red foxes in Italy, we identified kobuvirus RNA in five samples. Based on analysis of partial RdRp and full-length VP1 genes, all of the strains shared the highest identity with canine kobuviruses (CaKVs) recently detected in the US, the UK and Italy. These findings provide the first evidence of the circulation of these novel viruses in foxes.",
            "cite_spans": [],
            "ref_spans": [],
            "section": "Abstract"
        },
        {
            "text": "Picornaviruses are small, non-enveloped viruses of approximately 27-30 nm in diameter with single-stranded, positive-polarity RNA genomes of 8.2-8.4 kb. According to the International Committee on Taxonomy of Viruses (http://ictvonline.org/virusTaxonomy.asp?version=2012), the family Picornaviridae is currently divided into 17 genera: The genus Kobuvirus consists of three species [1], Aichivirus A (formerly Aichi virus), Aichivirus B (formerly Bovine kobuvirus) and Aichivirus C (porcine kobuvirus). Human Aichi virus (AiV) was first recognized in 1989 as the cause of oyster-associated nonbacterial gastroenteritis in humans in Aichi Prefecture, Japan [27] . Several investigations worldwide have revealed that AiVs are involved in 0.9-4.1 % of sporadic cases of pediatric gastroenteritis [2, 10, 11, 21] .",
            "cite_spans": [
                {
                    "start": 656,
                    "end": 660,
                    "text": "[27]",
                    "ref_id": "BIBREF26"
                },
                {
                    "start": 793,
                    "end": 796,
                    "text": "[2,",
                    "ref_id": "BIBREF1"
                },
                {
                    "start": 797,
                    "end": 800,
                    "text": "10,",
                    "ref_id": "BIBREF9"
                },
                {
                    "start": 801,
                    "end": 804,
                    "text": "11,",
                    "ref_id": "BIBREF10"
                },
                {
                    "start": 805,
                    "end": 808,
                    "text": "21]",
                    "ref_id": "BIBREF20"
                }
            ],
            "ref_spans": [],
            "section": "Abstract"
        },
        {
            "text": "Novel kobuviruses that are genetically and antigenically closely related to human AiVs have been found recently in domestic carnivores [5, 6, 12, 14] , raising public health concerns of potential cross-species transmission. Carnivore kobuviruses were first discovered in diarrhoeic and asymptomatic dogs [12, 14] . Based on sequence analysis of the complete genome, the novel virus designated canine kobuvirus (CaKV) was found to be genetically closest to the recently identified mouse kobuvirus M-5/USA/2010 (84.0 % amino acid [aa] sequence identity) [17] and to human AiVs (80.0 % aa sequence identity). Accordingly, CaKV may be considered a distinct genotype (CaKV type 1) from both murine kobuvirus (MuKV type 1) and human AiV (AiV type 1), within the species Aichivirus A (http://ictvonline.org/pro posals/2012.014aV.A.v1.Kobuvirus-Sp,Ren.pdf).",
            "cite_spans": [
                {
                    "start": 135,
                    "end": 138,
                    "text": "[5,",
                    "ref_id": "BIBREF4"
                },
                {
                    "start": 139,
                    "end": 141,
                    "text": "6,",
                    "ref_id": "BIBREF5"
                },
                {
                    "start": 142,
                    "end": 145,
                    "text": "12,",
                    "ref_id": "BIBREF11"
                },
                {
                    "start": 146,
                    "end": 149,
                    "text": "14]",
                    "ref_id": "BIBREF13"
                },
                {
                    "start": 304,
                    "end": 308,
                    "text": "[12,",
                    "ref_id": "BIBREF11"
                },
                {
                    "start": 309,
                    "end": 312,
                    "text": "14]",
                    "ref_id": "BIBREF13"
                }
            ],
            "ref_spans": [],
            "section": "Abstract"
        },
        {
            "text": "Subsequently, kobuviruses that are genetically related to CaKVs were identified in the faecal samples of cats with diarrhoea [6] . Nucleotide sequence identity between CaKVs and feline kobuviruses in the RdRp region ranged from 82.2 % to 89.3 %, while identity to MuKV and to human AiV was 82.4-85.5 % and 81.9-82.4 %, respectively.",
            "cite_spans": [
                {
                    "start": 125,
                    "end": 128,
                    "text": "[6]",
                    "ref_id": "BIBREF5"
                }
            ],
            "ref_spans": [],
            "section": "Abstract"
        },
        {
            "text": "Also, a novel kobuvirus more close related to bovine and ovine kobuviruses within the species Aichivirus B has been identified recently in a rectal swab from a ferret [23],",
            "cite_spans": [],
            "ref_spans": [],
            "section": "Abstract"
        }
    ],
    "body_text": [
        {
            "text": "demonstrating that non-domestic carnivores are susceptible to kobuvirus infections.",
            "cite_spans": [],
            "ref_spans": [],
            "section": ""
        },
        {
            "text": "Here we report the detection of kobu-like viruses in faecal samples obtained from Italian red foxes (Vulpes vulpes) that are genetically very similar to CaKVs.",
            "cite_spans": [],
            "ref_spans": [],
            "section": ""
        },
        {
            "text": "Between September 2009 and May 2013, individual rectal swabs were collected from 34 red foxes in northern Italy (Valle d'Aosta and Piemonte regions) submitted to the National Reference Center for Wild Animal Diseases (CeRMAS). The samples were obtained from animals of both genders (14 females and 20 males) found dead or shot during the regular hunting season. Twelve foxes were under 1 year of age, and 22 were adults. Fresh faecal samples were placed into sterile containers and stored at -80\u00b0C until tested.",
            "cite_spans": [],
            "ref_spans": [],
            "section": ""
        },
        {
            "text": "RNA was extracted from 200 ll of 10 % (wt/vol) faecal suspension using TRIzol LS (Invitrogen, Ltd, Paisley, UK) procedure. The final RNA pellet was resuspended in 50 ll of RNase-free water and used directly in RT-PCR assays or stored at -80\u00b0C. Viral DNA was extracted from the supernatants of faecal homogenates by boiling for 10 min and chilling on ice as described previously [7] .",
            "cite_spans": [
                {
                    "start": 378,
                    "end": 381,
                    "text": "[7]",
                    "ref_id": "BIBREF6"
                }
            ],
            "ref_spans": [],
            "section": ""
        },
        {
            "text": "Kobuvirus RNA was detected by RT-PCR using a broadly reactive primer pair, UNIV-kobu-F/UNIV-kobu-R, which amplifies a 217-bp fragment of the 3D gene of all kobuviruses, following reaction conditions described previously [20] .",
            "cite_spans": [
                {
                    "start": 220,
                    "end": 224,
                    "text": "[20]",
                    "ref_id": "BIBREF19"
                }
            ],
            "ref_spans": [],
            "section": ""
        },
        {
            "text": "The samples were also tested by RT-PCR for canine coronaviruses (CCoVs) [18] and canine noroviruses (NoVs) [16, 25] , and by PCR for canine parvovirus (CPV-2) [4] .",
            "cite_spans": [
                {
                    "start": 72,
                    "end": 76,
                    "text": "[18]",
                    "ref_id": "BIBREF17"
                },
                {
                    "start": 107,
                    "end": 111,
                    "text": "[16,",
                    "ref_id": "BIBREF15"
                },
                {
                    "start": 112,
                    "end": 115,
                    "text": "25]",
                    "ref_id": "BIBREF24"
                },
                {
                    "start": 159,
                    "end": 162,
                    "text": "[4]",
                    "ref_id": "BIBREF3"
                }
            ],
            "ref_spans": [],
            "section": ""
        },
        {
            "text": "Novel primers (VP1rf-F, 5 0 -GCGGGCGAATCCTT CAAC-3, and VP1rf-R, GCGACCTTTCGGAGCGCC-3 0 ) to amplify the complete VP1 gene were designed by visual inspection of an alignment containing the kobu-like sequences obtained in this study and the corresponding conserved regions of the CaKVs and AiVs available on the NCBI website.",
            "cite_spans": [],
            "ref_spans": [],
            "section": ""
        },
        {
            "text": "All of the amplicons were purified using a QIAquick Gel Extraction Kit (QIAGEN GmbH, Hilden, Germany) and sequenced directly using BigDye Terminator cycle chemistry and a 3730 DNA analyzer (Applied Biosystems, Foster City, CA). RT-PCR products for which no sequences were obtained by direct sequencing were cloned into the pCR2.1 vector (Invitrogen, Ltd, Paisley, UK). Plasmid DNA was purified using a Miniprep Kit (QIAGEN GmbH, Hilden, Germany); three clones per product were sequenced. Basic Local Alignment Search Tool (BLAST; http://www.ncbi.nlm.nih.gov) and FASTA (http://www. ebi.ac.uk/Tools/sss/fasta/) with default values were used to find homologous hits. Sequence editing and multiple alignments were performed with the BioEdit software package, version 2.1 [9] . A phylogenetic tree (neighbor joining and p-distance model) with bootstrap analysis (1,000 replicates) was constructed using the MEGA software package, version 3.0 [13] .",
            "cite_spans": [
                {
                    "start": 768,
                    "end": 771,
                    "text": "[9]",
                    "ref_id": "BIBREF8"
                },
                {
                    "start": 938,
                    "end": 942,
                    "text": "[13]",
                    "ref_id": "BIBREF12"
                }
            ],
            "ref_spans": [],
            "section": ""
        },
        {
            "text": "Out of 34 faecal specimens, five (14.7 %) were found to be positive for kobuvirus RNA, and two (5.8 %) for CCoV RNA. Canine NoVs and CPV-2 were not detected. Kobuvirus was the single identified enteric virus in four specimens, while a mixed infection with both pathogens (CCoV ? kobuvirus, n = 1) was found in one sample. All of the samples were obtained from adult animals. None of the foxes that were positive for CCoV or kobuvirus RNA showed pathological lesions indicative of enteritis.",
            "cite_spans": [],
            "ref_spans": [],
            "section": ""
        },
        {
            "text": "By FASTA and BLAST analysis of the partial 3D region amplified with the primers UNIV-kobu-F/UNIV-kobu-R, the five fox strains (GenBank accession no. KF781168-KF781172) shared 95.4-96.8 % nt sequence identity with each other and displayed the closest relatedness (92.7-96.2 % nt) with the CaKVs previously found in the US, the UK and Italy [5, 8, 12, 14] . Identity to feline kobuviruses [6] ranged from 81.1 % to 87.7 %, while nt sequence identity to human AiVs was 81.6-85.0 %.",
            "cite_spans": [
                {
                    "start": 339,
                    "end": 342,
                    "text": "[5,",
                    "ref_id": "BIBREF4"
                },
                {
                    "start": 343,
                    "end": 345,
                    "text": "8,",
                    "ref_id": "BIBREF7"
                },
                {
                    "start": 346,
                    "end": 349,
                    "text": "12,",
                    "ref_id": "BIBREF11"
                },
                {
                    "start": 350,
                    "end": 353,
                    "text": "14]",
                    "ref_id": "BIBREF13"
                },
                {
                    "start": 387,
                    "end": 390,
                    "text": "[6]",
                    "ref_id": "BIBREF5"
                }
            ],
            "ref_spans": [],
            "section": ""
        },
        {
            "text": "The full-length sequence of the VP1 gene was determined for each of the five kobuvirus strains (GenBank accession no. KF781163-KF781167). Sequence analysis indicated that the fox kobuviruses were highly related to each other (91.7-98.5 % nt and 97.8-100 % aa identities) and to the CaKV strain UK/003 (accession no. KC161964) (92.6-96.4 % nt and 98-99 % aa identities) recently identified in a healthy dog in the UK [5] . Neighbor-joining phylogenetic analysis based on the VP1 sequences was carried out with a selection of strains representative of the genus Kobuvirus, including murine kobuvirus [17] , human AiVs, wild-boar kobuvirus [22] , the ferret kobuvirus strain MpKoV32 [23] , and the prototype strains porcine kobuvirus S-1 [19] and bovine kobuvirus U1 [26] . Based on inspection of the tree (Fig. 1) , all of the fox kobuvirus sequences formed a tight cluster with the CaKVs recently identified in the UK and in the US [5, 12, 14] , sharing a common root with murine kobuvirus and human AiVs.",
            "cite_spans": [
                {
                    "start": 416,
                    "end": 419,
                    "text": "[5]",
                    "ref_id": "BIBREF4"
                },
                {
                    "start": 598,
                    "end": 602,
                    "text": "[17]",
                    "ref_id": "BIBREF16"
                },
                {
                    "start": 637,
                    "end": 641,
                    "text": "[22]",
                    "ref_id": "BIBREF21"
                },
                {
                    "start": 680,
                    "end": 684,
                    "text": "[23]",
                    "ref_id": "BIBREF22"
                },
                {
                    "start": 735,
                    "end": 739,
                    "text": "[19]",
                    "ref_id": "BIBREF18"
                },
                {
                    "start": 764,
                    "end": 768,
                    "text": "[26]",
                    "ref_id": "BIBREF25"
                },
                {
                    "start": 931,
                    "end": 934,
                    "text": "[5,",
                    "ref_id": "BIBREF4"
                },
                {
                    "start": 935,
                    "end": 938,
                    "text": "12,",
                    "ref_id": "BIBREF11"
                },
                {
                    "start": 939,
                    "end": 942,
                    "text": "14]",
                    "ref_id": "BIBREF13"
                }
            ],
            "ref_spans": [
                {
                    "start": 803,
                    "end": 811,
                    "text": "(Fig. 1)",
                    "ref_id": null
                }
            ],
            "section": ""
        },
        {
            "text": "Historical evidence shows that foxes are susceptible to viral diseases of domestic carnivores, including infections with canine distemper virus [15, 24] , CPV-2 [24] , canine adenoviruses [3, 24] , CCoV [28] , and canine herpesvirus [24] .",
            "cite_spans": [
                {
                    "start": 144,
                    "end": 148,
                    "text": "[15,",
                    "ref_id": "BIBREF14"
                },
                {
                    "start": 149,
                    "end": 152,
                    "text": "24]",
                    "ref_id": "BIBREF23"
                },
                {
                    "start": 161,
                    "end": 165,
                    "text": "[24]",
                    "ref_id": "BIBREF23"
                },
                {
                    "start": 188,
                    "end": 191,
                    "text": "[3,",
                    "ref_id": "BIBREF2"
                },
                {
                    "start": 192,
                    "end": 195,
                    "text": "24]",
                    "ref_id": "BIBREF23"
                },
                {
                    "start": 203,
                    "end": 207,
                    "text": "[28]",
                    "ref_id": "BIBREF27"
                },
                {
                    "start": 233,
                    "end": 237,
                    "text": "[24]",
                    "ref_id": "BIBREF23"
                }
            ],
            "ref_spans": [],
            "section": ""
        },
        {
            "text": "In the present study, we detected kobuviruses in freeranging red foxes with a prevalence rate of 14.7 % (5/34). Investigations based on the molecular analysis of the fulllength VP1 gene revealed that the five fox strains were most closely related to the CaKVs (97.8-100 % aa) recently identified in dogs [5, 12, 14] . Therefore, the fox kobuviruses detected in this study may be considered members of genotype CaKV-1 within the species Aichivirus A. In addition, this is the first study demonstrating the presence of CCoVs in free-ranging red foxes in Italy.",
            "cite_spans": [
                {
                    "start": 304,
                    "end": 307,
                    "text": "[5,",
                    "ref_id": "BIBREF4"
                },
                {
                    "start": 308,
                    "end": 311,
                    "text": "12,",
                    "ref_id": "BIBREF11"
                },
                {
                    "start": 312,
                    "end": 315,
                    "text": "14]",
                    "ref_id": "BIBREF13"
                }
            ],
            "ref_spans": [],
            "section": ""
        },
        {
            "text": "Although CaKVs were found in both asymptomatic and diarrhoeic dogs, the pathogenic potential of these novel kobuviruses in carnivores remains to be elucidated. In this preliminary study, all of the CaKV-like viruses detected were identified in adult foxes found dead or shot during the regular hunting season without apparent pathological enteric lesions. Accordingly, it is unclear if these viruses may have a role in the aetiology of diarrhoea in foxes. Future large-scale virologic investigations by screening faecal samples collected from both diarrhoeic and healthy animals are needed to assess the distribution and pathogenic potential of CaKV-like viruses in foxes.",
            "cite_spans": [],
            "ref_spans": [],
            "section": ""
        },
        {
            "text": "In conclusion, this study provides direct evidence of the circulation of CaKV-like viruses in red foxes, reinforcing the previous observations that kobuvirus infections are probably as frequent in wild animals as they are in domestic animals [22, 23] . Additional studies are warranted in order to determine the significance of these findings and to evaluate the epidemiological and clinical importance of these novel viruses in wild carnivores. Furthermore, as fox kobuviruses are newly recognized viruses and information on their diversity is still limited, a definitive characterization should rely on sequence analysis of the complete genome. Fig. 1 Neighbor-joining phylogenetic tree based on the VP1 gene (834 bp) of the kobuvirus strains detected in red foxes. The tree was generated using the neighbor-joining method and p-distance correction, supplying a statistical support with bootstrapping of 1000 replicates. The scale bar indicates nucleotide substitutions per site. The markers indicate the sequences detected in this study",
            "cite_spans": [
                {
                    "start": 242,
                    "end": 246,
                    "text": "[22,",
                    "ref_id": "BIBREF21"
                },
                {
                    "start": 247,
                    "end": 250,
                    "text": "23]",
                    "ref_id": "BIBREF22"
                }
            ],
            "ref_spans": [
                {
                    "start": 647,
                    "end": 653,
                    "text": "Fig. 1",
                    "ref_id": null
                }
            ],
            "section": ""
        }
    ],
    "bib_entries": {
        "BIBREF0": {
            "ref_id": "b0",
            "title": "Ratification vote on taxonomic proposals to the International Committee on Taxonomy of Viruses",
            "authors": [
                {
                    "first": "M",
                    "middle": [
                        "J"
                    ],
                    "last": "Adams",
                    "suffix": ""
                },
                {
                    "first": "A",
                    "middle": [
                        "M"
                    ],
                    "last": "King",
                    "suffix": ""
                },
                {
                    "first": "E",
                    "middle": [
                        "B"
                    ],
                    "last": "Carstens",
                    "suffix": ""
                }
            ],
            "year": 2013,
            "venue": "Arch Virol",
            "volume": "158",
            "issn": "",
            "pages": "2023--2030",
            "other_ids": {}
        },
        "BIBREF1": {
            "ref_id": "b1",
            "title": "Prevalence and genetic diversity of Aichi virus strains in stool samples from community and hospitalized patients",
            "authors": [
                {
                    "first": "K",
                    "middle": [],
                    "last": "Ambert-Balay",
                    "suffix": ""
                },
                {
                    "first": "M",
                    "middle": [],
                    "last": "Lorrot",
                    "suffix": ""
                },
                {
                    "first": "F",
                    "middle": [],
                    "last": "Bon",
                    "suffix": ""
                },
                {
                    "first": "H",
                    "middle": [],
                    "last": "Giraudon",
                    "suffix": ""
                },
                {
                    "first": "J",
                    "middle": [],
                    "last": "Kaplon",
                    "suffix": ""
                },
                {
                    "first": "M",
                    "middle": [],
                    "last": "Wolfer",
                    "suffix": ""
                },
                {
                    "first": "P",
                    "middle": [],
                    "last": "Lebon",
                    "suffix": ""
                },
                {
                    "first": "D",
                    "middle": [],
                    "last": "Gendrel",
                    "suffix": ""
                },
                {
                    "first": "P",
                    "middle": [],
                    "last": "Pothier",
                    "suffix": ""
                }
            ],
            "year": 2008,
            "venue": "J Clin Microbiol",
            "volume": "46",
            "issn": "",
            "pages": "1252--1258",
            "other_ids": {}
        },
        "BIBREF2": {
            "ref_id": "b2",
            "title": "Molecular epidemiology of canine adenovirus type 1 and type 2 in free-ranging red foxes (Vulpes vulpes) in Italy",
            "authors": [
                {
                    "first": "A",
                    "middle": [],
                    "last": "Balboni",
                    "suffix": ""
                },
                {
                    "first": "R",
                    "middle": [],
                    "last": "Verin",
                    "suffix": ""
                },
                {
                    "first": "F",
                    "middle": [],
                    "last": "Morandi",
                    "suffix": ""
                },
                {
                    "first": "A",
                    "middle": [],
                    "last": "Poli",
                    "suffix": ""
                },
                {
                    "first": "S",
                    "middle": [],
                    "last": "Prosperi",
                    "suffix": ""
                },
                {
                    "first": "M",
                    "middle": [],
                    "last": "Battilani",
                    "suffix": ""
                }
            ],
            "year": 2013,
            "venue": "Vet Microbiol",
            "volume": "162",
            "issn": "",
            "pages": "551--557",
            "other_ids": {}
        },
        "BIBREF3": {
            "ref_id": "b3",
            "title": "Antigenic analysis of canine parvovirus strains isolated in Italy",
            "authors": [
                {
                    "first": "D",
                    "middle": [],
                    "last": "Buonavoglia",
                    "suffix": ""
                },
                {
                    "first": "A",
                    "middle": [],
                    "last": "Cavalli",
                    "suffix": ""
                },
                {
                    "first": "A",
                    "middle": [],
                    "last": "Pratelli",
                    "suffix": ""
                },
                {
                    "first": "V",
                    "middle": [],
                    "last": "Martella",
                    "suffix": ""
                },
                {
                    "first": "G",
                    "middle": [],
                    "last": "Greco",
                    "suffix": ""
                },
                {
                    "first": "M",
                    "middle": [],
                    "last": "Tempesta",
                    "suffix": ""
                },
                {
                    "first": "C",
                    "middle": [],
                    "last": "Buonavoglia",
                    "suffix": ""
                }
            ],
            "year": 2000,
            "venue": "New Microbiol",
            "volume": "23",
            "issn": "",
            "pages": "93--96",
            "other_ids": {}
        },
        "BIBREF4": {
            "ref_id": "b4",
            "title": "Phylogeny and prevalence of kobuviruses in dogs and cats in the UK",
            "authors": [
                {
                    "first": "N",
                    "middle": [],
                    "last": "Carmona-Vicente",
                    "suffix": ""
                },
                {
                    "first": "J",
                    "middle": [],
                    "last": "Buesa",
                    "suffix": ""
                },
                {
                    "first": "P",
                    "middle": [
                        "A"
                    ],
                    "last": "Brown",
                    "suffix": ""
                },
                {
                    "first": "J",
                    "middle": [
                        "Y"
                    ],
                    "last": "Merga",
                    "suffix": ""
                },
                {
                    "first": "A",
                    "middle": [
                        "C"
                    ],
                    "last": "Darby",
                    "suffix": ""
                },
                {
                    "first": "J",
                    "middle": [],
                    "last": "Stavisky",
                    "suffix": ""
                },
                {
                    "first": "L",
                    "middle": [],
                    "last": "Sadler",
                    "suffix": ""
                },
                {
                    "first": "R",
                    "middle": [
                        "M"
                    ],
                    "last": "Gaskell",
                    "suffix": ""
                },
                {
                    "first": "S",
                    "middle": [],
                    "last": "Dawson",
                    "suffix": ""
                },
                {
                    "first": "A",
                    "middle": [
                        "D"
                    ],
                    "last": "Radford",
                    "suffix": ""
                }
            ],
            "year": 2013,
            "venue": "Vet Microbiol",
            "volume": "164",
            "issn": "",
            "pages": "246--252",
            "other_ids": {}
        },
        "BIBREF5": {
            "ref_id": "b5",
            "title": "Detection and genetic characterization of feline kobuviruses",
            "authors": [
                {
                    "first": "J",
                    "middle": [
                        "Y"
                    ],
                    "last": "Chung",
                    "suffix": ""
                },
                {
                    "first": "S",
                    "middle": [
                        "H"
                    ],
                    "last": "Kim",
                    "suffix": ""
                },
                {
                    "first": "Y",
                    "middle": [
                        "H"
                    ],
                    "last": "Kim",
                    "suffix": ""
                },
                {
                    "first": "M",
                    "middle": [
                        "H"
                    ],
                    "last": "Lee",
                    "suffix": ""
                },
                {
                    "first": "K",
                    "middle": [
                        "K"
                    ],
                    "last": "Lee",
                    "suffix": ""
                },
                {
                    "first": "J",
                    "middle": [
                        "K"
                    ],
                    "last": "Oem",
                    "suffix": ""
                }
            ],
            "year": 2013,
            "venue": "Virus Genes",
            "volume": "",
            "issn": "",
            "pages": "",
            "other_ids": {
                "DOI": [
                    "10.1007/s11262-013-0953-8"
                ]
            }
        },
        "BIBREF6": {
            "ref_id": "b6",
            "title": "A real-time PCR assay for rapid detection and quantitation of canine parvovirus type 2 in the feces of dogs",
            "authors": [
                {
                    "first": "N",
                    "middle": [],
                    "last": "Decaro",
                    "suffix": ""
                },
                {
                    "first": "G",
                    "middle": [],
                    "last": "Elia",
                    "suffix": ""
                },
                {
                    "first": "V",
                    "middle": [],
                    "last": "Martella",
                    "suffix": ""
                },
                {
                    "first": "C",
                    "middle": [],
                    "last": "Desario",
                    "suffix": ""
                },
                {
                    "first": "M",
                    "middle": [],
                    "last": "Campolo",
                    "suffix": ""
                },
                {
                    "first": "Di",
                    "middle": [],
                    "last": "Trani",
                    "suffix": ""
                },
                {
                    "first": "L",
                    "middle": [],
                    "last": "Tarsitano",
                    "suffix": ""
                },
                {
                    "first": "E",
                    "middle": [],
                    "last": "Tempesta",
                    "suffix": ""
                },
                {
                    "first": "M",
                    "middle": [],
                    "last": "Buonavoglia",
                    "suffix": ""
                },
                {
                    "first": "C",
                    "middle": [],
                    "last": "",
                    "suffix": ""
                }
            ],
            "year": 2005,
            "venue": "Vet Microbiol",
            "volume": "105",
            "issn": "",
            "pages": "19--28",
            "other_ids": {}
        },
        "BIBREF7": {
            "ref_id": "b7",
            "title": "Canine kobuviruses in diarrhoeic dogs in Italy",
            "authors": [
                {
                    "first": "Di",
                    "middle": [],
                    "last": "Martino",
                    "suffix": ""
                },
                {
                    "first": "B",
                    "middle": [],
                    "last": "",
                    "suffix": ""
                },
                {
                    "first": "Di",
                    "middle": [],
                    "last": "Felice",
                    "suffix": ""
                },
                {
                    "first": "E",
                    "middle": [],
                    "last": "Ceci",
                    "suffix": ""
                },
                {
                    "first": "C",
                    "middle": [],
                    "last": "",
                    "suffix": ""
                },
                {
                    "first": "Di",
                    "middle": [],
                    "last": "Profio",
                    "suffix": ""
                },
                {
                    "first": "F",
                    "middle": [],
                    "last": "Marsilio",
                    "suffix": ""
                },
                {
                    "first": "F",
                    "middle": [],
                    "last": "",
                    "suffix": ""
                }
            ],
            "year": 2013,
            "venue": "Vet Microbiol",
            "volume": "166",
            "issn": "",
            "pages": "246--249",
            "other_ids": {}
        },
        "BIBREF8": {
            "ref_id": "b8",
            "title": "BioEdit: a user-friendly biological sequence alignment and analysis program for Windows 95/98/NT",
            "authors": [
                {
                    "first": "T",
                    "middle": [
                        "A"
                    ],
                    "last": "Hall",
                    "suffix": ""
                }
            ],
            "year": 1999,
            "venue": "Nucleic Acids Symp",
            "volume": "41",
            "issn": "",
            "pages": "95--98",
            "other_ids": {}
        },
        "BIBREF9": {
            "ref_id": "b9",
            "title": "Aichi virus infection in elderly people in Sweden",
            "authors": [
                {
                    "first": "N",
                    "middle": [],
                    "last": "Jonsson",
                    "suffix": ""
                },
                {
                    "first": "K",
                    "middle": [],
                    "last": "Wahlstr\u00f6m",
                    "suffix": ""
                },
                {
                    "first": "L",
                    "middle": [],
                    "last": "Svensson",
                    "suffix": ""
                },
                {
                    "first": "L",
                    "middle": [],
                    "last": "Serrander",
                    "suffix": ""
                },
                {
                    "first": "A",
                    "middle": [
                        "M"
                    ],
                    "last": "Lindberg",
                    "suffix": ""
                }
            ],
            "year": 2012,
            "venue": "Arch Virol",
            "volume": "157",
            "issn": "",
            "pages": "1365--1369",
            "other_ids": {}
        },
        "BIBREF10": {
            "ref_id": "b10",
            "title": "Aichi virus infection in children with acute gastroenteritis in Finland",
            "authors": [
                {
                    "first": "S",
                    "middle": [],
                    "last": "Kaikkonen",
                    "suffix": ""
                },
                {
                    "first": "S",
                    "middle": [],
                    "last": "R\u00e4s\u00e4nen",
                    "suffix": ""
                },
                {
                    "first": "M",
                    "middle": [],
                    "last": "R\u00e4met",
                    "suffix": ""
                },
                {
                    "first": "T",
                    "middle": [],
                    "last": "Vesikari",
                    "suffix": ""
                }
            ],
            "year": 2010,
            "venue": "Epidemiol Infect",
            "volume": "138",
            "issn": "",
            "pages": "1166--1171",
            "other_ids": {}
        },
        "BIBREF11": {
            "ref_id": "b11",
            "title": "Characterization of a canine homolog of human Aichi virus",
            "authors": [
                {
                    "first": "A",
                    "middle": [],
                    "last": "Kapoor",
                    "suffix": ""
                },
                {
                    "first": "P",
                    "middle": [],
                    "last": "Simmonds",
                    "suffix": ""
                },
                {
                    "first": "E",
                    "middle": [
                        "J"
                    ],
                    "last": "Dubovi",
                    "suffix": ""
                },
                {
                    "first": "N",
                    "middle": [],
                    "last": "Qaisar",
                    "suffix": ""
                },
                {
                    "first": "J",
                    "middle": [
                        "A"
                    ],
                    "last": "Henriquez",
                    "suffix": ""
                },
                {
                    "first": "J",
                    "middle": [],
                    "last": "Medina",
                    "suffix": ""
                },
                {
                    "first": "S",
                    "middle": [],
                    "last": "Shields",
                    "suffix": ""
                },
                {
                    "first": "W",
                    "middle": [
                        "I"
                    ],
                    "last": "Lipkin",
                    "suffix": ""
                }
            ],
            "year": 2011,
            "venue": "J Virol",
            "volume": "85",
            "issn": "",
            "pages": "11520--11525",
            "other_ids": {}
        },
        "BIBREF12": {
            "ref_id": "b12",
            "title": "MEGA3: integrated software for molecular evolutionary genetics analysis and sequence alignment",
            "authors": [
                {
                    "first": "S",
                    "middle": [],
                    "last": "Kumar",
                    "suffix": ""
                },
                {
                    "first": "K",
                    "middle": [],
                    "last": "Tamura",
                    "suffix": ""
                },
                {
                    "first": "M",
                    "middle": [],
                    "last": "Nei",
                    "suffix": ""
                }
            ],
            "year": 2004,
            "venue": "Brief Bioinform",
            "volume": "5",
            "issn": "",
            "pages": "153--163",
            "other_ids": {}
        },
        "BIBREF13": {
            "ref_id": "b13",
            "title": "Viruses in diarrhoeic dogs include novel kobuviruses and sapoviruses",
            "authors": [
                {
                    "first": "L",
                    "middle": [],
                    "last": "Li",
                    "suffix": ""
                },
                {
                    "first": "P",
                    "middle": [
                        "A"
                    ],
                    "last": "Pesavento",
                    "suffix": ""
                },
                {
                    "first": "T",
                    "middle": [],
                    "last": "Shan",
                    "suffix": ""
                },
                {
                    "first": "C",
                    "middle": [
                        "M"
                    ],
                    "last": "Leutenegger",
                    "suffix": ""
                },
                {
                    "first": "C",
                    "middle": [],
                    "last": "Wang",
                    "suffix": ""
                },
                {
                    "first": "E",
                    "middle": [],
                    "last": "Delwart",
                    "suffix": ""
                }
            ],
            "year": 2011,
            "venue": "J Gen Virol",
            "volume": "92",
            "issn": "",
            "pages": "2534--2541",
            "other_ids": {}
        },
        "BIBREF14": {
            "ref_id": "b14",
            "title": "Canine distemper epizootic among red foxes",
            "authors": [
                {
                    "first": "V",
                    "middle": [],
                    "last": "Martella",
                    "suffix": ""
                },
                {
                    "first": "A",
                    "middle": [],
                    "last": "Bianchi",
                    "suffix": ""
                },
                {
                    "first": "I",
                    "middle": [],
                    "last": "Bertoletti",
                    "suffix": ""
                },
                {
                    "first": "L",
                    "middle": [],
                    "last": "Pedrotti",
                    "suffix": ""
                },
                {
                    "first": "A",
                    "middle": [],
                    "last": "Gugiatti",
                    "suffix": ""
                },
                {
                    "first": "A",
                    "middle": [],
                    "last": "Catella",
                    "suffix": ""
                },
                {
                    "first": "P",
                    "middle": [],
                    "last": "Cordioli",
                    "suffix": ""
                },
                {
                    "first": "M",
                    "middle": [
                        "S"
                    ],
                    "last": "Lucente",
                    "suffix": ""
                },
                {
                    "first": "G",
                    "middle": [],
                    "last": "Elia",
                    "suffix": ""
                },
                {
                    "first": "C",
                    "middle": [],
                    "last": "Buonavoglia",
                    "suffix": ""
                }
            ],
            "year": 2009,
            "venue": "Emerg Infect Dis",
            "volume": "16",
            "issn": "",
            "pages": "2007--2009",
            "other_ids": {}
        },
        "BIBREF15": {
            "ref_id": "b15",
            "title": "Novel norovirus in dogs with diarrhea",
            "authors": [
                {
                    "first": "J",
                    "middle": [
                        "R"
                    ],
                    "last": "Mesquita",
                    "suffix": ""
                },
                {
                    "first": "L",
                    "middle": [],
                    "last": "Barclay",
                    "suffix": ""
                },
                {
                    "first": "M",
                    "middle": [
                        "S"
                    ],
                    "last": "Nascimento",
                    "suffix": ""
                },
                {
                    "first": "J",
                    "middle": [],
                    "last": "Vinj\u00e9",
                    "suffix": ""
                }
            ],
            "year": 2010,
            "venue": "Emerg Infect Dis",
            "volume": "16",
            "issn": "",
            "pages": "980--982",
            "other_ids": {}
        },
        "BIBREF16": {
            "ref_id": "b16",
            "title": "The fecal viral flora of wild rodents",
            "authors": [
                {
                    "first": "T",
                    "middle": [
                        "G"
                    ],
                    "last": "Phan",
                    "suffix": ""
                },
                {
                    "first": "B",
                    "middle": [],
                    "last": "Kapusinszky",
                    "suffix": ""
                },
                {
                    "first": "C",
                    "middle": [],
                    "last": "Wang",
                    "suffix": ""
                },
                {
                    "first": "R",
                    "middle": [
                        "K"
                    ],
                    "last": "Rose",
                    "suffix": ""
                },
                {
                    "first": "H",
                    "middle": [
                        "L"
                    ],
                    "last": "Lipton",
                    "suffix": ""
                },
                {
                    "first": "E",
                    "middle": [
                        "L"
                    ],
                    "last": "Delwart",
                    "suffix": ""
                }
            ],
            "year": 2011,
            "venue": "PLoS Pathog",
            "volume": "7",
            "issn": "",
            "pages": "",
            "other_ids": {
                "DOI": [
                    "10.1371/journal.ppat.1002218"
                ]
            }
        },
        "BIBREF17": {
            "ref_id": "b17",
            "title": "Development of a nested PCR assay for the detection of canine coronavirus",
            "authors": [
                {
                    "first": "A",
                    "middle": [],
                    "last": "Pratelli",
                    "suffix": ""
                },
                {
                    "first": "M",
                    "middle": [],
                    "last": "Tempesta",
                    "suffix": ""
                },
                {
                    "first": "G",
                    "middle": [],
                    "last": "Greco",
                    "suffix": ""
                },
                {
                    "first": "V",
                    "middle": [],
                    "last": "Martella",
                    "suffix": ""
                },
                {
                    "first": "C",
                    "middle": [],
                    "last": "Buonavoglia",
                    "suffix": ""
                }
            ],
            "year": 1999,
            "venue": "J Virol Methods",
            "volume": "80",
            "issn": "",
            "pages": "11--15",
            "other_ids": {}
        },
        "BIBREF18": {
            "ref_id": "b18",
            "title": "Candidate new species of kobuvirus in porcine hosts",
            "authors": [
                {
                    "first": "G",
                    "middle": [],
                    "last": "Reuter",
                    "suffix": ""
                },
                {
                    "first": "A",
                    "middle": [],
                    "last": "Boldizs\u00e1r",
                    "suffix": ""
                },
                {
                    "first": "I",
                    "middle": [],
                    "last": "Kiss",
                    "suffix": ""
                },
                {
                    "first": "P",
                    "middle": [],
                    "last": "Pankovics",
                    "suffix": ""
                }
            ],
            "year": 2008,
            "venue": "Emerg Infect Dis",
            "volume": "14",
            "issn": "",
            "pages": "1968--1970",
            "other_ids": {}
        },
        "BIBREF19": {
            "ref_id": "b19",
            "title": "Complete nucleotide and amino acid sequences and genetic organization of porcine kobuvirus, a member of a new species in the genus Kobuvirus, family Picornaviridae",
            "authors": [
                {
                    "first": "G",
                    "middle": [],
                    "last": "Reuter",
                    "suffix": ""
                },
                {
                    "first": "A",
                    "middle": [],
                    "last": "Boldizs\u00e1r",
                    "suffix": ""
                },
                {
                    "first": "P",
                    "middle": [],
                    "last": "Pankovics",
                    "suffix": ""
                }
            ],
            "year": 2009,
            "venue": "Arch Virol",
            "volume": "154",
            "issn": "",
            "pages": "101--108",
            "other_ids": {}
        },
        "BIBREF20": {
            "ref_id": "b20",
            "title": "Detection of Aichi virus shedding in a child with enteric and extraintestinal symptoms in Hungary",
            "authors": [
                {
                    "first": "G",
                    "middle": [],
                    "last": "Reuter",
                    "suffix": ""
                },
                {
                    "first": "A",
                    "middle": [],
                    "last": "Boldiz\u00e1sr",
                    "suffix": ""
                },
                {
                    "first": "G",
                    "middle": [],
                    "last": "Papp",
                    "suffix": ""
                },
                {
                    "first": "P",
                    "middle": [],
                    "last": "Pankovics",
                    "suffix": ""
                }
            ],
            "year": 2009,
            "venue": "Arch Virol",
            "volume": "154",
            "issn": "",
            "pages": "1529--1532",
            "other_ids": {}
        },
        "BIBREF21": {
            "ref_id": "b21",
            "title": "Porcine kobuvirus in wild boars (Sus scrofa)",
            "authors": [
                {
                    "first": "G",
                    "middle": [],
                    "last": "Reuter",
                    "suffix": ""
                },
                {
                    "first": "C",
                    "middle": [],
                    "last": "Nemes",
                    "suffix": ""
                },
                {
                    "first": "A",
                    "middle": [],
                    "last": "Boros",
                    "suffix": ""
                },
                {
                    "first": "B",
                    "middle": [],
                    "last": "Kapusinszky",
                    "suffix": ""
                },
                {
                    "first": "E",
                    "middle": [],
                    "last": "Delwart",
                    "suffix": ""
                },
                {
                    "first": "P",
                    "middle": [],
                    "last": "Pankovics",
                    "suffix": ""
                }
            ],
            "year": 2013,
            "venue": "Arch Virol",
            "volume": "158",
            "issn": "",
            "pages": "281--282",
            "other_ids": {}
        },
        "BIBREF22": {
            "ref_id": "b22",
            "title": "Metagenomic analysis of the ferret fecal viral flora",
            "authors": [
                {
                    "first": "S",
                    "middle": [
                        "L"
                    ],
                    "last": "Smits",
                    "suffix": ""
                },
                {
                    "first": "V",
                    "middle": [
                        "S"
                    ],
                    "last": "Raj",
                    "suffix": ""
                },
                {
                    "first": "M",
                    "middle": [
                        "D"
                    ],
                    "last": "Oduber",
                    "suffix": ""
                },
                {
                    "first": "C",
                    "middle": [
                        "M"
                    ],
                    "last": "Schapendonk",
                    "suffix": ""
                },
                {
                    "first": "R",
                    "middle": [],
                    "last": "Bodewes",
                    "suffix": ""
                },
                {
                    "first": "L",
                    "middle": [],
                    "last": "Provacia",
                    "suffix": ""
                },
                {
                    "first": "K",
                    "middle": [
                        "J"
                    ],
                    "last": "Stittelaar",
                    "suffix": ""
                },
                {
                    "first": "A",
                    "middle": [
                        "D"
                    ],
                    "last": "Osterhaus",
                    "suffix": ""
                },
                {
                    "first": "B",
                    "middle": [
                        "L"
                    ],
                    "last": "Haagmans",
                    "suffix": ""
                }
            ],
            "year": 2013,
            "venue": "PLoS One",
            "volume": "8",
            "issn": "8",
            "pages": "",
            "other_ids": {
                "DOI": [
                    "10.1371/journal.pone.0071595"
                ]
            }
        },
        "BIBREF23": {
            "ref_id": "b23",
            "title": "Survey on viral pathogens in wild red foxes (Vulpes vulpes) in Germany with special emphasis on parvoviruses and analysis of a DNA sequence from a red fox parvovirus",
            "authors": [
                {
                    "first": "U",
                    "middle": [],
                    "last": "Truyen",
                    "suffix": ""
                },
                {
                    "first": "T",
                    "middle": [],
                    "last": "M\u00fcller",
                    "suffix": ""
                },
                {
                    "first": "R",
                    "middle": [],
                    "last": "Heidrich",
                    "suffix": ""
                },
                {
                    "first": "K",
                    "middle": [],
                    "last": "Tackmann",
                    "suffix": ""
                },
                {
                    "first": "L",
                    "middle": [
                        "E"
                    ],
                    "last": "Carmichael",
                    "suffix": ""
                }
            ],
            "year": 1998,
            "venue": "Epidemiol Infect",
            "volume": "121",
            "issn": "",
            "pages": "433--440",
            "other_ids": {}
        },
        "BIBREF24": {
            "ref_id": "b24",
            "title": "Rational optimization of generic primers used for Norwalk-like virus detection by reverse transcriptase polymerase chain reaction",
            "authors": [
                {
                    "first": "H",
                    "middle": [],
                    "last": "Vennema",
                    "suffix": ""
                },
                {
                    "first": "E",
                    "middle": [],
                    "last": "De Bruin",
                    "suffix": ""
                },
                {
                    "first": "M",
                    "middle": [],
                    "last": "Koopmans",
                    "suffix": ""
                }
            ],
            "year": 2002,
            "venue": "J Clin Virol",
            "volume": "25",
            "issn": "",
            "pages": "233--235",
            "other_ids": {}
        },
        "BIBREF25": {
            "ref_id": "b25",
            "title": "Isolation and characterization of a new species of kobuvirus associated with cattle",
            "authors": [
                {
                    "first": "T",
                    "middle": [],
                    "last": "Yamashita",
                    "suffix": ""
                },
                {
                    "first": "M",
                    "middle": [],
                    "last": "Ito",
                    "suffix": ""
                },
                {
                    "first": "Y",
                    "middle": [],
                    "last": "Kabashima",
                    "suffix": ""
                },
                {
                    "first": "H",
                    "middle": [],
                    "last": "Tsuzuki",
                    "suffix": ""
                },
                {
                    "first": "A",
                    "middle": [],
                    "last": "Fujiura",
                    "suffix": ""
                },
                {
                    "first": "K",
                    "middle": [],
                    "last": "Sakae",
                    "suffix": ""
                }
            ],
            "year": 2003,
            "venue": "J Gen Virol",
            "volume": "84",
            "issn": "",
            "pages": "3069--3077",
            "other_ids": {}
        },
        "BIBREF26": {
            "ref_id": "b26",
            "title": "Isolation of cytopathic small round viruses with BS-C-1 cells from patients with gastroenteritis",
            "authors": [
                {
                    "first": "T",
                    "middle": [],
                    "last": "Yamashita",
                    "suffix": ""
                },
                {
                    "first": "S",
                    "middle": [],
                    "last": "Kobayashi",
                    "suffix": ""
                },
                {
                    "first": "K",
                    "middle": [],
                    "last": "Sakae",
                    "suffix": ""
                },
                {
                    "first": "S",
                    "middle": [],
                    "last": "Nakata",
                    "suffix": ""
                },
                {
                    "first": "S",
                    "middle": [],
                    "last": "Chiba",
                    "suffix": ""
                },
                {
                    "first": "Y",
                    "middle": [],
                    "last": "Ishihara",
                    "suffix": ""
                },
                {
                    "first": "S",
                    "middle": [],
                    "last": "Isomura",
                    "suffix": ""
                }
            ],
            "year": 1991,
            "venue": "J Infect Dis",
            "volume": "164",
            "issn": "",
            "pages": "954--957",
            "other_ids": {}
        },
        "BIBREF27": {
            "ref_id": "b27",
            "title": "Detection of canine coronaviruses genotype I and II in raised Canidae animals in China",
            "authors": [
                {
                    "first": "Y",
                    "middle": [],
                    "last": "Wang",
                    "suffix": ""
                },
                {
                    "first": "G",
                    "middle": [],
                    "last": "Ma",
                    "suffix": ""
                },
                {
                    "first": "C",
                    "middle": [],
                    "last": "Lu",
                    "suffix": ""
                },
                {
                    "first": "H",
                    "middle": [],
                    "last": "Wen",
                    "suffix": ""
                }
            ],
            "year": 2006,
            "venue": "Berl Munch Tierarztl Wochenschr",
            "volume": "119",
            "issn": "",
            "pages": "35--39",
            "other_ids": {}
        }
    },
    "ref_entries": {},
    "back_matter": [
        {
            "text": "Acknowledgments This work was financed by grants from the University of Teramo, Italy, and from the Italian Ministry of University and Research.",
            "cite_spans": [],
            "ref_spans": [],
            "section": "acknowledgement"
        },
        {
            "text": "Conflict of interest All authors declare that there are no financial or other relationships that might lead to a conflict of interest. All authors have seen and approved the manuscript and have contributed significantly to the work.",
            "cite_spans": [],
            "ref_spans": [],
            "section": "annex"
        }
    ]
}