{
    "paper_id": "PMC7096812",
    "metadata": {
        "title": "A comparison of oligonucleotide-based microarray and real-time PCR for the detection of sexually transmitted infections",
        "authors": [
            {
                "first": "Gyeong-In",
                "middle": [],
                "last": "Lee",
                "suffix": "",
                "email": null,
                "affiliation": {}
            },
            {
                "first": "Jong",
                "middle": [
                    "Pil"
                ],
                "last": "Yoen",
                "suffix": "",
                "email": null,
                "affiliation": {}
            },
            {
                "first": "Jin",
                "middle": [
                    "Seok"
                ],
                "last": "Kang",
                "suffix": "",
                "email": null,
                "affiliation": {}
            },
            {
                "first": "Seung",
                "middle": [
                    "Yong"
                ],
                "last": "Hwang",
                "suffix": "",
                "email": null,
                "affiliation": {}
            },
            {
                "first": "Yu-Min",
                "middle": [],
                "last": "Hong",
                "suffix": "",
                "email": null,
                "affiliation": {}
            },
            {
                "first": "Jeong-Ha",
                "middle": [],
                "last": "Yang",
                "suffix": "",
                "email": null,
                "affiliation": {}
            },
            {
                "first": "Hyun",
                "middle": [
                    "Kyu"
                ],
                "last": "Yoon",
                "suffix": "",
                "email": "yoon0908@naver.com",
                "affiliation": {}
            }
        ]
    },
    "body_text": [],
    "ref_entries": {},
    "back_matter": [],
    "bib_entries": {
        "BIBREF0": {
            "title": "Detection of Mycoplasma genitalium, Mycoplasma hominis, Ureaplasma urealyticum, and Ureaplasma parvum DNAs in urine from asymptomatic healthy young Japanese men",
            "authors": [
                {
                    "first": "S",
                    "middle": [],
                    "last": "Takahashi",
                    "suffix": ""
                }
            ],
            "year": 2006,
            "venue": "J. Infect. Chemother.",
            "volume": "12",
            "issn": "",
            "pages": "269-271",
            "other_ids": {
                "DOI": [
                    "10.1007/s10156-006-0462-y"
                ]
            }
        },
        "BIBREF1": {
            "title": "Sexually transmitted diseases among American youth: incidence and prevalence estimates, 2000",
            "authors": [
                {
                    "first": "H",
                    "middle": [],
                    "last": "Weinstock",
                    "suffix": ""
                },
                {
                    "first": "S",
                    "middle": [],
                    "last": "Berman",
                    "suffix": ""
                },
                {
                    "first": "W",
                    "middle": [],
                    "last": "Cates",
                    "suffix": "Jr."
                }
            ],
            "year": 2004,
            "venue": "Perspect. Sex. Reprod. Health",
            "volume": "36",
            "issn": "",
            "pages": "6-10",
            "other_ids": {
                "DOI": [
                    "10.1363/3600604"
                ]
            }
        },
        "BIBREF2": {
            "title": "Targeted screening for Trichomonas vaginalis with culture using a two-step method in women presenting for STD evaluation",
            "authors": [
                {
                    "first": "H",
                    "middle": [],
                    "last": "Swygard",
                    "suffix": ""
                }
            ],
            "year": 2004,
            "venue": "Sex. Transm. Dis.",
            "volume": "31",
            "issn": "",
            "pages": "659-664",
            "other_ids": {
                "DOI": [
                    "10.1097/01.OLQ.0000143091.95094.73"
                ]
            }
        },
        "BIBREF3": {
            "title": "Evaluation of a commercial enzyme immunoassay for HIV screening in urine",
            "authors": [
                {
                    "first": "J",
                    "middle": [],
                    "last": "Almeda",
                    "suffix": ""
                }
            ],
            "year": 2004,
            "venue": "Eur. J. Clin. Microbiol. Infect. Dis.",
            "volume": "23",
            "issn": "",
            "pages": "831-835",
            "other_ids": {
                "DOI": [
                    "10.1007/s10096-004-1221-6"
                ]
            }
        },
        "BIBREF4": {
            "title": "NAAT-identified and self-reported gonorrhea and chlamydial infections: different atrisk population subgroups?",
            "authors": [
                {
                    "first": "SM",
                    "middle": [],
                    "last": "Rogers",
                    "suffix": ""
                }
            ],
            "year": 2002,
            "venue": "Sex. Transm. Dis.",
            "volume": "29",
            "issn": "",
            "pages": "588-596",
            "other_ids": {
                "DOI": [
                    "10.1097/00007435-200210000-00005"
                ]
            }
        },
        "BIBREF5": {
            "title": "Comparative analysis and serovar-specific identification of multiple-banded antigen genes of Ureaplasma urealyticum biovar 1",
            "authors": [
                {
                    "first": "F",
                    "middle": [],
                    "last": "Kong",
                    "suffix": ""
                }
            ],
            "year": 1999,
            "venue": "J. Clin. Microbiol.",
            "volume": "37",
            "issn": "",
            "pages": "538-543",
            "other_ids": {
                "DOI": []
            }
        },
        "BIBREF6": {
            "title": "Phylogenetic analysis of Ureaplasma urealyticum-support for the establishment of a new species, Ureaplasma parvum",
            "authors": [
                {
                    "first": "F",
                    "middle": [],
                    "last": "Kong",
                    "suffix": ""
                }
            ],
            "year": 1999,
            "venue": "Int. J. Syst. Bacteriol.",
            "volume": "49",
            "issn": "Pt4",
            "pages": "1879-1889",
            "other_ids": {
                "DOI": []
            }
        },
        "BIBREF7": {
            "title": "Detection of Mycoplasma genitalium by PCR amplification of the 16S rRNA gene",
            "authors": [
                {
                    "first": "JS",
                    "middle": [],
                    "last": "Jensen",
                    "suffix": ""
                },
                {
                    "first": "MB",
                    "middle": [],
                    "last": "Borre",
                    "suffix": ""
                },
                {
                    "first": "B",
                    "middle": [],
                    "last": "Dohn",
                    "suffix": ""
                }
            ],
            "year": 2003,
            "venue": "J. Clin. Microbiol.",
            "volume": "41",
            "issn": "",
            "pages": "261-266",
            "other_ids": {
                "DOI": [
                    "10.1128/JCM.41.1.261-266.2003"
                ]
            }
        },
        "BIBREF8": {
            "title": "DNA barcoding Korean birds",
            "authors": [
                {
                    "first": "HS",
                    "middle": [],
                    "last": "Yoo",
                    "suffix": ""
                }
            ],
            "year": 2006,
            "venue": "Mol. Cells",
            "volume": "22",
            "issn": "",
            "pages": "323-327",
            "other_ids": {
                "DOI": []
            }
        },
        "BIBREF9": {
            "title": "Analytic validation of a quantitative real-time PCR assay to measure CMV viral load in whole blood",
            "authors": [
                {
                    "first": "LB",
                    "middle": [],
                    "last": "Thorne",
                    "suffix": ""
                }
            ],
            "year": 2007,
            "venue": "Diagn. Mol. Pathol.",
            "volume": "16",
            "issn": "",
            "pages": "73-80",
            "other_ids": {
                "DOI": [
                    "10.1097/PDM.0b013e318033ab9e"
                ]
            }
        },
        "BIBREF10": {
            "title": "Monitoring HCV RNA viral load by locked nucleic acid molecular beacons real time PCR",
            "authors": [
                {
                    "first": "L",
                    "middle": [],
                    "last": "Morandi",
                    "suffix": ""
                }
            ],
            "year": 2007,
            "venue": "J. Virol. Methods",
            "volume": "140",
            "issn": "",
            "pages": "148-154",
            "other_ids": {
                "DOI": [
                    "10.1016/j.jviromet.2006.11.014"
                ]
            }
        },
        "BIBREF11": {
            "title": "Evaluation of multiplex real-time PCR for detection of Haemophilus ducreyi, Treponema pallidum, herpes simplex virus type 1 and 2 in the diagnosis of genital ulcer disease in the Rakai District, Uganda",
            "authors": [
                {
                    "first": "TR",
                    "middle": [],
                    "last": "Suntoke",
                    "suffix": ""
                }
            ],
            "year": 2009,
            "venue": "Sex. Transm. Infect.",
            "volume": "85",
            "issn": "",
            "pages": "97-101",
            "other_ids": {
                "DOI": [
                    "10.1136/sti.2008.034207"
                ]
            }
        },
        "BIBREF12": {
            "title": "Viral load quantitation of SARS-coronavirus RNA using a one-step real-time RT-PCR",
            "authors": [
                {
                    "first": "E",
                    "middle": [],
                    "last": "Keyaerts",
                    "suffix": ""
                }
            ],
            "year": 2006,
            "venue": "Int. J. Infect. Dis.",
            "volume": "10",
            "issn": "",
            "pages": "32-37",
            "other_ids": {
                "DOI": [
                    "10.1016/j.ijid.2005.02.003"
                ]
            }
        },
        "BIBREF13": {
            "title": "Comparison of the SPF10-LiPA system to the Hybrid Capture 2 Assay for detection of carcinogenic human papillomavirus genotypes among 5,683 young women in Guanacaste, Costa Rica",
            "authors": [
                {
                    "first": "M",
                    "middle": [],
                    "last": "Safaeian",
                    "suffix": ""
                }
            ],
            "year": 2007,
            "venue": "J. Clin. Microbiol.",
            "volume": "45",
            "issn": "",
            "pages": "1447-1454",
            "other_ids": {
                "DOI": [
                    "10.1128/JCM.02580-06"
                ]
            }
        },
        "BIBREF14": {
            "title": "Molecular epidemiology of sexually transmitted human papillomavirus in a self referred group of women in Ireland",
            "authors": [
                {
                    "first": "JF",
                    "middle": [],
                    "last": "Menton",
                    "suffix": ""
                }
            ],
            "year": 2009,
            "venue": "Virol. J.",
            "volume": "6",
            "issn": "",
            "pages": null,
            "other_ids": {
                "DOI": [
                    "10.1186/1743-422X-6-112"
                ]
            }
        },
        "BIBREF15": {
            "title": "Use of TaqMan 5\u2032 nuclease real-time PCR for quantitative detection of Mycoplasma genitalium DNA in males with and without urethritis who were attendees at a sexually transmitted disease clinic",
            "authors": [
                {
                    "first": "JS",
                    "middle": [],
                    "last": "Jensen",
                    "suffix": ""
                }
            ],
            "year": 2004,
            "venue": "J. Clin. Microbiol.",
            "volume": "42",
            "issn": "",
            "pages": "683-692",
            "other_ids": {
                "DOI": [
                    "10.1128/JCM.42.2.683-692.2004"
                ]
            }
        },
        "BIBREF16": {
            "title": "Fabrication and optimization of the multiplex PCR-based oligonucleotide microarray for detection of Neisseria gonorrhoeae, Chlamydia trachomatis and Ureaplasma urealyticum",
            "authors": [
                {
                    "first": "G",
                    "middle": [],
                    "last": "Shi",
                    "suffix": ""
                }
            ],
            "year": 2005,
            "venue": "J. Microbiol. Methods",
            "volume": "62",
            "issn": "",
            "pages": "245-256",
            "other_ids": {
                "DOI": [
                    "10.1016/j.mimet.2005.02.017"
                ]
            }
        },
        "BIBREF17": {
            "title": "More false-positive problems",
            "authors": [
                {
                    "first": "GD",
                    "middle": [],
                    "last": "Cimino",
                    "suffix": ""
                }
            ],
            "year": 1990,
            "venue": "Nature",
            "volume": "345",
            "issn": "",
            "pages": "773-774",
            "other_ids": {
                "DOI": [
                    "10.1038/345773b0"
                ]
            }
        },
        "BIBREF18": {
            "title": "Rapid and sensitive detection of BRCA1/2 mutations in a diagnostic setting: comparison of two high-resolution melting platforms",
            "authors": [
                {
                    "first": "K",
                    "middle": [],
                    "last": "De Leeneer",
                    "suffix": ""
                }
            ],
            "year": 2008,
            "venue": "Clin. Chem.",
            "volume": "54",
            "issn": "",
            "pages": "982-989",
            "other_ids": {
                "DOI": [
                    "10.1373/clinchem.2007.098764"
                ]
            }
        },
        "BIBREF19": {
            "title": "HPV oligonucleotide microarray-based detection of HPV genotypes in cervical neoplastic lesions",
            "authors": [
                {
                    "first": "CJ",
                    "middle": [],
                    "last": "Kim",
                    "suffix": ""
                }
            ],
            "year": 2003,
            "venue": "Gynecol. Oncol.",
            "volume": "89",
            "issn": "",
            "pages": "210-217",
            "other_ids": {
                "DOI": [
                    "10.1016/S0090-8258(02)00069-0"
                ]
            }
        }
    }
}