{
    "paper_id": "PMC7123189",
    "metadata": {
        "title": "Ultrastructure of SARS-CoV, FIPV, and MHV Revealed by Electron Cryomicroscopy",
        "authors": [
            {
                "first": "Stanley",
                "middle": [],
                "last": "Perlman",
                "suffix": "",
                "email": "Stanley-Perlman@uiowa.edu",
                "affiliation": {}
            },
            {
                "first": "Kathryn",
                "middle": [
                    "V."
                ],
                "last": "Holmes",
                "suffix": "",
                "email": "Kathryn.Holmes@ucHSC.edu",
                "affiliation": {}
            },
            {
                "first": "Benjamin",
                "middle": [
                    "W."
                ],
                "last": "Neuman",
                "suffix": "",
                "email": null,
                "affiliation": {}
            },
            {
                "first": "Brian",
                "middle": [
                    "D."
                ],
                "last": "Adair",
                "suffix": "",
                "email": null,
                "affiliation": {}
            },
            {
                "first": "Craig",
                "middle": [],
                "last": "Yoshioka",
                "suffix": "",
                "email": null,
                "affiliation": {}
            },
            {
                "first": "Joel",
                "middle": [
                    "D."
                ],
                "last": "Quispe",
                "suffix": "",
                "email": null,
                "affiliation": {}
            },
            {
                "first": "Ronald",
                "middle": [
                    "A."
                ],
                "last": "Milligan",
                "suffix": "",
                "email": null,
                "affiliation": {}
            },
            {
                "first": "Mark",
                "middle": [],
                "last": "Yeager",
                "suffix": "",
                "email": null,
                "affiliation": {}
            },
            {
                "first": "Michael",
                "middle": [
                    "J."
                ],
                "last": "Buchmeier",
                "suffix": "",
                "email": null,
                "affiliation": {}
            }
        ]
    },
    "body_text": [],
    "ref_entries": {},
    "back_matter": [],
    "bib_entries": {
        "BIBREF0": {
            "title": "Organization of immature human immunodeficiency virus type 1",
            "authors": [
                {
                    "first": "T",
                    "middle": [],
                    "last": "Wilk",
                    "suffix": ""
                },
                {
                    "first": "I",
                    "middle": [],
                    "last": "Gross",
                    "suffix": ""
                },
                {
                    "first": "BE",
                    "middle": [],
                    "last": "Gowen",
                    "suffix": ""
                },
                {
                    "first": "T",
                    "middle": [],
                    "last": "Rutten",
                    "suffix": ""
                },
                {
                    "first": "F",
                    "middle": [],
                    "last": "de Haas",
                    "suffix": ""
                },
                {
                    "first": "R",
                    "middle": [],
                    "last": "Welker",
                    "suffix": ""
                },
                {
                    "first": "HG",
                    "middle": [],
                    "last": "Krausslich",
                    "suffix": ""
                },
                {
                    "first": "P",
                    "middle": [],
                    "last": "Boulanger",
                    "suffix": ""
                },
                {
                    "first": "SD",
                    "middle": [],
                    "last": "Fuller",
                    "suffix": ""
                }
            ],
            "year": 2001,
            "venue": "J. Virol.",
            "volume": "75",
            "issn": "",
            "pages": "759-771",
            "other_ids": {
                "DOI": [
                    "10.1128/JVI.75.2.759-771.2001"
                ]
            }
        },
        "BIBREF1": {
            "title": "Supramolecular organization of immature and mature murine leukemia virus revealed by electron cryo-microscopy: implications for retroviral assembly mechanisms",
            "authors": [
                {
                    "first": "M",
                    "middle": [],
                    "last": "Yeager",
                    "suffix": ""
                },
                {
                    "first": "EM",
                    "middle": [],
                    "last": "Wilson-Kubalek",
                    "suffix": ""
                },
                {
                    "first": "SG",
                    "middle": [],
                    "last": "Weiner",
                    "suffix": ""
                },
                {
                    "first": "PO",
                    "middle": [],
                    "last": "Brown",
                    "suffix": ""
                },
                {
                    "first": "A",
                    "middle": [],
                    "last": "Rein",
                    "suffix": ""
                }
            ],
            "year": 1998,
            "venue": "Proc. Natl. Acad. Sci. USA",
            "volume": "95",
            "issn": "",
            "pages": "7299-7304",
            "other_ids": {
                "DOI": [
                    "10.1073/pnas.95.13.7299"
                ]
            }
        },
        "BIBREF2": {
            "title": "The organization of mature Rous sarcoma virus as studied by cryoelectron microscopy",
            "authors": [
                {
                    "first": "RL",
                    "middle": [],
                    "last": "Kingston",
                    "suffix": ""
                },
                {
                    "first": "NH",
                    "middle": [],
                    "last": "Olson",
                    "suffix": ""
                },
                {
                    "first": "VM",
                    "middle": [],
                    "last": "Vogt",
                    "suffix": ""
                }
            ],
            "year": 2001,
            "venue": "J. Struct. Biol.",
            "volume": "136",
            "issn": "",
            "pages": "67-80",
            "other_ids": {
                "DOI": [
                    "10.1006/jsbi.2001.4423"
                ]
            }
        },
        "BIBREF3": {
            "title": "Characterization of Rous sarcoma virus Gag particles assembled in vitro",
            "authors": [
                {
                    "first": "F",
                    "middle": [],
                    "last": "Yu",
                    "suffix": ""
                },
                {
                    "first": "SM",
                    "middle": [],
                    "last": "Joshi",
                    "suffix": ""
                },
                {
                    "first": "YM",
                    "middle": [],
                    "last": "Ma",
                    "suffix": ""
                },
                {
                    "first": "RL",
                    "middle": [],
                    "last": "Kingston",
                    "suffix": ""
                },
                {
                    "first": "MN",
                    "middle": [],
                    "last": "Simon",
                    "suffix": ""
                },
                {
                    "first": "VM",
                    "middle": [],
                    "last": "Vogt",
                    "suffix": ""
                }
            ],
            "year": 2001,
            "venue": "J. Virol.",
            "volume": "75",
            "issn": "",
            "pages": "2753-2764",
            "other_ids": {
                "DOI": [
                    "10.1128/JVI.75.6.2753-2764.2001"
                ]
            }
        },
        "BIBREF4": {
            "title": "Electron microscopy of vitrified-hydrated La Crosse virus",
            "authors": [
                {
                    "first": "Y",
                    "middle": [],
                    "last": "Talmon",
                    "suffix": ""
                },
                {
                    "first": "BV",
                    "middle": [],
                    "last": "Prasad",
                    "suffix": ""
                },
                {
                    "first": "JP",
                    "middle": [],
                    "last": "Clerx",
                    "suffix": ""
                },
                {
                    "first": "GJ",
                    "middle": [],
                    "last": "Wang",
                    "suffix": ""
                },
                {
                    "first": "W",
                    "middle": [],
                    "last": "Chiu",
                    "suffix": ""
                },
                {
                    "first": "MJ",
                    "middle": [],
                    "last": "Hewlett",
                    "suffix": ""
                }
            ],
            "year": 1987,
            "venue": "J. Virol.",
            "volume": "61",
            "issn": "",
            "pages": "2319-2321",
            "other_ids": {
                "DOI": []
            }
        },
        "BIBREF5": {
            "title": "Structural variation of La Crosse virions under different chemical and physical conditions",
            "authors": [
                {
                    "first": "GJ",
                    "middle": [],
                    "last": "Wang",
                    "suffix": ""
                },
                {
                    "first": "M",
                    "middle": [],
                    "last": "Hewlett",
                    "suffix": ""
                },
                {
                    "first": "W",
                    "middle": [],
                    "last": "Chiu",
                    "suffix": ""
                }
            ],
            "year": 1991,
            "venue": "Virology",
            "volume": "184",
            "issn": "",
            "pages": "455-459",
            "other_ids": {
                "DOI": [
                    "10.1016/0042-6822(91)90869-D"
                ]
            }
        },
        "BIBREF6": {
            "title": "Cryoelectron microscopy of vitrified Sendai virions",
            "authors": [
                {
                    "first": "Y",
                    "middle": [],
                    "last": "Hosaka",
                    "suffix": ""
                },
                {
                    "first": "T",
                    "middle": [],
                    "last": "Watabe",
                    "suffix": ""
                }
            ],
            "year": 1988,
            "venue": "J. Virol. Methods.",
            "volume": "22",
            "issn": "",
            "pages": "347-349",
            "other_ids": {
                "DOI": [
                    "10.1016/0166-0934(88)90117-6"
                ]
            }
        },
        "BIBREF7": {
            "title": "Complementarity in the supramolecular design of arenaviruses and retroviruses revealed by electron cryomicroscopy and image analysis",
            "authors": [
                {
                    "first": "BW",
                    "middle": [],
                    "last": "Neuman",
                    "suffix": ""
                },
                {
                    "first": "BD",
                    "middle": [],
                    "last": "Adair",
                    "suffix": ""
                },
                {
                    "first": "JW",
                    "middle": [],
                    "last": "Burns",
                    "suffix": ""
                },
                {
                    "first": "RA",
                    "middle": [],
                    "last": "Milligan",
                    "suffix": ""
                },
                {
                    "first": "MJ",
                    "middle": [],
                    "last": "Buchmeier",
                    "suffix": ""
                },
                {
                    "first": "M",
                    "middle": [],
                    "last": "Yeager",
                    "suffix": ""
                }
            ],
            "year": 2005,
            "venue": "J. Virol.",
            "volume": "79",
            "issn": "",
            "pages": "3822-3830",
            "other_ids": {
                "DOI": [
                    "10.1128/JVI.79.6.3822-3830.2005"
                ]
            }
        },
        "BIBREF8": {
            "title": "Ribonucleoprotein-like structures from coronavirus particles",
            "authors": [
                {
                    "first": "MR",
                    "middle": [],
                    "last": "Macnaughton",
                    "suffix": ""
                },
                {
                    "first": "HA",
                    "middle": [],
                    "last": "Davies",
                    "suffix": ""
                },
                {
                    "first": "MV",
                    "middle": [],
                    "last": "Nermut",
                    "suffix": ""
                }
            ],
            "year": 1978,
            "venue": "J. Gen. Virol.",
            "volume": "39",
            "issn": "",
            "pages": "545-549",
            "other_ids": {
                "DOI": [
                    "10.1099/0022-1317-39-3-545"
                ]
            }
        },
        "BIBREF9": {
            "title": "The membrane M protein carboxy terminus binds to transmissible gastroenteritis coronavirus core and contributes to core stability",
            "authors": [
                {
                    "first": "D",
                    "middle": [],
                    "last": "Escors",
                    "suffix": ""
                },
                {
                    "first": "J",
                    "middle": [],
                    "last": "Ortego",
                    "suffix": ""
                },
                {
                    "first": "H",
                    "middle": [],
                    "last": "Laude",
                    "suffix": ""
                },
                {
                    "first": "L",
                    "middle": [],
                    "last": "Enjuanes",
                    "suffix": ""
                }
            ],
            "year": 2001,
            "venue": "J. Virol.",
            "volume": "75",
            "issn": "",
            "pages": "1312-1324",
            "other_ids": {
                "DOI": [
                    "10.1128/JVI.75.3.1312-1324.2001"
                ]
            }
        },
        "BIBREF10": {
            "title": "The transmissible gastroenteritis coronavirus contains a spherical core shell consisting of M and N proteins",
            "authors": [
                {
                    "first": "C",
                    "middle": [],
                    "last": "Risco",
                    "suffix": ""
                },
                {
                    "first": "IM",
                    "middle": [],
                    "last": "Anton",
                    "suffix": ""
                },
                {
                    "first": "L",
                    "middle": [],
                    "last": "Enjuanes",
                    "suffix": ""
                },
                {
                    "first": "JL",
                    "middle": [],
                    "last": "Carrascosa",
                    "suffix": ""
                }
            ],
            "year": 1996,
            "venue": "J. Virol.",
            "volume": "70",
            "issn": "",
            "pages": "4773-4777",
            "other_ids": {
                "DOI": []
            }
        },
        "BIBREF11": {
            "title": "Electron microscopy of influenza virus. A comparison of negatively stained and ice-embedded particles,",
            "authors": [
                {
                    "first": "FP",
                    "middle": [],
                    "last": "Booy",
                    "suffix": ""
                },
                {
                    "first": "RW",
                    "middle": [],
                    "last": "Ruigrok",
                    "suffix": ""
                },
                {
                    "first": "EF",
                    "middle": [],
                    "last": "van Bruggen",
                    "suffix": ""
                }
            ],
            "year": 1985,
            "venue": "J. Mol. Biol.",
            "volume": "184",
            "issn": "",
            "pages": "667-676",
            "other_ids": {
                "DOI": [
                    "10.1016/0022-2836(85)90312-2"
                ]
            }
        },
        "BIBREF12": {
            "title": "Fine structure of influenza A virus observed by electron cryo-microscopy",
            "authors": [
                {
                    "first": "Y",
                    "middle": [],
                    "last": "Fujiyoshi",
                    "suffix": ""
                },
                {
                    "first": "NP",
                    "middle": [],
                    "last": "Kume",
                    "suffix": ""
                },
                {
                    "first": "K",
                    "middle": [],
                    "last": "Sakata",
                    "suffix": ""
                },
                {
                    "first": "SB",
                    "middle": [],
                    "last": "Sato",
                    "suffix": ""
                }
            ],
            "year": 1994,
            "venue": "EMBO J.",
            "volume": "13",
            "issn": "",
            "pages": "318-326",
            "other_ids": {
                "DOI": []
            }
        },
        "BIBREF13": {
            "title": "Morphological changes and fusogenic activity of influenza virus hemagglutinin",
            "authors": [
                {
                    "first": "T",
                    "middle": [],
                    "last": "Shangguan",
                    "suffix": ""
                },
                {
                    "first": "DP",
                    "middle": [],
                    "last": "Siegel",
                    "suffix": ""
                },
                {
                    "first": "JD",
                    "middle": [],
                    "last": "Lear",
                    "suffix": ""
                },
                {
                    "first": "PH",
                    "middle": [],
                    "last": "Axelsen",
                    "suffix": ""
                },
                {
                    "first": "D",
                    "middle": [],
                    "last": "Alford",
                    "suffix": ""
                },
                {
                    "first": "J",
                    "middle": [],
                    "last": "Bentz",
                    "suffix": ""
                }
            ],
            "year": 1998,
            "venue": "Biophys. J.",
            "volume": "74",
            "issn": "",
            "pages": "54-62",
            "other_ids": {
                "DOI": [
                    "10.1016/S0006-3495(98)77766-5"
                ]
            }
        },
        "BIBREF14": {
            "title": "Specific interaction of a novel foamy virus Env leader protein with the N-terminal Gag domain",
            "authors": [
                {
                    "first": "T",
                    "middle": [],
                    "last": "Wilk",
                    "suffix": ""
                },
                {
                    "first": "V",
                    "middle": [],
                    "last": "Geiselhart",
                    "suffix": ""
                },
                {
                    "first": "M",
                    "middle": [],
                    "last": "Frech",
                    "suffix": ""
                },
                {
                    "first": "SD",
                    "middle": [],
                    "last": "Fuller",
                    "suffix": ""
                },
                {
                    "first": "RM",
                    "middle": [],
                    "last": "Flugel",
                    "suffix": ""
                },
                {
                    "first": "M",
                    "middle": [],
                    "last": "Lochelt",
                    "suffix": ""
                }
            ],
            "year": 2001,
            "venue": "J. Virol.",
            "volume": "75",
            "issn": "",
            "pages": "7995-8007",
            "other_ids": {
                "DOI": [
                    "10.1128/JVI.75.17.7995-8007.2001"
                ]
            }
        },
        "BIBREF15": {
            "title": "Structural organization of authentic, mature HIV-1 virions and cores",
            "authors": [
                {
                    "first": "JA",
                    "middle": [],
                    "last": "Briggs",
                    "suffix": ""
                },
                {
                    "first": "T",
                    "middle": [],
                    "last": "Wilk",
                    "suffix": ""
                },
                {
                    "first": "R",
                    "middle": [],
                    "last": "Welker",
                    "suffix": ""
                },
                {
                    "first": "HG",
                    "middle": [],
                    "last": "Krausslich",
                    "suffix": ""
                },
                {
                    "first": "SD",
                    "middle": [],
                    "last": "Fuller",
                    "suffix": ""
                }
            ],
            "year": 2003,
            "venue": "EMBO J.",
            "volume": "22",
            "issn": "",
            "pages": "1707-1715",
            "other_ids": {
                "DOI": [
                    "10.1093/emboj/cdg143"
                ]
            }
        },
        "BIBREF16": {
            "title": "Cryo-electron microscopy reveals ordered domains in the immature HIV-1 particle",
            "authors": [
                {
                    "first": "SD",
                    "middle": [],
                    "last": "Fuller",
                    "suffix": ""
                },
                {
                    "first": "T",
                    "middle": [],
                    "last": "Wilk",
                    "suffix": ""
                },
                {
                    "first": "BE",
                    "middle": [],
                    "last": "Gowen",
                    "suffix": ""
                },
                {
                    "first": "HG",
                    "middle": [],
                    "last": "Krausslich",
                    "suffix": ""
                },
                {
                    "first": "VM",
                    "middle": [],
                    "last": "Vogt",
                    "suffix": ""
                }
            ],
            "year": 1997,
            "venue": "Curr. Biol.",
            "volume": "7",
            "issn": "",
            "pages": "729-738",
            "other_ids": {
                "DOI": [
                    "10.1016/S0960-9822(06)00331-9"
                ]
            }
        },
        "BIBREF17": {
            "title": "Projection structures of human immunodeficiency virus type1(HIV-1) observed with high resolution electron cryo-microscopy",
            "authors": [
                {
                    "first": "T",
                    "middle": [],
                    "last": "Goto",
                    "suffix": ""
                },
                {
                    "first": "T",
                    "middle": [],
                    "last": "Ashina",
                    "suffix": ""
                },
                {
                    "first": "Y",
                    "middle": [],
                    "last": "Fujiyoshi",
                    "suffix": ""
                },
                {
                    "first": "N",
                    "middle": [],
                    "last": "Kume",
                    "suffix": ""
                },
                {
                    "first": "H",
                    "middle": [],
                    "last": "Yamagishi",
                    "suffix": ""
                },
                {
                    "first": "M",
                    "middle": [],
                    "last": "Nakai",
                    "suffix": ""
                }
            ],
            "year": 1994,
            "venue": "J. Electron Microsc. (Tokyo)",
            "volume": "43",
            "issn": "",
            "pages": "16-19",
            "other_ids": {
                "DOI": []
            }
        },
        "BIBREF18": {
            "title": "Further evidence of icosahedral symmetry in human and simian immunodeficiency virus,",
            "authors": [
                {
                    "first": "MV",
                    "middle": [],
                    "last": "Nermut",
                    "suffix": ""
                },
                {
                    "first": "C",
                    "middle": [],
                    "last": "Grief",
                    "suffix": ""
                },
                {
                    "first": "S",
                    "middle": [],
                    "last": "Hashmi",
                    "suffix": ""
                },
                {
                    "first": "DJ",
                    "middle": [],
                    "last": "Hockley",
                    "suffix": ""
                }
            ],
            "year": 1993,
            "venue": "AIDS Res. Hum. Retroviruses",
            "volume": "9",
            "issn": "",
            "pages": "929-938",
            "other_ids": {
                "DOI": [
                    "10.1089/aid.1993.9.929"
                ]
            }
        }
    }
}