{
    "paper_id": "PMC7090980",
    "metadata": {
        "title": "Evaluation of sensitivities and specificities of SARS-CoV detection by real-time quantitative reverse transcription-PCR assays",
        "authors": [
            {
                "first": "Li-li",
                "middle": [],
                "last": "Xu",
                "suffix": "",
                "email": null,
                "affiliation": {}
            },
            {
                "first": "Zhi-hong",
                "middle": [],
                "last": "Hu",
                "suffix": "",
                "email": null,
                "affiliation": {}
            },
            {
                "first": "Hua-lin",
                "middle": [],
                "last": "Wang",
                "suffix": "",
                "email": null,
                "affiliation": {}
            },
            {
                "first": "Xiao",
                "middle": [],
                "last": "Han",
                "suffix": "",
                "email": null,
                "affiliation": {}
            },
            {
                "first": "Fei",
                "middle": [],
                "last": "Deng",
                "suffix": "",
                "email": "df@wh.iov.cn",
                "affiliation": {}
            }
        ]
    },
    "body_text": [],
    "ref_entries": {},
    "back_matter": [],
    "bib_entries": {
        "BIBREF0": {
            "title": "Preclinical evaluation of two real-time, reverse transcription-PCR assays for detection of the severe acute respiratory syndrome coronavirus",
            "authors": [
                {
                    "first": "A.",
                    "middle": [
                        "M."
                    ],
                    "last": "Bressler",
                    "suffix": ""
                },
                {
                    "first": "F.",
                    "middle": [
                        "S."
                    ],
                    "last": "Nolte",
                    "suffix": ""
                }
            ],
            "year": 2004,
            "venue": "J Clin Microbiol",
            "volume": "42",
            "issn": "",
            "pages": "987-991",
            "other_ids": {
                "DOI": [
                    "10.1128/JCM.42.3.987-991.2004"
                ]
            }
        },
        "BIBREF1": {
            "title": "Coronavirus as a possible cause of severe acute respiratory syndrome",
            "authors": [
                {
                    "first": "J.",
                    "middle": [
                        "S."
                    ],
                    "last": "Peiris",
                    "suffix": ""
                },
                {
                    "first": "S.",
                    "middle": [
                        "T."
                    ],
                    "last": "Lai",
                    "suffix": ""
                },
                {
                    "first": "L.",
                    "middle": [
                        "L."
                    ],
                    "last": "Poon",
                    "suffix": ""
                }
            ],
            "year": 2003,
            "venue": "Lancet",
            "volume": "361",
            "issn": "",
            "pages": "1319-1325",
            "other_ids": {
                "DOI": [
                    "10.1016/S0140-6736(03)13077-2"
                ]
            }
        },
        "BIBREF2": {
            "title": "High-efficiency detection of severe acute respiratory syndrome virus genetic material",
            "authors": [
                {
                    "first": "M.",
                    "middle": [],
                    "last": "Weidmann",
                    "suffix": ""
                },
                {
                    "first": "P.",
                    "middle": [
                        "M."
                    ],
                    "last": "Zanotto",
                    "suffix": ""
                },
                {
                    "first": "F.",
                    "middle": [],
                    "last": "Weber",
                    "suffix": ""
                }
            ],
            "year": 2004,
            "venue": "J Clin Microbiol",
            "volume": "42",
            "issn": "",
            "pages": "2771-2773",
            "other_ids": {
                "DOI": [
                    "10.1128/JCM.42.6.2771-2773.2004"
                ]
            }
        },
        "BIBREF3": {
            "title": "Development of a quantitative assay for SARS coronavirus and correlation of GAPDH mRNA with SARS coronavirus in clinical specimens",
            "authors": [
                {
                    "first": "S.",
                    "middle": [
                        "C."
                    ],
                    "last": "Wong",
                    "suffix": ""
                },
                {
                    "first": "J.",
                    "middle": [
                        "K."
                    ],
                    "last": "Chan",
                    "suffix": ""
                },
                {
                    "first": "K.",
                    "middle": [
                        "C."
                    ],
                    "last": "Lee",
                    "suffix": ""
                }
            ],
            "year": 2005,
            "venue": "J Clin Pathol",
            "volume": "58",
            "issn": "",
            "pages": "276-280",
            "other_ids": {
                "DOI": [
                    "10.1136/jcp.2004.016592"
                ]
            }
        },
        "BIBREF4": {
            "title": "Identification of a novel coronavirus in patients with severe acute respiratory syndrome",
            "authors": [
                {
                    "first": "C.",
                    "middle": [],
                    "last": "Drosten",
                    "suffix": ""
                },
                {
                    "first": "L.",
                    "middle": [
                        "L."
                    ],
                    "last": "Chiu",
                    "suffix": ""
                },
                {
                    "first": "M.",
                    "middle": [
                        "M."
                    ],
                    "last": "Panning",
                    "suffix": ""
                }
            ],
            "year": 2003,
            "venue": "N Engl J Med",
            "volume": "348",
            "issn": "",
            "pages": "1967-1976",
            "other_ids": {
                "DOI": [
                    "10.1056/NEJMoa030747"
                ]
            }
        },
        "BIBREF5": {
            "title": "Evaluation of advanced reverse transcription-PCR assays and an alternative PCR target region for detection of severe acute respiratory syndrome-associated coronavirus",
            "authors": [
                {
                    "first": "C.",
                    "middle": [],
                    "last": "Drosten",
                    "suffix": ""
                },
                {
                    "first": "S.",
                    "middle": [],
                    "last": "Gunther",
                    "suffix": ""
                },
                {
                    "first": "W.",
                    "middle": [],
                    "last": "Preiser",
                    "suffix": ""
                }
            ],
            "year": 2004,
            "venue": "J Clin Microbiol",
            "volume": "42",
            "issn": "",
            "pages": "2043-2047",
            "other_ids": {
                "DOI": [
                    "10.1128/JCM.42.5.2043-2047.2004"
                ]
            }
        },
        "BIBREF6": {
            "title": "Real-time reverse transcription -polymerase chain reaction assay for SARS-associated coronavirus",
            "authors": [
                {
                    "first": "S.",
                    "middle": [
                        "L."
                    ],
                    "last": "Emery",
                    "suffix": ""
                },
                {
                    "first": "D.",
                    "middle": [
                        "D."
                    ],
                    "last": "Erdman",
                    "suffix": ""
                },
                {
                    "first": "M.",
                    "middle": [
                        "D."
                    ],
                    "last": "Bowen",
                    "suffix": ""
                }
            ],
            "year": 2004,
            "venue": "Emerg Infect Dis",
            "volume": "10",
            "issn": "",
            "pages": "311-316",
            "other_ids": {
                "DOI": []
            }
        },
        "BIBREF7": {
            "title": "Quantitation of respiratory syncytial virus RNA in nasal aspirates of children by real-time RT-PCR assay",
            "authors": [
                {
                    "first": "M.",
                    "middle": [],
                    "last": "Gueudin",
                    "suffix": ""
                },
                {
                    "first": "A.",
                    "middle": [],
                    "last": "Vabret",
                    "suffix": ""
                },
                {
                    "first": "J.",
                    "middle": [],
                    "last": "Petitjean",
                    "suffix": ""
                }
            ],
            "year": 2003,
            "venue": "J Virol Methods",
            "volume": "109",
            "issn": "",
            "pages": "39-45",
            "other_ids": {
                "DOI": [
                    "10.1016/S0166-0934(03)00042-9"
                ]
            }
        },
        "BIBREF8": {
            "title": "Reverse transcriptase PCR diagnostic assay for the coronavirus associated with severe acute respiratory syndrome",
            "authors": [
                {
                    "first": "R.",
                    "middle": [
                        "K."
                    ],
                    "last": "Hui",
                    "suffix": ""
                },
                {
                    "first": "F.",
                    "middle": [],
                    "last": "Zeng",
                    "suffix": ""
                },
                {
                    "first": "C.",
                    "middle": [
                        "M."
                    ],
                    "last": "Chan",
                    "suffix": ""
                }
            ],
            "year": 2004,
            "venue": "J Clin Microbiol",
            "volume": "42",
            "issn": "",
            "pages": "1994-1999",
            "other_ids": {
                "DOI": [
                    "10.1128/JCM.42.5.1994-1999.2004"
                ]
            }
        },
        "BIBREF9": {
            "title": "A novel coronavirus associated with severe acute respiratory syndrome",
            "authors": [
                {
                    "first": "T.",
                    "middle": [
                        "G."
                    ],
                    "last": "Ksiazek",
                    "suffix": ""
                },
                {
                    "first": "D.",
                    "middle": [],
                    "last": "Erdman",
                    "suffix": ""
                },
                {
                    "first": "C.",
                    "middle": [
                        "S."
                    ],
                    "last": "Goldsmith",
                    "suffix": ""
                }
            ],
            "year": 2003,
            "venue": "N Engl J Med",
            "volume": "348",
            "issn": "",
            "pages": "1953-1966",
            "other_ids": {
                "DOI": [
                    "10.1056/NEJMoa030781"
                ]
            }
        },
        "BIBREF10": {
            "title": "Taq-Man PCR-based gene dosage assay for predictive testing in individuals from a cancer family with INK4 locus haploinsufficiency",
            "authors": [
                {
                    "first": "I.",
                    "middle": [],
                    "last": "Laurendeau",
                    "suffix": ""
                },
                {
                    "first": "M.",
                    "middle": [],
                    "last": "Bahuau",
                    "suffix": ""
                },
                {
                    "first": "N.",
                    "middle": [],
                    "last": "Vodovar",
                    "suffix": ""
                }
            ],
            "year": 1999,
            "venue": "Clin Chem",
            "volume": "45",
            "issn": "",
            "pages": "982-986",
            "other_ids": {
                "DOI": []
            }
        },
        "BIBREF11": {
            "title": "Clinical progression and viral load in a community outbreak of coronavirus-associated SARS pneumonia: a prospective study",
            "authors": [
                {
                    "first": "J.",
                    "middle": [
                        "S."
                    ],
                    "last": "Peiris",
                    "suffix": ""
                },
                {
                    "first": "C.",
                    "middle": [
                        "M."
                    ],
                    "last": "Chu",
                    "suffix": ""
                },
                {
                    "first": "V.",
                    "middle": [
                        "C."
                    ],
                    "last": "Cheng",
                    "suffix": ""
                }
            ],
            "year": 2003,
            "venue": "Lancet",
            "volume": "361",
            "issn": "",
            "pages": "1767-1772",
            "other_ids": {
                "DOI": [
                    "10.1016/S0140-6736(03)13412-5"
                ]
            }
        }
    }
}