{
    "paper_id": "PMC7108639",
    "metadata": {
        "title": "Middle East Respiratory Syndrome Coronavirus (MERS-CoV) Outbreak and National and Hospital Response in Korea",
        "authors": [
            {
                "first": "Soon-Joo",
                "middle": [],
                "last": "Wang",
                "suffix": "",
                "email": null,
                "affiliation": {}
            }
        ]
    },
    "body_text": [],
    "ref_entries": {},
    "back_matter": [],
    "bib_entries": {}
}