{
    "paper_id": "PMC5339170",
    "metadata": {
        "title": "Successful therapeutic management of canine Isosporosis in puppies",
        "authors": [
            {
                "first": "Nishiswapna",
                "middle": [],
                "last": "Garanayak",
                "suffix": "",
                "email": "littlegaranayak@gmail.com",
                "affiliation": {}
            },
            {
                "first": "A.",
                "middle": [
                    "R."
                ],
                "last": "Gupta",
                "suffix": "",
                "email": null,
                "affiliation": {}
            },
            {
                "first": "R.",
                "middle": [
                    "C."
                ],
                "last": "Patra",
                "suffix": "",
                "email": null,
                "affiliation": {}
            }
        ]
    },
    "body_text": [
        {
            "text": "Diarrhoea among the puppies is a major health hazard encountered which can affect the normal development of the animal along with immunologically compromising it for various diseases and vaccination failure (Daugschies et al. 2000). Bacterial and viral diseases are the major culprits for diarrhoea among the puppies along with some parasitic origin. Attending proper protection by scheduled vaccination and deworming, the diarrhoea incidences of infectious origin can be reduced. Among the parasitic entities responsible for puppy diarrhoea coccidial organism Isospora spp. plays a vital role. Isospora associated diarrhoea has been reported prior (Baek et al. 1993) but the clinical manifestations may be due to secondary bacterial and viral infections of the compromised gut environment (Lindsay et al. 1997; Lappin 2010; Altreuther et al. 2011).",
            "cite_spans": [
                {
                    "start": 226,
                    "end": 230,
                    "mention": "2000",
                    "ref_id": "BIBREF31"
                },
                {
                    "start": 662,
                    "end": 666,
                    "mention": "1993",
                    "ref_id": "BIBREF11"
                },
                {
                    "start": 806,
                    "end": 810,
                    "mention": "1997",
                    "ref_id": "BIBREF17"
                },
                {
                    "start": 819,
                    "end": 823,
                    "mention": "2010",
                    "ref_id": "BIBREF12"
                },
                {
                    "start": 843,
                    "end": 847,
                    "mention": "2011",
                    "ref_id": "BIBREF0"
                }
            ],
            "section": "Introduction",
            "ref_spans": []
        },
        {
            "text": "The protozoan organism Isospora belongs to the kingdom\u2014Protista, phylum\u2014Apicomplexa, class\u2014Sporozoea, Subclass\u2014Coccidia, family\u2014Eimeriidae and genus\u2014Isospora (Levine 1977).",
            "cite_spans": [
                {
                    "start": 166,
                    "end": 170,
                    "mention": "1977",
                    "ref_id": "BIBREF14"
                }
            ],
            "section": "Introduction",
            "ref_spans": []
        },
        {
            "text": "A large number of species diversity among the genus Isospora can be found along with a wide range of host organisms which includes human, primates, pig, canines and felines etc. (Levine 1988; Lindsay et al. 1997).",
            "cite_spans": [
                {
                    "start": 186,
                    "end": 190,
                    "mention": "1988",
                    "ref_id": "BIBREF15"
                },
                {
                    "start": 207,
                    "end": 211,
                    "mention": "1997",
                    "ref_id": "BIBREF17"
                }
            ],
            "section": "Introduction",
            "ref_spans": []
        },
        {
            "text": "\nI. canis and I. ohioensis complex which includes 2 additional spp. I. burrowsi, I. neorivolta are the major miscreants for canine coccidiosis. Identification of the Isospora organisms is based on the dimensions and number of sporozoites and sporocysts present in the excreted oocyst from the host animal (Dubey 1978; Lindsay et al. 1997).",
            "cite_spans": [
                {
                    "start": 312,
                    "end": 316,
                    "mention": "1978",
                    "ref_id": "BIBREF1"
                },
                {
                    "start": 333,
                    "end": 337,
                    "mention": "1997",
                    "ref_id": "BIBREF19"
                }
            ],
            "section": "Introduction",
            "ref_spans": []
        },
        {
            "text": "Young canines mostly get infected by ingestion of sporulated oocyst (Lindsay et al. 1997; Daugschies et al. 2000; Buehl et al. 2006; Dubey et al. 2009). Immune compromised puppies and stressed animals are under the enhanced risk of infection (Lappin 2010). I. canis establishes itself in the lamina propria of the posterior small intestine (Lepp and Todd 1974) resulting enteritis and mucosal damage due to schizogony and gamogony (Mitchell et al. 2007; Lappin 2010). The I. ohioensis complex infects the enterocytes in the lamina propria of small intestine, cecum, and colon of dogs resulting in villous atrophy, necrosis of apical enterocytes, and cryptitis (Dubey 1978; Dubey and Mahrt 1978; Trayser and Todd 1978).",
            "cite_spans": [
                {
                    "start": 84,
                    "end": 88,
                    "mention": "1997",
                    "ref_id": "BIBREF17"
                },
                {
                    "start": 108,
                    "end": 112,
                    "mention": "2000",
                    "ref_id": "BIBREF31"
                },
                {
                    "start": 127,
                    "end": 131,
                    "mention": "2006",
                    "ref_id": "BIBREF28"
                },
                {
                    "start": 146,
                    "end": 150,
                    "mention": "2009",
                    "ref_id": "BIBREF4"
                },
                {
                    "start": 250,
                    "end": 254,
                    "mention": "2010",
                    "ref_id": "BIBREF12"
                },
                {
                    "start": 355,
                    "end": 359,
                    "mention": "1974",
                    "ref_id": "BIBREF13"
                },
                {
                    "start": 448,
                    "end": 452,
                    "mention": "2007",
                    "ref_id": "BIBREF18"
                },
                {
                    "start": 461,
                    "end": 465,
                    "mention": "2010",
                    "ref_id": "BIBREF12"
                },
                {
                    "start": 667,
                    "end": 671,
                    "mention": "1978",
                    "ref_id": "BIBREF1"
                },
                {
                    "start": 689,
                    "end": 693,
                    "mention": "1978",
                    "ref_id": "BIBREF2"
                },
                {
                    "start": 712,
                    "end": 716,
                    "mention": "1978",
                    "ref_id": "BIBREF23"
                }
            ],
            "section": "Introduction",
            "ref_spans": []
        },
        {
            "text": "The clinical implications include watery to haemorrhagic diarrhoea along with vomition, tenesmus and inappetance. Death due to excessive dehydration has been advocated by Daugschies et al. (2000) and Lappin (2010).",
            "cite_spans": [
                {
                    "start": 190,
                    "end": 194,
                    "mention": "2000",
                    "ref_id": "BIBREF31"
                },
                {
                    "start": 208,
                    "end": 212,
                    "mention": "2010",
                    "ref_id": "BIBREF12"
                }
            ],
            "section": "Introduction",
            "ref_spans": []
        },
        {
            "text": "Diagnosis of oocyst in the faecal matter by direct smear, Sheather sugar flotation method and sedimentation method with increasing order of sensitivity has been reported (Faust et al. 1961; Current 1990).",
            "cite_spans": [
                {
                    "start": 184,
                    "end": 188,
                    "mention": "1961",
                    "ref_id": "BIBREF6"
                },
                {
                    "start": 198,
                    "end": 202,
                    "mention": "1990",
                    "ref_id": "BIBREF30"
                }
            ],
            "section": "Introduction",
            "ref_spans": []
        },
        {
            "text": "The present study deals with Isospora associated diarrhoea in four puppies and its successful management with sulphamethoxazole and trimethoprime combinations.",
            "cite_spans": [],
            "section": "Introduction",
            "ref_spans": []
        },
        {
            "text": "Four labrador male puppies of 2\u20133 month age were presented to the Teaching Veterinary clinical complex (TVCC) of College of Veterinary Science and AH, Bhubaneswar with history of anorexia, haematemesis, haematochezia for last 3 days with an average body temperature ranging from 101.8 to 102.2 \u00b0F. The puppies were vaccinated against distemper, hepatitis, parvo, parainfluenza, leptospira and corona virus following deworming with pyrantel pamoate @ 11 mg/kg body weight. Prior treatment regime of the puppies was done with Amikacin @ 10 mg/kg body weight without any clinical recovery. Faecal sample examination through direct smear method for presence of sporulated and non-sporulated oocyst of Isospora spp. was carried out which was later confirmed by flotation method (Soulsby 1986). Haematological findings of the infected animals showed haemoglobin (Hb) level as 8.6 \u00b1 0.8 g/dl and the differential count was within the normal range.",
            "cite_spans": [
                {
                    "start": 782,
                    "end": 786,
                    "mention": "1986",
                    "ref_id": "BIBREF20"
                }
            ],
            "section": "Materials and methods",
            "ref_spans": []
        },
        {
            "text": "The puppies were administered with trimethoprime and sulphamethoxazole @ 40 mg/kg body weight in combination with metronidazole @ 10 mg/kg body weight twice daily for 5 days. As supportive therapy plasma expander @ 5 ml/kg body weight for 3 days along with Ringer\u2019s Lactate @ 30 ml/kg body weight twice daily for 5 days were given. Dextrose was administerd to the puppies to provide the energy @ 0.5 mg/kg body wt. Antiemetic metoclopramide @ 0.4 mg/kg body weight and haemocoagulase etamsylate @ 250 mg twice daily was given for 2 days.",
            "cite_spans": [],
            "section": "Materials and methods",
            "ref_spans": []
        },
        {
            "text": "The direct faecal smear examination showed presence of Isospora oocyst which was confirmed by flotation method (Fig. 1) but Identification of the Isospora spp. was not confirmed. Basing on the internal anatomy of the oocyst it was concluded that both I. Canis and I. Ohioensis complex were present. History also confirmed the presence of mouse (Mus musculus) in the kennel premises which can act as the paratenic host of the infection as reported by Frenkel and Dubey (1972), Dubey (1977, 1978).\n",
            "cite_spans": [
                {
                    "start": 469,
                    "end": 473,
                    "mention": "1972",
                    "ref_id": "BIBREF8"
                },
                {
                    "start": 483,
                    "end": 487,
                    "mention": "1977",
                    "ref_id": "BIBREF32"
                },
                {
                    "start": 489,
                    "end": 493,
                    "mention": "1978",
                    "ref_id": "BIBREF1"
                }
            ],
            "section": "Result",
            "ref_spans": [
                {
                    "start": 117,
                    "end": 118,
                    "mention": "1",
                    "ref_id": "FIGREF0"
                }
            ]
        },
        {
            "text": "The clinical recovery was observed from day one of treatment with absence of blood in vomitus and stool. The consistency of stool became normal after 2\u20136 days depending up to the clinical severity. However vomition tendency remained up to 8 days in 2 pups who started taking food with no clinical signs after 10 days. The faecal samples of all the puppies were free from oocysts as an indication of clinical recovery. The haemoglobin (Hb) level fell back to normal range (11 \u00b1 0.5 g/dl) within a span of 7 days.",
            "cite_spans": [],
            "section": "Result",
            "ref_spans": []
        },
        {
            "text": "Isospora infection in puppies is the serious health concern due to its ability to spread through litter materials of kennel (Daugschies et al. 2000; Buehl et al. 2006). The infectivity of sporulated Isospora spp. oocysts can remain up to months along with the ability to resist the basic hygienic measures (Barutzki et al. 1981; Buehl et al. 2006). The infection leads to malabsorption in puppies rendering reduced vigour (Brandborg et al. 1970; Henry et al. 1974; Seah et al. 1975).",
            "cite_spans": [
                {
                    "start": 143,
                    "end": 147,
                    "mention": "2000",
                    "ref_id": "BIBREF31"
                },
                {
                    "start": 162,
                    "end": 166,
                    "mention": "2006",
                    "ref_id": "BIBREF28"
                },
                {
                    "start": 323,
                    "end": 327,
                    "mention": "1981",
                    "ref_id": "BIBREF22"
                },
                {
                    "start": 342,
                    "end": 346,
                    "mention": "2006",
                    "ref_id": "BIBREF28"
                },
                {
                    "start": 440,
                    "end": 444,
                    "mention": "1970",
                    "ref_id": "BIBREF27"
                },
                {
                    "start": 459,
                    "end": 463,
                    "mention": "1974",
                    "ref_id": "BIBREF10"
                },
                {
                    "start": 477,
                    "end": 481,
                    "mention": "1975",
                    "ref_id": "BIBREF19"
                }
            ],
            "section": "Discussion",
            "ref_spans": []
        },
        {
            "text": "Identification of the Isospora spp. by structural morphology through flotation method and its superiority over the direct smear method has already been advocated for Isosporosis determination (Faust et al. 1961; Current 1990). However identification of the organism is not confirmatory based on oocyst structure which leads to the nomenclature of I. ohioensis-like or I. ohioensis complex (Dubey et al. 1978).",
            "cite_spans": [
                {
                    "start": 206,
                    "end": 210,
                    "mention": "1961",
                    "ref_id": "BIBREF6"
                },
                {
                    "start": 220,
                    "end": 224,
                    "mention": "1990",
                    "ref_id": "BIBREF30"
                },
                {
                    "start": 403,
                    "end": 407,
                    "mention": "1978",
                    "ref_id": "BIBREF3"
                }
            ],
            "section": "Discussion",
            "ref_spans": []
        },
        {
            "text": "The recovery of the puppies by administration of trimethoprime and sulphamethoxazole along with supportive therapies and metronidazole resulted in complete clinical recovery with elimination of faecal oocyst. Similarly use of Sulfadimethoxine alone and in combination with ormetoprim has been proved effective in canines and felines (Wilkinson 1977; Dunbar and Foreyt 1985; Lindsay and Blagburn 1995). Administrations of emodepside plus toltrazuril suspension in combination with oral Amprolium have proven effectiveness against canine infection (Altreuther et al. 2011). Anti-giardial drugs like metronidazole, tinidazole, quinacrine, and furazolidone have very limited effect but metronidazole has been reported successful in some cases (Trier et al. 1974; Syrkis et al. 1975; Butler and deBoer 1981; Hallak et al. 1982; Forthal and Guest 1984; Weiss et al. 1988). The major aim of the treatment includes reduction of clinical signs along with reduction in faecal oocysts for interrupting the life cycle (Daugschies et al. 2000; Buehl et al. 2006). Supportive therapies like fluid administration are done depending on the severity of clinical signs which can enhance the recovery of the animals (Altreuther et al. 2011).",
            "cite_spans": [
                {
                    "start": 344,
                    "end": 348,
                    "mention": "1977",
                    "ref_id": "BIBREF26"
                },
                {
                    "start": 368,
                    "end": 372,
                    "mention": "1985",
                    "ref_id": "BIBREF5"
                },
                {
                    "start": 395,
                    "end": 399,
                    "mention": "1995",
                    "ref_id": "BIBREF16"
                },
                {
                    "start": 565,
                    "end": 569,
                    "mention": "2011",
                    "ref_id": "BIBREF0"
                },
                {
                    "start": 753,
                    "end": 757,
                    "mention": "1974",
                    "ref_id": "BIBREF24"
                },
                {
                    "start": 773,
                    "end": 777,
                    "mention": "1975",
                    "ref_id": "BIBREF21"
                },
                {
                    "start": 797,
                    "end": 801,
                    "mention": "1981",
                    "ref_id": "BIBREF29"
                },
                {
                    "start": 817,
                    "end": 821,
                    "mention": "1982",
                    "ref_id": "BIBREF9"
                },
                {
                    "start": 841,
                    "end": 845,
                    "mention": "1984",
                    "ref_id": "BIBREF7"
                },
                {
                    "start": 860,
                    "end": 864,
                    "mention": "1988",
                    "ref_id": "BIBREF25"
                },
                {
                    "start": 1025,
                    "end": 1029,
                    "mention": "2000",
                    "ref_id": "BIBREF31"
                },
                {
                    "start": 1044,
                    "end": 1048,
                    "mention": "2006",
                    "ref_id": "BIBREF28"
                },
                {
                    "start": 1216,
                    "end": 1220,
                    "mention": "2011",
                    "ref_id": "BIBREF0"
                }
            ],
            "section": "Discussion",
            "ref_spans": []
        },
        {
            "text": "It was concluded that the canine Isosporosis can be clinically managed by use of trimethoprime and sulphamethoxazole along with supportive therapies and metronidazole. The major concern of the treatment should include elimination of faecal oocyst for interrupting life cycle of the disease.",
            "cite_spans": [],
            "section": "Discussion",
            "ref_spans": []
        }
    ],
    "ref_entries": {
        "FIGREF0": {
            "text": "Fig.\u00a01: Oocyst of Isospora spp. from faecal smear (100\u00d7)",
            "type": "figure"
        }
    },
    "back_matter": [],
    "bib_entries": {
        "BIBREF0": {
            "title": "Efficacy of emodepside plus toltrazuril suspension (Procox\u00ae oral suspension for dogs) against prepatent and patent infection with Isospora canis and Isospora ohioensis-complex in dogs",
            "authors": [
                {
                    "first": "G",
                    "middle": [],
                    "last": "Altreuther",
                    "suffix": ""
                },
                {
                    "first": "N",
                    "middle": [],
                    "last": "Gasda",
                    "suffix": ""
                },
                {
                    "first": "I",
                    "middle": [],
                    "last": "Schroeder",
                    "suffix": ""
                },
                {
                    "first": "A",
                    "middle": [],
                    "last": "Joachim",
                    "suffix": ""
                },
                {
                    "first": "T",
                    "middle": [],
                    "last": "Settje",
                    "suffix": ""
                },
                {
                    "first": "A",
                    "middle": [],
                    "last": "Schimmel",
                    "suffix": ""
                },
                {
                    "first": "D",
                    "middle": [],
                    "last": "Hutchens",
                    "suffix": ""
                },
                {
                    "first": "KJ",
                    "middle": [],
                    "last": "Krieger",
                    "suffix": ""
                }
            ],
            "year": 2011,
            "venue": "Parasitol Res",
            "volume": "109",
            "issn": "",
            "pages": "S9-S20",
            "other_ids": {
                "DOI": [
                    "10.1007/s00436-011-2398-0"
                ]
            }
        },
        "BIBREF1": {
            "title": "Life cycle of Isospora ohioensis in dogs",
            "authors": [
                {
                    "first": "JP",
                    "middle": [],
                    "last": "Dubey",
                    "suffix": ""
                }
            ],
            "year": 1978,
            "venue": "Parasitology",
            "volume": "77",
            "issn": "",
            "pages": "1-11",
            "other_ids": {
                "DOI": [
                    "10.1017/S0031182000048654"
                ]
            }
        },
        "BIBREF2": {
            "title": "Isospora neorivolta sp. n. from the domestic dog",
            "authors": [
                {
                    "first": "JP",
                    "middle": [],
                    "last": "Dubey",
                    "suffix": ""
                },
                {
                    "first": "JL",
                    "middle": [],
                    "last": "Mahrt",
                    "suffix": ""
                }
            ],
            "year": 1978,
            "venue": "J Parasitol",
            "volume": "64",
            "issn": "",
            "pages": "1067-1073",
            "other_ids": {
                "DOI": [
                    "10.2307/3279728"
                ]
            }
        },
        "BIBREF3": {
            "title": "Canine coccidiosis attributed to an Isospora ohioensis-like organism: a case report",
            "authors": [
                {
                    "first": "JP",
                    "middle": [],
                    "last": "Dubey",
                    "suffix": ""
                },
                {
                    "first": "SE",
                    "middle": [],
                    "last": "Weisbrode",
                    "suffix": ""
                },
                {
                    "first": "WA",
                    "middle": [],
                    "last": "Rogers",
                    "suffix": ""
                }
            ],
            "year": 1978,
            "venue": "J Am Vet Med Assoc",
            "volume": "173",
            "issn": "",
            "pages": "185-191",
            "other_ids": {
                "DOI": []
            }
        },
        "BIBREF4": {
            "title": "Toxoplasmosis and other intestinal coccidial infections in cats and dogs",
            "authors": [
                {
                    "first": "JP",
                    "middle": [],
                    "last": "Dubey",
                    "suffix": ""
                },
                {
                    "first": "DS",
                    "middle": [],
                    "last": "Lindsay",
                    "suffix": ""
                },
                {
                    "first": "MR",
                    "middle": [],
                    "last": "Lappin",
                    "suffix": ""
                }
            ],
            "year": 2009,
            "venue": "Vet Clin Small Anim",
            "volume": "39",
            "issn": "",
            "pages": "1009-1034",
            "other_ids": {
                "DOI": [
                    "10.1016/j.cvsm.2009.08.001"
                ]
            }
        },
        "BIBREF5": {
            "title": "Prevention of coccidiosis in domestic dogs and captive coyotes (Canis latrans) with sulfadimethoxine\u2014ormetoprim combination",
            "authors": [
                {
                    "first": "MR",
                    "middle": [],
                    "last": "Dunbar",
                    "suffix": ""
                },
                {
                    "first": "WJ",
                    "middle": [],
                    "last": "Foreyt",
                    "suffix": ""
                }
            ],
            "year": 1985,
            "venue": "Am J Vet Res",
            "volume": "46",
            "issn": "",
            "pages": "1899-1902",
            "other_ids": {
                "DOI": []
            }
        },
        "BIBREF6": {
            "title": "Human coccidiosis in the western hemisphere",
            "authors": [
                {
                    "first": "EC",
                    "middle": [],
                    "last": "Faust",
                    "suffix": ""
                },
                {
                    "first": "LE",
                    "middle": [],
                    "last": "Giraldo",
                    "suffix": ""
                },
                {
                    "first": "G",
                    "middle": [],
                    "last": "Giraldo",
                    "suffix": ""
                },
                {
                    "first": "R",
                    "middle": [],
                    "last": "Bonfante",
                    "suffix": ""
                }
            ],
            "year": 1961,
            "venue": "Am J Trop Med Hyg",
            "volume": "10",
            "issn": "",
            "pages": "343-350",
            "other_ids": {
                "DOI": []
            }
        },
        "BIBREF7": {
            "title": "Isospora belli enteritis in three homosexual men",
            "authors": [
                {
                    "first": "D",
                    "middle": [],
                    "last": "Forthal",
                    "suffix": ""
                },
                {
                    "first": "SS",
                    "middle": [],
                    "last": "Guest",
                    "suffix": ""
                }
            ],
            "year": 1984,
            "venue": "Am J Trop Med Hyg",
            "volume": "33",
            "issn": "",
            "pages": "1060-1064",
            "other_ids": {
                "DOI": []
            }
        },
        "BIBREF8": {
            "title": "Rodents as vectors for the feline coccidia, Isospora felis and Isospora rivolta",
            "authors": [
                {
                    "first": "JK",
                    "middle": [],
                    "last": "Frenkel",
                    "suffix": ""
                },
                {
                    "first": "JP",
                    "middle": [],
                    "last": "Dubey",
                    "suffix": ""
                }
            ],
            "year": 1972,
            "venue": "J Infect Dis",
            "volume": "125",
            "issn": "",
            "pages": "69-72",
            "other_ids": {
                "DOI": [
                    "10.1093/infdis/125.1.69"
                ]
            }
        },
        "BIBREF9": {
            "title": "Malabsorption syndrome, coccidiosis, combined immune deficiency, and fulminant lymphoproliferative disease",
            "authors": [
                {
                    "first": "A",
                    "middle": [],
                    "last": "Hallak",
                    "suffix": ""
                },
                {
                    "first": "I",
                    "middle": [],
                    "last": "Yust",
                    "suffix": ""
                },
                {
                    "first": "Y",
                    "middle": [],
                    "last": "Ratan",
                    "suffix": ""
                },
                {
                    "first": "U",
                    "middle": [],
                    "last": "Adar",
                    "suffix": ""
                }
            ],
            "year": 1982,
            "venue": "Arch Intern Med",
            "volume": "142",
            "issn": "",
            "pages": "196-197",
            "other_ids": {
                "DOI": [
                    "10.1001/archinte.1982.00340140198038"
                ]
            }
        },
        "BIBREF10": {
            "title": "Intestinal coccidiosis in a patient with alpha-chain disease",
            "authors": [
                {
                    "first": "K",
                    "middle": [],
                    "last": "Henry",
                    "suffix": ""
                },
                {
                    "first": "RG",
                    "middle": [],
                    "last": "Bian",
                    "suffix": ""
                },
                {
                    "first": "WF",
                    "middle": [],
                    "last": "Doe",
                    "suffix": ""
                }
            ],
            "year": 1974,
            "venue": "Br Med J",
            "volume": "1",
            "issn": "",
            "pages": null,
            "other_ids": {
                "DOI": [
                    "10.1136/bmj.1.5907.542"
                ]
            }
        },
        "BIBREF11": {
            "title": "Studies on Isosporosis in dogs: isolation and sporulation of Isospora ohioensis",
            "authors": [
                {
                    "first": "BK",
                    "middle": [],
                    "last": "Baek",
                    "suffix": ""
                },
                {
                    "first": "CS",
                    "middle": [],
                    "last": "Kim",
                    "suffix": ""
                },
                {
                    "first": "JH",
                    "middle": [],
                    "last": "Kim",
                    "suffix": ""
                },
                {
                    "first": "KS",
                    "middle": [],
                    "last": "Han",
                    "suffix": ""
                },
                {
                    "first": "YG",
                    "middle": [],
                    "last": "Kim",
                    "suffix": ""
                }
            ],
            "year": 1993,
            "venue": "Korean J Parasitol",
            "volume": "31",
            "issn": "3",
            "pages": "201-206",
            "other_ids": {
                "DOI": [
                    "10.3347/kjp.1993.31.3.201"
                ]
            }
        },
        "BIBREF12": {
            "title": "Update on the diagnosis and management of Isospora spp. infections in dogs and cats",
            "authors": [
                {
                    "first": "MR",
                    "middle": [],
                    "last": "Lappin",
                    "suffix": ""
                }
            ],
            "year": 2010,
            "venue": "Top Companion Anim Med",
            "volume": "25",
            "issn": "",
            "pages": "133-135",
            "other_ids": {
                "DOI": [
                    "10.1053/j.tcam.2010.07.001"
                ]
            }
        },
        "BIBREF13": {
            "title": "Life cycle of Isospora canis Nemeseri, 1959 in the dog",
            "authors": [
                {
                    "first": "DL",
                    "middle": [],
                    "last": "Lepp",
                    "suffix": ""
                },
                {
                    "first": "KS",
                    "middle": [],
                    "last": "Todd",
                    "suffix": ""
                }
            ],
            "year": 1974,
            "venue": "J Protozool",
            "volume": "21",
            "issn": "",
            "pages": "199-206",
            "other_ids": {
                "DOI": [
                    "10.1111/j.1550-7408.1974.tb03641.x"
                ]
            }
        },
        "BIBREF14": {
            "title": "Nomenclature of Sarcocystis in Ox and sheep and fecal coccidian of the dog and cat",
            "authors": [
                {
                    "first": "ND",
                    "middle": [],
                    "last": "Levine",
                    "suffix": ""
                }
            ],
            "year": 1977,
            "venue": "J Parasitol",
            "volume": "63",
            "issn": "1",
            "pages": "36-51",
            "other_ids": {
                "DOI": [
                    "10.2307/3280101"
                ]
            }
        },
        "BIBREF15": {
            "title": "",
            "authors": [
                {
                    "first": "ND",
                    "middle": [],
                    "last": "Levine",
                    "suffix": ""
                }
            ],
            "year": 1988,
            "venue": "The protozoan phylum Apicomplexa",
            "volume": "",
            "issn": "",
            "pages": null,
            "other_ids": {
                "DOI": []
            }
        },
        "BIBREF16": {
            "title": "Practical treatment and control of infections caused by canine gastrointestinal parasites",
            "authors": [
                {
                    "first": "DS",
                    "middle": [],
                    "last": "Lindsay",
                    "suffix": ""
                },
                {
                    "first": "BL",
                    "middle": [],
                    "last": "Blagburn",
                    "suffix": ""
                }
            ],
            "year": 1995,
            "venue": "Vet Med",
            "volume": "89",
            "issn": "",
            "pages": "441-455",
            "other_ids": {
                "DOI": []
            }
        },
        "BIBREF17": {
            "title": "Biology of Isospora spp. from humans, nonhuman primates, and domestic animals",
            "authors": [
                {
                    "first": "DS",
                    "middle": [],
                    "last": "Lindsay",
                    "suffix": ""
                },
                {
                    "first": "JP",
                    "middle": [],
                    "last": "Dubey",
                    "suffix": ""
                },
                {
                    "first": "BL",
                    "middle": [],
                    "last": "Blagburn",
                    "suffix": ""
                }
            ],
            "year": 1997,
            "venue": "Clin Microbiol Rev",
            "volume": "10",
            "issn": "1",
            "pages": "19-34",
            "other_ids": {
                "DOI": []
            }
        },
        "BIBREF18": {
            "title": "Cystoisospora canis Nemes\u00e9ri, 1959 (syn. Isospora canis), infections in dogs: clinical signs, pathogenesis, and reproducible clinical disease in Beagle dogs fed oocysts",
            "authors": [
                {
                    "first": "SM",
                    "middle": [],
                    "last": "Mitchell",
                    "suffix": ""
                },
                {
                    "first": "AM",
                    "middle": [],
                    "last": "Zajac",
                    "suffix": ""
                },
                {
                    "first": "S",
                    "middle": [],
                    "last": "Charles",
                    "suffix": ""
                },
                {
                    "first": "RB",
                    "middle": [],
                    "last": "Duncan",
                    "suffix": ""
                },
                {
                    "first": "DS",
                    "middle": [],
                    "last": "Lindsay",
                    "suffix": ""
                }
            ],
            "year": 2007,
            "venue": "J Parasitol",
            "volume": "93",
            "issn": "",
            "pages": "345-352",
            "other_ids": {
                "DOI": [
                    "10.1645/GE-1024R.1"
                ]
            }
        },
        "BIBREF19": {
            "title": "Dogs and intestinal parasites: a public health problem",
            "authors": [
                {
                    "first": "SKK",
                    "middle": [],
                    "last": "Seah",
                    "suffix": ""
                },
                {
                    "first": "G",
                    "middle": [],
                    "last": "Hucal",
                    "suffix": ""
                },
                {
                    "first": "C",
                    "middle": [],
                    "last": "Law",
                    "suffix": ""
                }
            ],
            "year": 1975,
            "venue": "CMA J",
            "volume": "112",
            "issn": "",
            "pages": "1191-1194",
            "other_ids": {
                "DOI": []
            }
        },
        "BIBREF20": {
            "title": "",
            "authors": [],
            "year": null,
            "venue": "",
            "volume": "",
            "issn": "",
            "pages": null,
            "other_ids": {
                "DOI": []
            }
        },
        "BIBREF21": {
            "title": "A case of severe human coccidiosis in Israel",
            "authors": [
                {
                    "first": "I",
                    "middle": [],
                    "last": "Syrkis",
                    "suffix": ""
                },
                {
                    "first": "M",
                    "middle": [],
                    "last": "Fried",
                    "suffix": ""
                },
                {
                    "first": "I",
                    "middle": [],
                    "last": "Elian",
                    "suffix": ""
                },
                {
                    "first": "D",
                    "middle": [],
                    "last": "Pietrushka",
                    "suffix": ""
                },
                {
                    "first": "J",
                    "middle": [],
                    "last": "Lengy",
                    "suffix": ""
                }
            ],
            "year": 1975,
            "venue": "Isr J Med Sci",
            "volume": "11",
            "issn": "",
            "pages": "373-377",
            "other_ids": {
                "DOI": []
            }
        },
        "BIBREF22": {
            "title": "M\u00f6glichkeiten der Desinfektion bei Kokzidiose (Eimeria, Isospora, Toxoplasma, Sarcocystis)",
            "authors": [
                {
                    "first": "D",
                    "middle": [],
                    "last": "Barutzki",
                    "suffix": ""
                },
                {
                    "first": "M",
                    "middle": [],
                    "last": "Erber",
                    "suffix": ""
                },
                {
                    "first": "J",
                    "middle": [],
                    "last": "Boch",
                    "suffix": ""
                }
            ],
            "year": 1981,
            "venue": "Berl M\u00fcnch Tier\u00e4rztl Wochenschr",
            "volume": "94",
            "issn": "",
            "pages": "451-454",
            "other_ids": {
                "DOI": []
            }
        },
        "BIBREF23": {
            "title": "Life cycle of Isospora burrowsi n sp (Protozoa: Eimeriidae) from the dog Canis familiaris",
            "authors": [
                {
                    "first": "CV",
                    "middle": [],
                    "last": "Trayser",
                    "suffix": ""
                },
                {
                    "first": "KS",
                    "middle": [],
                    "last": "Todd",
                    "suffix": ""
                }
            ],
            "year": 1978,
            "venue": "Am J Vet Res",
            "volume": "39",
            "issn": "",
            "pages": "95-98",
            "other_ids": {
                "DOI": []
            }
        },
        "BIBREF24": {
            "title": "Chronic intestinal coccidiosis in man: intestinal morphology and response to treatment",
            "authors": [
                {
                    "first": "JS",
                    "middle": [],
                    "last": "Trier",
                    "suffix": ""
                },
                {
                    "first": "PC",
                    "middle": [],
                    "last": "Moxey",
                    "suffix": ""
                },
                {
                    "first": "EM",
                    "middle": [],
                    "last": "Schimmel",
                    "suffix": ""
                },
                {
                    "first": "E",
                    "middle": [],
                    "last": "Robles",
                    "suffix": ""
                }
            ],
            "year": 1974,
            "venue": "Gastroenterology",
            "volume": "66",
            "issn": "",
            "pages": "923-935",
            "other_ids": {
                "DOI": []
            }
        },
        "BIBREF25": {
            "title": "Isospora belli infection: treatment with pyrimethamine",
            "authors": [
                {
                    "first": "LM",
                    "middle": [],
                    "last": "Weiss",
                    "suffix": ""
                },
                {
                    "first": "DC",
                    "middle": [],
                    "last": "Perlman",
                    "suffix": ""
                },
                {
                    "first": "J",
                    "middle": [],
                    "last": "Sherman",
                    "suffix": ""
                },
                {
                    "first": "H",
                    "middle": [],
                    "last": "Tanowitz",
                    "suffix": ""
                },
                {
                    "first": "M",
                    "middle": [],
                    "last": "Wittner",
                    "suffix": ""
                }
            ],
            "year": 1988,
            "venue": "Ann Intern Med",
            "volume": "109",
            "issn": "",
            "pages": "474-475",
            "other_ids": {
                "DOI": [
                    "10.7326/0003-4819-109-6-474"
                ]
            }
        },
        "BIBREF26": {
            "title": "Coccidial infection in a cat colony",
            "authors": [
                {
                    "first": "GT",
                    "middle": [],
                    "last": "Wilkinson",
                    "suffix": ""
                }
            ],
            "year": 1977,
            "venue": "Vet Rec",
            "volume": "100",
            "issn": "",
            "pages": "156-157",
            "other_ids": {
                "DOI": [
                    "10.1136/vr.100.8.156"
                ]
            }
        },
        "BIBREF27": {
            "title": "Human coccidiosis\u2014a possible cause of malabsorption",
            "authors": [
                {
                    "first": "LL",
                    "middle": [],
                    "last": "Brandborg",
                    "suffix": ""
                },
                {
                    "first": "SB",
                    "middle": [],
                    "last": "Goldrerg",
                    "suffix": ""
                },
                {
                    "first": "WC",
                    "middle": [],
                    "last": "Breedenback",
                    "suffix": ""
                }
            ],
            "year": 1970,
            "venue": "N Engl J Med",
            "volume": "283",
            "issn": "",
            "pages": null,
            "other_ids": {
                "DOI": [
                    "10.1056/NEJM197012102832403"
                ]
            }
        },
        "BIBREF28": {
            "title": "Canine Isosporosis\u2014epidemiology of field and experimental infections",
            "authors": [
                {
                    "first": "IE",
                    "middle": [],
                    "last": "Buehl",
                    "suffix": ""
                },
                {
                    "first": "H",
                    "middle": [],
                    "last": "Prosl",
                    "suffix": ""
                },
                {
                    "first": "HC",
                    "middle": [],
                    "last": "Mundt",
                    "suffix": ""
                },
                {
                    "first": "AG",
                    "middle": [],
                    "last": "Tichy",
                    "suffix": ""
                },
                {
                    "first": "A",
                    "middle": [],
                    "last": "Joachim",
                    "suffix": ""
                }
            ],
            "year": 2006,
            "venue": "J Vet Med B",
            "volume": "53",
            "issn": "",
            "pages": "482-487",
            "other_ids": {
                "DOI": [
                    "10.1111/j.1439-0450.2006.00973.x"
                ]
            }
        },
        "BIBREF29": {
            "title": "Isospora belli infection in Australia",
            "authors": [
                {
                    "first": "T",
                    "middle": [],
                    "last": "Butler",
                    "suffix": ""
                },
                {
                    "first": "WGR",
                    "middle": [],
                    "last": "deBoer",
                    "suffix": ""
                }
            ],
            "year": 1981,
            "venue": "Pathology",
            "volume": "13",
            "issn": "",
            "pages": "593-595",
            "other_ids": {
                "DOI": [
                    "10.3109/00313028109059077"
                ]
            }
        },
        "BIBREF30": {
            "title": "Techniques and laboratory maintenance of Cryptosporidium",
            "authors": [
                {
                    "first": "WL",
                    "middle": [],
                    "last": "Current",
                    "suffix": ""
                }
            ],
            "year": 1990,
            "venue": "Cryptosporidiosis of man and animals",
            "volume": "",
            "issn": "",
            "pages": "31-49",
            "other_ids": {
                "DOI": []
            }
        },
        "BIBREF31": {
            "title": "Toltrazuril treatment of cystisosporosis in dogs under experimental and field conditions",
            "authors": [
                {
                    "first": "A",
                    "middle": [],
                    "last": "Daugschies",
                    "suffix": ""
                },
                {
                    "first": "HC",
                    "middle": [],
                    "last": "Mundt",
                    "suffix": ""
                },
                {
                    "first": "V",
                    "middle": [],
                    "last": "Letkova",
                    "suffix": ""
                }
            ],
            "year": 2000,
            "venue": "Parasitol Res",
            "volume": "86",
            "issn": "",
            "pages": "797-799",
            "other_ids": {
                "DOI": [
                    "10.1007/s004360000217"
                ]
            }
        },
        "BIBREF32": {
            "title": "Toxoplasma, Hammondia, Besnoitia, Sarcocystis, and other tissue cyst-forming coccidia of man and animals",
            "authors": [
                {
                    "first": "JP",
                    "middle": [],
                    "last": "Dubey",
                    "suffix": ""
                }
            ],
            "year": 1977,
            "venue": "Parasitic protozoa",
            "volume": "",
            "issn": "",
            "pages": "101-237",
            "other_ids": {
                "DOI": []
            }
        }
    }
}