{
    "paper_id": "PMC7088788",
    "metadata": {
        "title": "Learn to fight from the war",
        "authors": [
            {
                "first": "GuoPing",
                "middle": [],
                "last": "Zhao",
                "suffix": "",
                "email": "gpzhao@sibs.ac.cn",
                "affiliation": {}
            },
            {
                "first": "Yang",
                "middle": [],
                "last": "Zhong",
                "suffix": "",
                "email": "yangzhong@fudan.edu.cn",
                "affiliation": {}
            }
        ]
    },
    "body_text": [],
    "ref_entries": {},
    "back_matter": [],
    "bib_entries": {}
}