{
    "paper_id": "PMC7122146",
    "metadata": {
        "title": "Genetics and Severe Sepsis",
        "authors": [
            {
                "first": "Edward",
                "middle": [],
                "last": "Abraham",
                "suffix": "",
                "email": null,
                "affiliation": {}
            },
            {
                "first": "Mervyn",
                "middle": [],
                "last": "Singer",
                "suffix": "",
                "email": null,
                "affiliation": {}
            },
            {
                "first": "J.",
                "middle": [],
                "last": "Texereau",
                "suffix": "",
                "email": null,
                "affiliation": {}
            },
            {
                "first": "V.",
                "middle": [],
                "last": "Lemiale",
                "suffix": "",
                "email": null,
                "affiliation": {}
            },
            {
                "first": "J.",
                "middle": [
                    "-P."
                ],
                "last": "Mira",
                "suffix": "",
                "email": null,
                "affiliation": {}
            }
        ]
    },
    "body_text": [],
    "ref_entries": {},
    "back_matter": [],
    "bib_entries": {
        "BIBREF0": {
            "title": "The epidemiology of sepsis in the United States from 1979 through 2000",
            "authors": [
                {
                    "first": "G.S.",
                    "middle": [],
                    "last": "Martin",
                    "suffix": ""
                },
                {
                    "first": "D.M.",
                    "middle": [],
                    "last": "Mannino",
                    "suffix": ""
                },
                {
                    "first": "S.",
                    "middle": [],
                    "last": "Eaton",
                    "suffix": ""
                },
                {
                    "first": "M.",
                    "middle": [],
                    "last": "Moss",
                    "suffix": ""
                }
            ],
            "year": 2003,
            "venue": "N Engl J Med",
            "volume": "348",
            "issn": "",
            "pages": "1546-1554",
            "other_ids": {
                "DOI": [
                    "10.1056/NEJMoa022139"
                ]
            }
        },
        "BIBREF1": {
            "title": "Genetics of infectious diseases",
            "authors": [
                {
                    "first": "A.J.",
                    "middle": [],
                    "last": "Frodsham",
                    "suffix": ""
                },
                {
                    "first": "A.V.",
                    "middle": [],
                    "last": "Hill",
                    "suffix": ""
                }
            ],
            "year": 2004,
            "venue": "Hum Mol Genet",
            "volume": "13",
            "issn": "",
            "pages": "R187-194",
            "other_ids": {
                "DOI": [
                    "10.1093/hmg/ddh225"
                ]
            }
        },
        "BIBREF2": {
            "title": "Genetic resistance tomalaria in mouse models",
            "authors": [
                {
                    "first": "M.",
                    "middle": [],
                    "last": "Hernandez-Valladares",
                    "suffix": ""
                },
                {
                    "first": "J.",
                    "middle": [],
                    "last": "Naessens",
                    "suffix": ""
                },
                {
                    "first": "F.A.",
                    "middle": [],
                    "last": "Iraqi",
                    "suffix": ""
                }
            ],
            "year": 2005,
            "venue": "Trends Parasitol",
            "volume": "21",
            "issn": "",
            "pages": "352-355",
            "other_ids": {
                "DOI": [
                    "10.1016/j.pt.2005.06.010"
                ]
            }
        },
        "BIBREF3": {
            "title": "Genetic contribution to the septic response in a mouse model",
            "authors": [
                {
                    "first": "D.",
                    "middle": [],
                    "last": "Stewart",
                    "suffix": ""
                },
                {
                    "first": "W.B.",
                    "middle": [],
                    "last": "Fulton",
                    "suffix": ""
                },
                {
                    "first": "C.",
                    "middle": [],
                    "last": "Wilson",
                    "suffix": ""
                }
            ],
            "year": 2002,
            "venue": "Shock",
            "volume": "18",
            "issn": "",
            "pages": "342-347",
            "other_ids": {
                "DOI": [
                    "10.1097/00024382-200210000-00009"
                ]
            }
        },
        "BIBREF4": {
            "title": "Toll-like receptor 2 mediates Staphylococcus aureus-induced myocardial dysfunction and cytokine production in the heart",
            "authors": [
                {
                    "first": "P.",
                    "middle": [],
                    "last": "Knuefermann",
                    "suffix": ""
                },
                {
                    "first": "Y.",
                    "middle": [],
                    "last": "Sakata",
                    "suffix": ""
                },
                {
                    "first": "J.S.",
                    "middle": [],
                    "last": "Baker",
                    "suffix": ""
                }
            ],
            "year": 2004,
            "venue": "Circulation",
            "volume": "110",
            "issn": "",
            "pages": "3693-3698",
            "other_ids": {
                "DOI": [
                    "10.1161/01.CIR.0000143081.13042.04"
                ]
            }
        },
        "BIBREF5": {
            "title": "Differential roles of TLR2 and TLR4 in recognition of gram-negative and gram-positive bacterial cell wall components",
            "authors": [
                {
                    "first": "O.",
                    "middle": [],
                    "last": "Takeuchi",
                    "suffix": ""
                },
                {
                    "first": "K.",
                    "middle": [],
                    "last": "Hoshino",
                    "suffix": ""
                },
                {
                    "first": "T.",
                    "middle": [],
                    "last": "Kawai",
                    "suffix": ""
                }
            ],
            "year": 1999,
            "venue": "Immunity",
            "volume": "11",
            "issn": "",
            "pages": "443-451",
            "other_ids": {
                "DOI": [
                    "10.1016/S1074-7613(00)80119-3"
                ]
            }
        },
        "BIBREF6": {
            "title": "Toll-like receptor 2-deficient mice succumb to Mycobacterium tuberculosis infection",
            "authors": [
                {
                    "first": "M.B.",
                    "middle": [],
                    "last": "Drennan",
                    "suffix": ""
                },
                {
                    "first": "D.",
                    "middle": [],
                    "last": "Nicolle",
                    "suffix": ""
                },
                {
                    "first": "V.J.",
                    "middle": [],
                    "last": "Quesniaux",
                    "suffix": ""
                }
            ],
            "year": 2004,
            "venue": "Am J Pathol",
            "volume": "164",
            "issn": "",
            "pages": "49-57",
            "other_ids": {
                "DOI": []
            }
        },
        "BIBREF7": {
            "title": "Toll-like receptor 2 Arg677Trp polymorphism is associated with susceptibility to tuberculosis in Tunisian patients",
            "authors": [
                {
                    "first": "M.",
                    "middle": [],
                    "last": "Ben-Ali",
                    "suffix": ""
                },
                {
                    "first": "M.R.",
                    "middle": [],
                    "last": "Barbouche",
                    "suffix": ""
                },
                {
                    "first": "S.",
                    "middle": [],
                    "last": "Bousnina",
                    "suffix": ""
                },
                {
                    "first": "A.",
                    "middle": [],
                    "last": "Chabbou",
                    "suffix": ""
                },
                {
                    "first": "K.",
                    "middle": [],
                    "last": "Dellagi",
                    "suffix": ""
                }
            ],
            "year": 2004,
            "venue": "Clin Diagn Lab Immunol",
            "volume": "11",
            "issn": "",
            "pages": "625-626",
            "other_ids": {
                "DOI": [
                    "10.1128/CDLI.11.3.625-626.2004"
                ]
            }
        },
        "BIBREF8": {
            "title": "Cutting edge: a Toll-like receptor 2 polymorphism that is associated with lepromatous leprosy is unable to mediate mycobacterial signaling",
            "authors": [
                {
                    "first": "P.Y.",
                    "middle": [],
                    "last": "Bochud",
                    "suffix": ""
                },
                {
                    "first": "T.R.",
                    "middle": [],
                    "last": "Hawn",
                    "suffix": ""
                },
                {
                    "first": "A.",
                    "middle": [],
                    "last": "Aderem",
                    "suffix": ""
                }
            ],
            "year": 2003,
            "venue": "J Immunol",
            "volume": "170",
            "issn": "",
            "pages": "3451-3454",
            "other_ids": {
                "DOI": []
            }
        },
        "BIBREF9": {
            "title": "Detection of Toll-like receptor 2 (TLR2)mutation in the lepromatous leprosy patients",
            "authors": [
                {
                    "first": "T.J.",
                    "middle": [],
                    "last": "Kang",
                    "suffix": ""
                },
                {
                    "first": "G.T.",
                    "middle": [],
                    "last": "Chae",
                    "suffix": ""
                }
            ],
            "year": 2001,
            "venue": "FEMS Immunol Med Microbiol",
            "volume": "31",
            "issn": "",
            "pages": "53-58",
            "other_ids": {
                "DOI": [
                    "10.1111/j.1574-695X.2001.tb01586.x"
                ]
            }
        },
        "BIBREF10": {
            "title": "A novel polymorphism in the toll-like receptor 2 gene and its potential association with staphylococcal infection",
            "authors": [
                {
                    "first": "E.",
                    "middle": [],
                    "last": "Lorenz",
                    "suffix": ""
                },
                {
                    "first": "J.P.",
                    "middle": [],
                    "last": "Mira",
                    "suffix": ""
                },
                {
                    "first": "K.L.",
                    "middle": [],
                    "last": "Cornish",
                    "suffix": ""
                },
                {
                    "first": "N.C.",
                    "middle": [],
                    "last": "Arbour",
                    "suffix": ""
                },
                {
                    "first": "D.A.",
                    "middle": [],
                    "last": "Schwartz",
                    "suffix": ""
                }
            ],
            "year": 2000,
            "venue": "Infect Immun",
            "volume": "68",
            "issn": "",
            "pages": "6398-6401",
            "other_ids": {
                "DOI": [
                    "10.1128/IAI.68.11.6398-6401.2000"
                ]
            }
        },
        "BIBREF11": {
            "title": "Epidemiology of sepsis and infection in ICU patients from an international multicentre cohort study",
            "authors": [
                {
                    "first": "C.",
                    "middle": [],
                    "last": "Alberti",
                    "suffix": ""
                },
                {
                    "first": "C.",
                    "middle": [],
                    "last": "Brun-Buisson",
                    "suffix": ""
                },
                {
                    "first": "H.",
                    "middle": [],
                    "last": "Burchardi",
                    "suffix": ""
                }
            ],
            "year": 2002,
            "venue": "Intensive Care Med",
            "volume": "28",
            "issn": "",
            "pages": "108-121",
            "other_ids": {
                "DOI": [
                    "10.1007/s00134-001-1143-z"
                ]
            }
        },
        "BIBREF12": {
            "title": "The Arg753GLn polymorphism of the human toll-like receptor 2 gene in tuberculosis disease",
            "authors": [
                {
                    "first": "A.C.",
                    "middle": [],
                    "last": "Ogus",
                    "suffix": ""
                },
                {
                    "first": "B.",
                    "middle": [],
                    "last": "Yoldas",
                    "suffix": ""
                },
                {
                    "first": "T.",
                    "middle": [],
                    "last": "Ozdemir",
                    "suffix": ""
                }
            ],
            "year": 2004,
            "venue": "Eur Respir J",
            "volume": "23",
            "issn": "",
            "pages": "219-223",
            "other_ids": {
                "DOI": [
                    "10.1183/09031936.03.00061703"
                ]
            }
        },
        "BIBREF13": {
            "title": "Dizygotic twins discordant for early-onset Citrobacter koseri and group B streptococcal sepsis",
            "authors": [
                {
                    "first": "W.J.",
                    "middle": [],
                    "last": "Lin",
                    "suffix": ""
                },
                {
                    "first": "C.C.",
                    "middle": [],
                    "last": "Wang",
                    "suffix": ""
                },
                {
                    "first": "W.T.",
                    "middle": [],
                    "last": "Lo",
                    "suffix": ""
                },
                {
                    "first": "M.L.",
                    "middle": [],
                    "last": "Chu",
                    "suffix": ""
                },
                {
                    "first": "C.M.",
                    "middle": [],
                    "last": "Lee",
                    "suffix": ""
                }
            ],
            "year": 2005,
            "venue": "J Formos Med Assoc",
            "volume": "104",
            "issn": "",
            "pages": "367-369",
            "other_ids": {
                "DOI": []
            }
        },
        "BIBREF14": {
            "title": "Helicobacter pylori infection: genetic and environmental influences. A study of twins",
            "authors": [
                {
                    "first": "H.M.",
                    "middle": [],
                    "last": "Malaty",
                    "suffix": ""
                },
                {
                    "first": "L.",
                    "middle": [],
                    "last": "Engstrand",
                    "suffix": ""
                },
                {
                    "first": "N.L.",
                    "middle": [],
                    "last": "Pedersen",
                    "suffix": ""
                },
                {
                    "first": "D.Y.",
                    "middle": [],
                    "last": "Graham",
                    "suffix": ""
                }
            ],
            "year": 1994,
            "venue": "Ann Intern Med",
            "volume": "120",
            "issn": "",
            "pages": "982-986",
            "other_ids": {
                "DOI": []
            }
        },
        "BIBREF15": {
            "title": "The collection of 300 twin index cases for a study of tuberculosis in twins and their families",
            "authors": [
                {
                    "first": "B.",
                    "middle": [],
                    "last": "Simonds",
                    "suffix": ""
                }
            ],
            "year": 1957,
            "venue": "Acta Genet Stat Med",
            "volume": "7",
            "issn": "",
            "pages": "42-47",
            "other_ids": {
                "DOI": []
            }
        },
        "BIBREF16": {
            "title": "Genetic and environmental influences on premature death in adult adoptees",
            "authors": [
                {
                    "first": "T.I.",
                    "middle": [],
                    "last": "Sorensen",
                    "suffix": ""
                },
                {
                    "first": "G.G.",
                    "middle": [],
                    "last": "Nielsen",
                    "suffix": ""
                },
                {
                    "first": "P.K.",
                    "middle": [],
                    "last": "Andersen",
                    "suffix": ""
                },
                {
                    "first": "T.W.",
                    "middle": [],
                    "last": "Teasdale",
                    "suffix": ""
                }
            ],
            "year": 1988,
            "venue": "N Engl J Med",
            "volume": "318",
            "issn": "",
            "pages": "727-732",
            "other_ids": {
                "DOI": [
                    "10.1056/NEJM198803243181202"
                ]
            }
        },
        "BIBREF17": {
            "title": "Can single nucleotide polymorphisms in innate immune receptors predict development of septic complications in intensive care unit patients?",
            "authors": [
                {
                    "first": "J.E.",
                    "middle": [],
                    "last": "Wang",
                    "suffix": ""
                }
            ],
            "year": 2005,
            "venue": "Crit Care Med",
            "volume": "33",
            "issn": "",
            "pages": "695-696",
            "other_ids": {
                "DOI": [
                    "10.1097/01.CCM.0000155998.92099.C2"
                ]
            }
        },
        "BIBREF18": {
            "title": "Influence of Fcgamma RIIA and MBL polymorphisms on severe acute respiratory syndrome",
            "authors": [
                {
                    "first": "F.F.",
                    "middle": [],
                    "last": "Yuan",
                    "suffix": ""
                },
                {
                    "first": "J.",
                    "middle": [],
                    "last": "Tanner",
                    "suffix": ""
                },
                {
                    "first": "P.K.",
                    "middle": [],
                    "last": "Chan",
                    "suffix": ""
                }
            ],
            "year": 2005,
            "venue": "Tissue Antigens",
            "volume": "66",
            "issn": "",
            "pages": "291-296",
            "other_ids": {
                "DOI": [
                    "10.1111/j.1399-0039.2005.00476.x"
                ]
            }
        },
        "BIBREF19": {
            "title": "Heritable defects of the human TLR signalling pathways",
            "authors": [
                {
                    "first": "A.",
                    "middle": [],
                    "last": "Puel",
                    "suffix": ""
                },
                {
                    "first": "K.",
                    "middle": [],
                    "last": "Yang",
                    "suffix": ""
                },
                {
                    "first": "C.L.",
                    "middle": [],
                    "last": "Ku",
                    "suffix": ""
                }
            ],
            "year": 2005,
            "venue": "J Endotoxin Res",
            "volume": "11",
            "issn": "",
            "pages": "220-224",
            "other_ids": {
                "DOI": [
                    "10.1179/096805105X37367"
                ]
            }
        },
        "BIBREF20": {
            "title": "Novel primary immunodeficiencies",
            "authors": [
                {
                    "first": "C.",
                    "middle": [],
                    "last": "Picard",
                    "suffix": ""
                },
                {
                    "first": "J.L.",
                    "middle": [],
                    "last": "Casanova",
                    "suffix": ""
                }
            ],
            "year": 2005,
            "venue": "Adv Exp Med Biol",
            "volume": "568",
            "issn": "",
            "pages": "89-99",
            "other_ids": {
                "DOI": [
                    "10.1007/0-387-25342-4_6"
                ]
            }
        },
        "BIBREF21": {
            "title": "Immunological investigations in children with recurrent respiratory infections",
            "authors": [
                {
                    "first": "E.",
                    "middle": [],
                    "last": "de Vries",
                    "suffix": ""
                }
            ],
            "year": 2001,
            "venue": "Paediatr Respir Rev",
            "volume": "2",
            "issn": "",
            "pages": "32-36",
            "other_ids": {
                "DOI": [
                    "10.1053/prrv.2000.0099"
                ]
            }
        },
        "BIBREF22": {
            "title": "Epidemiology of severe sepsis in the United States: analysis of incidence, outcome, and associated costs of care",
            "authors": [
                {
                    "first": "D.C.",
                    "middle": [],
                    "last": "Angus",
                    "suffix": ""
                },
                {
                    "first": "W.T.",
                    "middle": [],
                    "last": "Linde-Zwirble",
                    "suffix": ""
                },
                {
                    "first": "J.",
                    "middle": [],
                    "last": "Lidicker",
                    "suffix": ""
                },
                {
                    "first": "G.",
                    "middle": [],
                    "last": "Clermont",
                    "suffix": ""
                },
                {
                    "first": "J.",
                    "middle": [],
                    "last": "Carcillo",
                    "suffix": ""
                },
                {
                    "first": "M.R.",
                    "middle": [],
                    "last": "Pinsky",
                    "suffix": ""
                }
            ],
            "year": 2001,
            "venue": "Crit Care Med",
            "volume": "29",
            "issn": "",
            "pages": "1303-1310",
            "other_ids": {
                "DOI": [
                    "10.1097/00003246-200107000-00002"
                ]
            }
        },
        "BIBREF23": {
            "title": "Molecular defects in T-and B-cell primary immunodeficiency diseases",
            "authors": [
                {
                    "first": "C.",
                    "middle": [],
                    "last": "Cunningham-Rundles",
                    "suffix": ""
                },
                {
                    "first": "P.P.",
                    "middle": [],
                    "last": "Ponda",
                    "suffix": ""
                }
            ],
            "year": 2005,
            "venue": "Nat Rev Immunol",
            "volume": "5",
            "issn": "",
            "pages": "880-892",
            "other_ids": {
                "DOI": [
                    "10.1038/nri1713"
                ]
            }
        },
        "BIBREF24": {
            "title": "From idiopathic infectious diseases to novel primary immunodeficiencies",
            "authors": [
                {
                    "first": "J.L.",
                    "middle": [],
                    "last": "Casanova",
                    "suffix": ""
                },
                {
                    "first": "C.",
                    "middle": [],
                    "last": "Fieschi",
                    "suffix": ""
                },
                {
                    "first": "J.",
                    "middle": [],
                    "last": "Bustamante",
                    "suffix": ""
                }
            ],
            "year": 2005,
            "venue": "J Allergy Clin Immunol",
            "volume": "116",
            "issn": "",
            "pages": "426-430",
            "other_ids": {
                "DOI": [
                    "10.1016/j.jaci.2005.03.053"
                ]
            }
        },
        "BIBREF25": {
            "title": "Genetic dissection of immunity to mycobacteria: the human model",
            "authors": [
                {
                    "first": "J.L.",
                    "middle": [],
                    "last": "Casanova",
                    "suffix": ""
                },
                {
                    "first": "L.",
                    "middle": [],
                    "last": "Abel",
                    "suffix": ""
                }
            ],
            "year": 2002,
            "venue": "Annu Rev Immunol",
            "volume": "20",
            "issn": "",
            "pages": "581-620",
            "other_ids": {
                "DOI": [
                    "10.1146/annurev.immunol.20.081501.125851"
                ]
            }
        },
        "BIBREF26": {
            "title": "Cystic fibrosis",
            "authors": [
                {
                    "first": "S.M.",
                    "middle": [],
                    "last": "Rowe",
                    "suffix": ""
                },
                {
                    "first": "S.",
                    "middle": [],
                    "last": "Miller",
                    "suffix": ""
                },
                {
                    "first": "E.J.",
                    "middle": [],
                    "last": "Sorscher",
                    "suffix": ""
                }
            ],
            "year": 2005,
            "venue": "N Engl J Med",
            "volume": "352",
            "issn": "",
            "pages": "1992-2001",
            "other_ids": {
                "DOI": [
                    "10.1056/NEJMra043184"
                ]
            }
        },
        "BIBREF27": {
            "title": "Genetic modifiers of lung disease in cystic fibrosis",
            "authors": [
                {
                    "first": "M.L.",
                    "middle": [],
                    "last": "Drumm",
                    "suffix": ""
                },
                {
                    "first": "M.W.",
                    "middle": [],
                    "last": "Konstan",
                    "suffix": ""
                },
                {
                    "first": "M.D.",
                    "middle": [],
                    "last": "Schluchter",
                    "suffix": ""
                }
            ],
            "year": 2005,
            "venue": "N Engl J Med",
            "volume": "353",
            "issn": "",
            "pages": "1443-1453",
            "other_ids": {
                "DOI": [
                    "10.1056/NEJMoa051469"
                ]
            }
        },
        "BIBREF28": {
            "title": "Genetic approaches to studying common diseases and complex traits",
            "authors": [
                {
                    "first": "J.N.",
                    "middle": [],
                    "last": "Hirschhorn",
                    "suffix": ""
                }
            ],
            "year": 2005,
            "venue": "Pediatr Res",
            "volume": "57",
            "issn": "",
            "pages": "74R-77R",
            "other_ids": {
                "DOI": [
                    "10.1203/01.PDR.0000159574.98964.87"
                ]
            }
        },
        "BIBREF29": {
            "title": "Key concepts in genetic epidemiology",
            "authors": [
                {
                    "first": "P.R.",
                    "middle": [],
                    "last": "Burton",
                    "suffix": ""
                },
                {
                    "first": "M.D.",
                    "middle": [],
                    "last": "Tobin",
                    "suffix": ""
                },
                {
                    "first": "J.L.",
                    "middle": [],
                    "last": "Hopper",
                    "suffix": ""
                }
            ],
            "year": 2005,
            "venue": "Lancet",
            "volume": "366",
            "issn": "",
            "pages": "941-951",
            "other_ids": {
                "DOI": [
                    "10.1016/S0140-6736(05)67322-9"
                ]
            }
        },
        "BIBREF30": {
            "title": "Proposed guidelines for papers describing DNA polymorphism-disease associations",
            "authors": [
                {
                    "first": "D.N.",
                    "middle": [],
                    "last": "Cooper",
                    "suffix": ""
                },
                {
                    "first": "R.L.",
                    "middle": [],
                    "last": "Nussbaum",
                    "suffix": ""
                },
                {
                    "first": "M.",
                    "middle": [],
                    "last": "Krawczak",
                    "suffix": ""
                }
            ],
            "year": 2002,
            "venue": "Hum Genet",
            "volume": "110",
            "issn": "",
            "pages": "207-208",
            "other_ids": {
                "DOI": [
                    "10.1007/s00439-001-0672-4"
                ]
            }
        },
        "BIBREF31": {
            "title": "What makes a good genetic association study?",
            "authors": [
                {
                    "first": "A.T.",
                    "middle": [],
                    "last": "Hattersley",
                    "suffix": ""
                },
                {
                    "first": "M.I.",
                    "middle": [],
                    "last": "McCarthy",
                    "suffix": ""
                }
            ],
            "year": 2005,
            "venue": "Lancet",
            "volume": "366",
            "issn": "",
            "pages": "1315-1323",
            "other_ids": {
                "DOI": [
                    "10.1016/S0140-6736(05)67531-9"
                ]
            }
        },
        "BIBREF32": {
            "title": "Assessing the quality of case-control association studies on the genetic basis of sepsis",
            "authors": [
                {
                    "first": "S.H.",
                    "middle": [],
                    "last": "Vitali",
                    "suffix": ""
                },
                {
                    "first": "A.G.",
                    "middle": [],
                    "last": "Randolph",
                    "suffix": ""
                }
            ],
            "year": 2005,
            "venue": "Pediatr Crit Care Med",
            "volume": "6",
            "issn": "",
            "pages": "S74-77",
            "other_ids": {
                "DOI": [
                    "10.1097/01.PCC.0000161572.12676.91"
                ]
            }
        },
        "BIBREF33": {
            "title": "Genetic determinants influencing the response to injury, inflammation, and sepsis",
            "authors": [
                {
                    "first": "A.",
                    "middle": [],
                    "last": "De Maio",
                    "suffix": ""
                },
                {
                    "first": "M.B.",
                    "middle": [],
                    "last": "Torres",
                    "suffix": ""
                },
                {
                    "first": "R.H.",
                    "middle": [],
                    "last": "Reeves",
                    "suffix": ""
                }
            ],
            "year": 2005,
            "venue": "Shock",
            "volume": "23",
            "issn": "",
            "pages": "11-17",
            "other_ids": {
                "DOI": [
                    "10.1097/01.shk.0000144134.03598.c5"
                ]
            }
        },
        "BIBREF34": {
            "title": "Innateimmune responses during infection",
            "authors": [
                {
                    "first": "R.J.",
                    "middle": [],
                    "last": "Ulevitch",
                    "suffix": ""
                },
                {
                    "first": "J.C.",
                    "middle": [],
                    "last": "Mathison",
                    "suffix": ""
                },
                {
                    "first": "J.",
                    "middle": [],
                    "last": "da Silva Correia",
                    "suffix": ""
                }
            ],
            "year": 2004,
            "venue": "Vaccine",
            "volume": "22",
            "issn": "Suppl 1",
            "pages": "S25-30",
            "other_ids": {
                "DOI": [
                    "10.1016/j.vaccine.2004.08.013"
                ]
            }
        },
        "BIBREF35": {
            "title": "Innate and adaptive immunity: specificities and signaling hierarchies revisited",
            "authors": [
                {
                    "first": "E.",
                    "middle": [],
                    "last": "Vivier",
                    "suffix": ""
                },
                {
                    "first": "B.",
                    "middle": [],
                    "last": "Malissen",
                    "suffix": ""
                }
            ],
            "year": 2005,
            "venue": "Nat Immunol",
            "volume": "6",
            "issn": "",
            "pages": "17-21",
            "other_ids": {
                "DOI": [
                    "10.1038/ni1153"
                ]
            }
        },
        "BIBREF36": {
            "title": "Genomic polymorphisms in sepsis",
            "authors": [
                {
                    "first": "M.T.",
                    "middle": [],
                    "last": "Lin",
                    "suffix": ""
                },
                {
                    "first": "T.E.",
                    "middle": [],
                    "last": "Albertson",
                    "suffix": ""
                }
            ],
            "year": 2004,
            "venue": "Crit Care Med",
            "volume": "32",
            "issn": "",
            "pages": "569-579",
            "other_ids": {
                "DOI": [
                    "10.1097/01.CCM.0000110878.49476.42"
                ]
            }
        },
        "BIBREF37": {
            "title": "Mannose-binding lectin and its genetic variants",
            "authors": [
                {
                    "first": "P.",
                    "middle": [],
                    "last": "Garred",
                    "suffix": ""
                },
                {
                    "first": "F.",
                    "middle": [],
                    "last": "Larsen",
                    "suffix": ""
                },
                {
                    "first": "J.",
                    "middle": [],
                    "last": "Seyfarth",
                    "suffix": ""
                },
                {
                    "first": "R.",
                    "middle": [],
                    "last": "Fujita",
                    "suffix": ""
                },
                {
                    "first": "H.O.",
                    "middle": [],
                    "last": "Madsen",
                    "suffix": ""
                }
            ],
            "year": 2006,
            "venue": "Genes Immun",
            "volume": "7",
            "issn": "",
            "pages": "85-94",
            "other_ids": {
                "DOI": [
                    "10.1038/sj.gene.6364283"
                ]
            }
        },
        "BIBREF38": {
            "title": "Association of variants of the gene for mannose-binding lectin with susceptibility to meningococcal disease. Meningococcal Research Group",
            "authors": [
                {
                    "first": "M.L.",
                    "middle": [],
                    "last": "Hibberd",
                    "suffix": ""
                },
                {
                    "first": "M.",
                    "middle": [],
                    "last": "Sumiya",
                    "suffix": ""
                },
                {
                    "first": "J.A.",
                    "middle": [],
                    "last": "Summerfield",
                    "suffix": ""
                },
                {
                    "first": "R.",
                    "middle": [],
                    "last": "Booy",
                    "suffix": ""
                },
                {
                    "first": "M.",
                    "middle": [],
                    "last": "Levin",
                    "suffix": ""
                }
            ],
            "year": 1999,
            "venue": "Lancet",
            "volume": "353",
            "issn": "",
            "pages": "1049-1053",
            "other_ids": {
                "DOI": [
                    "10.1016/S0140-6736(98)08350-0"
                ]
            }
        },
        "BIBREF39": {
            "title": "MBL genotype and risk of invasive pneumococcal disease: a case-control study",
            "authors": [
                {
                    "first": "S.",
                    "middle": [],
                    "last": "Roy",
                    "suffix": ""
                },
                {
                    "first": "K.",
                    "middle": [],
                    "last": "Knox",
                    "suffix": ""
                },
                {
                    "first": "S.",
                    "middle": [],
                    "last": "Segal",
                    "suffix": ""
                }
            ],
            "year": 2002,
            "venue": "Lancet",
            "volume": "359",
            "issn": "",
            "pages": "1569-1573",
            "other_ids": {
                "DOI": [
                    "10.1016/S0140-6736(02)08516-1"
                ]
            }
        },
        "BIBREF40": {
            "title": "Association of mannose-binding lectin polymorphisms with sepsis and fatal outcome, in patients with systemic inflammatory response syndrome",
            "authors": [
                {
                    "first": "P.",
                    "middle": [],
                    "last": "Garred",
                    "suffix": ""
                },
                {
                    "first": "J.J.",
                    "middle": [],
                    "last": "S",
                    "suffix": ""
                },
                {
                    "first": "L.",
                    "middle": [],
                    "last": "Quist",
                    "suffix": ""
                },
                {
                    "first": "E.",
                    "middle": [],
                    "last": "Taaning",
                    "suffix": ""
                },
                {
                    "first": "H.O.",
                    "middle": [],
                    "last": "Madsen",
                    "suffix": ""
                }
            ],
            "year": 2003,
            "venue": "J Infect Dis",
            "volume": "188",
            "issn": "",
            "pages": "1394-1403",
            "other_ids": {
                "DOI": [
                    "10.1086/379044"
                ]
            }
        },
        "BIBREF41": {
            "title": "Relevance of Fcgamma receptor and interleukin-10 polymorphisms for meningococcal disease",
            "authors": [
                {
                    "first": "W.L.",
                    "middle": [],
                    "last": "van der Pol",
                    "suffix": ""
                },
                {
                    "first": "T.W.",
                    "middle": [],
                    "last": "Huizinga",
                    "suffix": ""
                },
                {
                    "first": "G.",
                    "middle": [],
                    "last": "Vidarsson",
                    "suffix": ""
                }
            ],
            "year": 2001,
            "venue": "J Infect Dis",
            "volume": "184",
            "issn": "",
            "pages": "1548-1555",
            "other_ids": {
                "DOI": [
                    "10.1086/324662"
                ]
            }
        },
        "BIBREF42": {
            "title": "Single nucleotide polymorphisms of Toll-like receptors and susceptibility to infectious disease",
            "authors": [
                {
                    "first": "N.W.",
                    "middle": [],
                    "last": "Schroder",
                    "suffix": ""
                },
                {
                    "first": "R.R.",
                    "middle": [],
                    "last": "Schumann",
                    "suffix": ""
                }
            ],
            "year": 2005,
            "venue": "Lancet Infect Dis",
            "volume": "5",
            "issn": "",
            "pages": "156-164",
            "other_ids": {
                "DOI": []
            }
        },
        "BIBREF43": {
            "title": "TLR4mutations are associated with endotoxin hyporesponsiveness in humans",
            "authors": [
                {
                    "first": "N.C.",
                    "middle": [],
                    "last": "Arbour",
                    "suffix": ""
                },
                {
                    "first": "E.",
                    "middle": [],
                    "last": "Lorenz",
                    "suffix": ""
                },
                {
                    "first": "B.C.",
                    "middle": [],
                    "last": "Schutte",
                    "suffix": ""
                }
            ],
            "year": 2000,
            "venue": "Nat Genet",
            "volume": "25",
            "issn": "",
            "pages": "187-191",
            "other_ids": {
                "DOI": [
                    "10.1038/76048"
                ]
            }
        },
        "BIBREF44": {
            "title": "Genetic polymorphisms and sepsis",
            "authors": [
                {
                    "first": "J.",
                    "middle": [],
                    "last": "Arcaroli",
                    "suffix": ""
                },
                {
                    "first": "M.B.",
                    "middle": [],
                    "last": "Fessler",
                    "suffix": ""
                },
                {
                    "first": "E.",
                    "middle": [],
                    "last": "Abraham",
                    "suffix": ""
                }
            ],
            "year": 2005,
            "venue": "Shock",
            "volume": "24",
            "issn": "",
            "pages": "300-312",
            "other_ids": {
                "DOI": [
                    "10.1097/01.shk.0000180621.52058.e1"
                ]
            }
        },
        "BIBREF45": {
            "title": "Relevance ofmutations in the TLR4 receptor in patients with gram-negative septic shock",
            "authors": [
                {
                    "first": "E.",
                    "middle": [],
                    "last": "Lorenz",
                    "suffix": ""
                },
                {
                    "first": "J.P.",
                    "middle": [],
                    "last": "Mira",
                    "suffix": ""
                },
                {
                    "first": "K.L.",
                    "middle": [],
                    "last": "Frees",
                    "suffix": ""
                },
                {
                    "first": "D.A.",
                    "middle": [],
                    "last": "Schwartz",
                    "suffix": ""
                }
            ],
            "year": 2002,
            "venue": "Arch Intern Med",
            "volume": "162",
            "issn": "",
            "pages": "1028-1032",
            "other_ids": {
                "DOI": [
                    "10.1001/archinte.162.9.1028"
                ]
            }
        },
        "BIBREF46": {
            "title": "Polymorphisms in Toll-like receptor 4 and the systemic inflammatory response syndrome",
            "authors": [
                {
                    "first": "N.J.",
                    "middle": [],
                    "last": "Child",
                    "suffix": ""
                },
                {
                    "first": "I.A.",
                    "middle": [],
                    "last": "Yang",
                    "suffix": ""
                },
                {
                    "first": "M.C.",
                    "middle": [],
                    "last": "Pulletz",
                    "suffix": ""
                }
            ],
            "year": 2003,
            "venue": "Biochem Soc Trans",
            "volume": "31",
            "issn": "",
            "pages": "652-653",
            "other_ids": {
                "DOI": [
                    "10.1042/BST0310652"
                ]
            }
        },
        "BIBREF47": {
            "title": "Host genetic determinants of Neisseria meningitidis infections",
            "authors": [
                {
                    "first": "M.",
                    "middle": [],
                    "last": "Emonts",
                    "suffix": ""
                },
                {
                    "first": "J.A.",
                    "middle": [],
                    "last": "Hazelzet",
                    "suffix": ""
                },
                {
                    "first": "R.",
                    "middle": [],
                    "last": "de Groot",
                    "suffix": ""
                },
                {
                    "first": "P.W.",
                    "middle": [],
                    "last": "Hermans",
                    "suffix": ""
                }
            ],
            "year": 2003,
            "venue": "Lancet Infect Dis",
            "volume": "3",
            "issn": "",
            "pages": "565-577",
            "other_ids": {
                "DOI": [
                    "10.1016/S1473-3099(03)00740-0"
                ]
            }
        },
        "BIBREF48": {
            "title": "Polymorphisms in CD14, mannose-binding lectin, and Toll-like receptor-2 are associated with increased prevalence of infection in critically ill adults",
            "authors": [
                {
                    "first": "A.M.",
                    "middle": [],
                    "last": "Sutherland",
                    "suffix": ""
                },
                {
                    "first": "K.R.",
                    "middle": [],
                    "last": "Walley",
                    "suffix": ""
                },
                {
                    "first": "J.A.",
                    "middle": [],
                    "last": "Russell",
                    "suffix": ""
                }
            ],
            "year": 2005,
            "venue": "Crit Care Med",
            "volume": "33",
            "issn": "",
            "pages": "638-644",
            "other_ids": {
                "DOI": [
                    "10.1097/01.CCM.0000156242.44356.C5"
                ]
            }
        },
        "BIBREF49": {
            "title": "Association between a genomic polymorphismwithin the CD14 locus and septic shock susceptibility andmortality rate",
            "authors": [
                {
                    "first": "S.",
                    "middle": [],
                    "last": "Gibot",
                    "suffix": ""
                },
                {
                    "first": "A.",
                    "middle": [],
                    "last": "Cariou",
                    "suffix": ""
                },
                {
                    "first": "L.",
                    "middle": [],
                    "last": "Drouet",
                    "suffix": ""
                },
                {
                    "first": "M.",
                    "middle": [],
                    "last": "Rossignol",
                    "suffix": ""
                },
                {
                    "first": "L.",
                    "middle": [],
                    "last": "Ripoll",
                    "suffix": ""
                }
            ],
            "year": 2002,
            "venue": "Crit Care Med",
            "volume": "30",
            "issn": "",
            "pages": "969-973",
            "other_ids": {
                "DOI": [
                    "10.1097/00003246-200205000-00003"
                ]
            }
        },
        "BIBREF50": {
            "title": "Effect of CD14-260C>T polymorphismon the mortality of critically ill patients",
            "authors": [
                {
                    "first": "L.C.",
                    "middle": [],
                    "last": "D\u2019Avila",
                    "suffix": ""
                },
                {
                    "first": "M.H.",
                    "middle": [],
                    "last": "Albarus",
                    "suffix": ""
                },
                {
                    "first": "C.R.",
                    "middle": [],
                    "last": "Franco",
                    "suffix": ""
                }
            ],
            "year": 2006,
            "venue": "Immunol Cell Biol",
            "volume": "84",
            "issn": "",
            "pages": "342-348",
            "other_ids": {
                "DOI": [
                    "10.1111/j.1440-1711.2006.01432.x"
                ]
            }
        },
        "BIBREF51": {
            "title": "The-260C->T promoter polymorphism of the lipopolysaccharide receptor CD14 and severe sepsis in traumapatients",
            "authors": [
                {
                    "first": "M.",
                    "middle": [],
                    "last": "Heesen",
                    "suffix": ""
                },
                {
                    "first": "B.",
                    "middle": [],
                    "last": "Bloemeke",
                    "suffix": ""
                },
                {
                    "first": "U.",
                    "middle": [],
                    "last": "Schade",
                    "suffix": ""
                },
                {
                    "first": "U.",
                    "middle": [],
                    "last": "Obertacke",
                    "suffix": ""
                },
                {
                    "first": "M.",
                    "middle": [],
                    "last": "Majetschak",
                    "suffix": ""
                }
            ],
            "year": 2002,
            "venue": "Intensive Care Med",
            "volume": "28",
            "issn": "",
            "pages": "1161-1163",
            "other_ids": {
                "DOI": [
                    "10.1007/s00134-002-1389-0"
                ]
            }
        },
        "BIBREF52": {
            "title": "Epidemiology and economic evaluation of severe sepsis in France: age, severity, infection site, and place of acquisition (community, hospital, or intensive care unit) as determinants of workload and cost",
            "authors": [
                {
                    "first": "C.",
                    "middle": [],
                    "last": "Adrie",
                    "suffix": ""
                },
                {
                    "first": "C.",
                    "middle": [],
                    "last": "Alberti",
                    "suffix": ""
                },
                {
                    "first": "C.",
                    "middle": [],
                    "last": "Chaix-Couturier",
                    "suffix": ""
                }
            ],
            "year": 2005,
            "venue": "J Crit Care",
            "volume": "20",
            "issn": "",
            "pages": "46-58",
            "other_ids": {
                "DOI": [
                    "10.1016/j.jcrc.2004.10.005"
                ]
            }
        },
        "BIBREF53": {
            "title": "The \u201ccytokine profile\u201d: a code for sepsis",
            "authors": [
                {
                    "first": "L.",
                    "middle": [],
                    "last": "Ulloa",
                    "suffix": ""
                },
                {
                    "first": "K.J.",
                    "middle": [],
                    "last": "Tracey",
                    "suffix": ""
                }
            ],
            "year": 2005,
            "venue": "Trends Mol Med",
            "volume": "11",
            "issn": "",
            "pages": "56-63",
            "other_ids": {
                "DOI": [
                    "10.1016/j.molmed.2004.12.007"
                ]
            }
        },
        "BIBREF54": {
            "title": "Cytokine gene polymorphismin human disease: on-line databases, supplement 2",
            "authors": [
                {
                    "first": "N.",
                    "middle": [],
                    "last": "Haukim",
                    "suffix": ""
                },
                {
                    "first": "J.L.",
                    "middle": [],
                    "last": "Bidwell",
                    "suffix": ""
                },
                {
                    "first": "A.J.",
                    "middle": [],
                    "last": "Smith",
                    "suffix": ""
                }
            ],
            "year": 2002,
            "venue": "Genes Immun",
            "volume": "3",
            "issn": "",
            "pages": "313-330",
            "other_ids": {
                "DOI": [
                    "10.1038/sj.gene.6363881"
                ]
            }
        },
        "BIBREF55": {
            "title": "Genetic polymorphisms in sepsis",
            "authors": [
                {
                    "first": "M.K.",
                    "middle": [],
                    "last": "Dahmer",
                    "suffix": ""
                },
                {
                    "first": "A.",
                    "middle": [],
                    "last": "Randolph",
                    "suffix": ""
                },
                {
                    "first": "S.",
                    "middle": [],
                    "last": "Vitali",
                    "suffix": ""
                },
                {
                    "first": "M.W.",
                    "middle": [],
                    "last": "Quasney",
                    "suffix": ""
                }
            ],
            "year": 2005,
            "venue": "Pediatr Crit Care Med",
            "volume": "6",
            "issn": "",
            "pages": "S61-73",
            "other_ids": {
                "DOI": [
                    "10.1097/01.PCC.0000161970.44470.C7"
                ]
            }
        },
        "BIBREF56": {
            "title": "Anti-cytokine therapeutics and infections",
            "authors": [
                {
                    "first": "C.A.",
                    "middle": [],
                    "last": "Dinarello",
                    "suffix": ""
                }
            ],
            "year": 2003,
            "venue": "Vaccine",
            "volume": "21",
            "issn": "Suppl 2",
            "pages": "S24-34",
            "other_ids": {
                "DOI": [
                    "10.1016/S0264-410X(03)00196-8"
                ]
            }
        },
        "BIBREF57": {
            "title": "necrosis factor beta gene polymorphism in relation tomonokine secretion and insulin-dependent diabetes mellitus",
            "authors": [
                {
                    "first": "F.",
                    "middle": [],
                    "last": "Pociot",
                    "suffix": ""
                },
                {
                    "first": "J.",
                    "middle": [],
                    "last": "Molvig",
                    "suffix": ""
                },
                {
                    "first": "L.",
                    "middle": [],
                    "last": "Wogensen",
                    "suffix": ""
                }
            ],
            "year": 1991,
            "venue": "Scand J Immunol",
            "volume": "33",
            "issn": "",
            "pages": "37-49",
            "other_ids": {
                "DOI": [
                    "10.1111/j.1365-3083.1991.tb02490.x"
                ]
            }
        },
        "BIBREF58": {
            "title": "Linkage disequilibrium between tumor necrosis factor (TNF)-alpha-308 G/A promoter and TNF-beta NcoI polymorphisms: Association with TNF-alpha response of granulocytes to endotoxin stimulation",
            "authors": [
                {
                    "first": "M.",
                    "middle": [],
                    "last": "Heesen",
                    "suffix": ""
                },
                {
                    "first": "D.",
                    "middle": [],
                    "last": "Kunz",
                    "suffix": ""
                },
                {
                    "first": "B.",
                    "middle": [],
                    "last": "Bachmann-Mennenga",
                    "suffix": ""
                },
                {
                    "first": "H.F.",
                    "middle": [],
                    "last": "Merk",
                    "suffix": ""
                },
                {
                    "first": "B.",
                    "middle": [],
                    "last": "Bloemeke",
                    "suffix": ""
                }
            ],
            "year": 2003,
            "venue": "Crit Care Med",
            "volume": "31",
            "issn": "",
            "pages": "211-214",
            "other_ids": {
                "DOI": [
                    "10.1097/00003246-200301000-00032"
                ]
            }
        },
        "BIBREF59": {
            "title": "Tumor necrosis factor alpha in the pathogenesis of cerebral malaria",
            "authors": [
                {
                    "first": "F.",
                    "middle": [],
                    "last": "Gimenez",
                    "suffix": ""
                },
                {
                    "first": "S.",
                    "middle": [],
                    "last": "Barraud de Lagerie",
                    "suffix": ""
                },
                {
                    "first": "C.",
                    "middle": [],
                    "last": "Fernandez",
                    "suffix": ""
                },
                {
                    "first": "P.",
                    "middle": [],
                    "last": "Pino",
                    "suffix": ""
                },
                {
                    "first": "D.",
                    "middle": [],
                    "last": "Mazier",
                    "suffix": ""
                }
            ],
            "year": 2003,
            "venue": "Cell Mol Life Sci",
            "volume": "60",
            "issn": "",
            "pages": "1623-1635",
            "other_ids": {
                "DOI": [
                    "10.1007/s00018-003-2347-x"
                ]
            }
        },
        "BIBREF60": {
            "title": "Genetic determinants of the inflammatory response",
            "authors": [
                {
                    "first": "S.D.",
                    "middle": [],
                    "last": "Imahara",
                    "suffix": ""
                },
                {
                    "first": "G.E.",
                    "middle": [],
                    "last": "O\u2019Keefe",
                    "suffix": ""
                }
            ],
            "year": 2004,
            "venue": "Curr Opin Crit Care",
            "volume": "10",
            "issn": "",
            "pages": "318-324",
            "other_ids": {
                "DOI": [
                    "10.1097/01.ccx.0000140942.42247.7e"
                ]
            }
        },
        "BIBREF61": {
            "title": "Association of TNF2, a TNF-alpha promoter polymorphism, with septic shock susceptibility and mortality: a multicenter study",
            "authors": [
                {
                    "first": "J.P.",
                    "middle": [],
                    "last": "Mira",
                    "suffix": ""
                },
                {
                    "first": "A.",
                    "middle": [],
                    "last": "Cariou",
                    "suffix": ""
                },
                {
                    "first": "F.",
                    "middle": [],
                    "last": "Grall",
                    "suffix": ""
                }
            ],
            "year": 1999,
            "venue": "JAMA",
            "volume": "282",
            "issn": "",
            "pages": "561-568",
            "other_ids": {
                "DOI": [
                    "10.1001/jama.282.6.561"
                ]
            }
        },
        "BIBREF62": {
            "title": "Tumor necrosis factor alpha \u2014 308 polymorphism associated with increased sepsis mortality in ventilated very low birth weight infants",
            "authors": [
                {
                    "first": "C.L.",
                    "middle": [],
                    "last": "Hedberg",
                    "suffix": ""
                },
                {
                    "first": "K.",
                    "middle": [],
                    "last": "Adcock",
                    "suffix": ""
                },
                {
                    "first": "J.",
                    "middle": [],
                    "last": "Martin",
                    "suffix": ""
                },
                {
                    "first": "J.",
                    "middle": [],
                    "last": "Loggins",
                    "suffix": ""
                },
                {
                    "first": "T.E.",
                    "middle": [],
                    "last": "Kruger",
                    "suffix": ""
                },
                {
                    "first": "R.J.",
                    "middle": [],
                    "last": "Baier",
                    "suffix": ""
                }
            ],
            "year": 2004,
            "venue": "Pediatr Infect Dis J",
            "volume": "23",
            "issn": "",
            "pages": "424-428",
            "other_ids": {
                "DOI": []
            }
        },
        "BIBREF63": {
            "title": "TNF and TNFR polymorphisms in severe sepsis and septic shock: a prospective multicentre study",
            "authors": [
                {
                    "first": "A.C.",
                    "middle": [],
                    "last": "Gordon",
                    "suffix": ""
                },
                {
                    "first": "A.L.",
                    "middle": [],
                    "last": "Lagan",
                    "suffix": ""
                },
                {
                    "first": "E.",
                    "middle": [],
                    "last": "Aganna",
                    "suffix": ""
                }
            ],
            "year": 2004,
            "venue": "Genes Immun",
            "volume": "5",
            "issn": "",
            "pages": "631-640",
            "other_ids": {
                "DOI": [
                    "10.1038/sj.gene.6364136"
                ]
            }
        },
        "BIBREF64": {
            "title": "Methodologic quality and genotyping reproducibility in studies of tumor necrosis factor-308 G->A single nucleotide polymorphismand bacterial sepsis: implications for studies of complex traits",
            "authors": [
                {
                    "first": "D.L.",
                    "middle": [],
                    "last": "Peters",
                    "suffix": ""
                },
                {
                    "first": "R.C.",
                    "middle": [],
                    "last": "Barber",
                    "suffix": ""
                },
                {
                    "first": "E.M.",
                    "middle": [],
                    "last": "Flood",
                    "suffix": ""
                },
                {
                    "first": "H.R.",
                    "middle": [],
                    "last": "Garner",
                    "suffix": ""
                },
                {
                    "first": "G.E.",
                    "middle": [],
                    "last": "O\u2019Keefe",
                    "suffix": ""
                }
            ],
            "year": 2003,
            "venue": "Crit Care Med",
            "volume": "31",
            "issn": "",
            "pages": "1691-1696",
            "other_ids": {
                "DOI": [
                    "10.1097/01.CCM.0000065190.24116.A4"
                ]
            }
        },
        "BIBREF65": {
            "title": "Biology of interleukin-10 and its regulatory roles in sepsis syndromes",
            "authors": [
                {
                    "first": "P.O.",
                    "middle": [],
                    "last": "Scumpia",
                    "suffix": ""
                },
                {
                    "first": "L.L.",
                    "middle": [],
                    "last": "Moldawer",
                    "suffix": ""
                }
            ],
            "year": 2005,
            "venue": "Crit Care Med",
            "volume": "33",
            "issn": "",
            "pages": "S468-S471",
            "other_ids": {
                "DOI": [
                    "10.1097/01.CCM.0000186268.53799.67"
                ]
            }
        },
        "BIBREF66": {
            "title": "The importance of Toll-like receptor 2 polymorphisms in severe infections",
            "authors": [
                {
                    "first": "J.",
                    "middle": [],
                    "last": "Texereau",
                    "suffix": ""
                },
                {
                    "first": "J.D.",
                    "middle": [],
                    "last": "Chiche",
                    "suffix": ""
                },
                {
                    "first": "W.",
                    "middle": [],
                    "last": "Taylor",
                    "suffix": ""
                },
                {
                    "first": "G.",
                    "middle": [],
                    "last": "Choukroun",
                    "suffix": ""
                },
                {
                    "first": "B.",
                    "middle": [],
                    "last": "Comba",
                    "suffix": ""
                },
                {
                    "first": "J.P.",
                    "middle": [],
                    "last": "Mira",
                    "suffix": ""
                }
            ],
            "year": 2005,
            "venue": "Clin Infect Dis",
            "volume": "41",
            "issn": "Suppl 7",
            "pages": "S408-415",
            "other_ids": {
                "DOI": [
                    "10.1086/431990"
                ]
            }
        },
        "BIBREF67": {
            "title": "Relationship of interleukin-10 plasma levels to severity of injury and clinical outcome in injured patients",
            "authors": [
                {
                    "first": "R.",
                    "middle": [],
                    "last": "Neidhardt",
                    "suffix": ""
                },
                {
                    "first": "M.",
                    "middle": [],
                    "last": "Keel",
                    "suffix": ""
                },
                {
                    "first": "U.",
                    "middle": [],
                    "last": "Steckholzer",
                    "suffix": ""
                }
            ],
            "year": 1997,
            "venue": "J Trauma",
            "volume": "42",
            "issn": "",
            "pages": "863-870",
            "other_ids": {
                "DOI": [
                    "10.1097/00005373-199705000-00017"
                ]
            }
        },
        "BIBREF68": {
            "title": "Blood interleukin 10 levels parallel the severity of septic shock",
            "authors": [
                {
                    "first": "G.",
                    "middle": [],
                    "last": "Friedman",
                    "suffix": ""
                },
                {
                    "first": "S.",
                    "middle": [],
                    "last": "Jankowski",
                    "suffix": ""
                },
                {
                    "first": "A.",
                    "middle": [],
                    "last": "Marchant",
                    "suffix": ""
                },
                {
                    "first": "M.",
                    "middle": [],
                    "last": "Goldman",
                    "suffix": ""
                },
                {
                    "first": "R.J.",
                    "middle": [],
                    "last": "Kahn",
                    "suffix": ""
                },
                {
                    "first": "J.L.",
                    "middle": [],
                    "last": "Vincent",
                    "suffix": ""
                }
            ],
            "year": 1997,
            "venue": "J Crit Care",
            "volume": "12",
            "issn": "",
            "pages": "183-187",
            "other_ids": {
                "DOI": [
                    "10.1016/S0883-9441(97)90030-7"
                ]
            }
        },
        "BIBREF69": {
            "title": "A functional single nucleotide polymorphism in the thrombin-activatable fibrinolysis inhibitor (TAFI) gene associates with outcome of meningococcal disease",
            "authors": [
                {
                    "first": "J.A.",
                    "middle": [],
                    "last": "Kremer Hovinga",
                    "suffix": ""
                },
                {
                    "first": "R.F.",
                    "middle": [],
                    "last": "Franco",
                    "suffix": ""
                },
                {
                    "first": "M.A.",
                    "middle": [],
                    "last": "Zago",
                    "suffix": ""
                },
                {
                    "first": "H.",
                    "middle": [],
                    "last": "Ten Cate",
                    "suffix": ""
                },
                {
                    "first": "R.G.",
                    "middle": [],
                    "last": "Westendorp",
                    "suffix": ""
                },
                {
                    "first": "P.H.",
                    "middle": [],
                    "last": "Reitsma",
                    "suffix": ""
                }
            ],
            "year": 2004,
            "venue": "J Thromb Haemost",
            "volume": "2",
            "issn": "",
            "pages": "54-57",
            "other_ids": {
                "DOI": [
                    "10.1111/j.1538-7836.2004.00557.x"
                ]
            }
        },
        "BIBREF70": {
            "title": "Heritability estimates of innate immunity: an extended twin study",
            "authors": [
                {
                    "first": "A.J.",
                    "middle": [],
                    "last": "de Craen",
                    "suffix": ""
                },
                {
                    "first": "D.",
                    "middle": [],
                    "last": "Posthuma",
                    "suffix": ""
                },
                {
                    "first": "E.J.",
                    "middle": [],
                    "last": "Remarque",
                    "suffix": ""
                },
                {
                    "first": "A.H.",
                    "middle": [],
                    "last": "van den Biggelaar",
                    "suffix": ""
                },
                {
                    "first": "R.G.",
                    "middle": [],
                    "last": "Westendorp",
                    "suffix": ""
                },
                {
                    "first": "D.I.",
                    "middle": [],
                    "last": "Boomsma",
                    "suffix": ""
                }
            ],
            "year": 2005,
            "venue": "Genes Immun",
            "volume": "6",
            "issn": "",
            "pages": "167-170",
            "other_ids": {
                "DOI": [
                    "10.1038/sj.gene.6364162"
                ]
            }
        },
        "BIBREF71": {
            "title": "Novel single nucleotide polymorphisms in the distal IL-10 promoter affect IL-10 production and enhance the risk of systemic lupus erythematosus",
            "authors": [
                {
                    "first": "A.W.",
                    "middle": [],
                    "last": "Gibson",
                    "suffix": ""
                },
                {
                    "first": "J.C.",
                    "middle": [],
                    "last": "Edberg",
                    "suffix": ""
                },
                {
                    "first": "J.",
                    "middle": [],
                    "last": "Wu",
                    "suffix": ""
                },
                {
                    "first": "R.G.",
                    "middle": [],
                    "last": "Westendorp",
                    "suffix": ""
                },
                {
                    "first": "T.W.",
                    "middle": [],
                    "last": "Huizinga",
                    "suffix": ""
                },
                {
                    "first": "R.P.",
                    "middle": [],
                    "last": "Kimberly",
                    "suffix": ""
                }
            ],
            "year": 2001,
            "venue": "J Immunol",
            "volume": "166",
            "issn": "",
            "pages": "3915-3922",
            "other_ids": {
                "DOI": []
            }
        },
        "BIBREF72": {
            "title": "Polymorphisms in candidate genes and risk of scarring trachoma in a Chlamydia trachomatis-endemic population",
            "authors": [
                {
                    "first": "N.",
                    "middle": [],
                    "last": "Mozzato-Chamay",
                    "suffix": ""
                },
                {
                    "first": "O.S.",
                    "middle": [],
                    "last": "Mahdi",
                    "suffix": ""
                },
                {
                    "first": "O.",
                    "middle": [],
                    "last": "Jallow",
                    "suffix": ""
                },
                {
                    "first": "D.C.",
                    "middle": [],
                    "last": "Mabey",
                    "suffix": ""
                },
                {
                    "first": "R.L.",
                    "middle": [],
                    "last": "Bailey",
                    "suffix": ""
                },
                {
                    "first": "D.J.",
                    "middle": [],
                    "last": "Conway",
                    "suffix": ""
                }
            ],
            "year": 2000,
            "venue": "J Infect Dis",
            "volume": "182",
            "issn": "",
            "pages": "1545-1548",
            "other_ids": {
                "DOI": [
                    "10.1086/315891"
                ]
            }
        },
        "BIBREF73": {
            "title": "Susceptibility to primary Epstein-Barr virus infection is associated with interleukin-10 gene promoter polymorphism",
            "authors": [
                {
                    "first": "M.E.",
                    "middle": [],
                    "last": "Helminen",
                    "suffix": ""
                },
                {
                    "first": "S.",
                    "middle": [],
                    "last": "Kilpinen",
                    "suffix": ""
                },
                {
                    "first": "M.",
                    "middle": [],
                    "last": "Virta",
                    "suffix": ""
                },
                {
                    "first": "M.",
                    "middle": [],
                    "last": "Hurme",
                    "suffix": ""
                }
            ],
            "year": 2001,
            "venue": "J Infect Dis",
            "volume": "184",
            "issn": "",
            "pages": "777-780",
            "other_ids": {
                "DOI": [
                    "10.1086/322987"
                ]
            }
        },
        "BIBREF74": {
            "title": "Association of IL-10 polymorphism with severity of illness in community acquired pneumonia",
            "authors": [
                {
                    "first": "P.M.",
                    "middle": [],
                    "last": "Gallagher",
                    "suffix": ""
                },
                {
                    "first": "G.",
                    "middle": [],
                    "last": "Lowe",
                    "suffix": ""
                },
                {
                    "first": "T.",
                    "middle": [],
                    "last": "Fitzgerald",
                    "suffix": ""
                }
            ],
            "year": 2003,
            "venue": "Thorax",
            "volume": "58",
            "issn": "",
            "pages": "154-156",
            "other_ids": {
                "DOI": [
                    "10.1136/thorax.58.2.154"
                ]
            }
        },
        "BIBREF75": {
            "title": "Influence of interleukin-10 polymorphisms on interleukin-10 expression and survival in critically ill patients",
            "authors": [
                {
                    "first": "P.R.",
                    "middle": [],
                    "last": "Lowe",
                    "suffix": ""
                },
                {
                    "first": "H.F.",
                    "middle": [],
                    "last": "Galley",
                    "suffix": ""
                },
                {
                    "first": "A.",
                    "middle": [],
                    "last": "Abdel-Fattah",
                    "suffix": ""
                },
                {
                    "first": "N.R.",
                    "middle": [],
                    "last": "Webster",
                    "suffix": ""
                }
            ],
            "year": 2003,
            "venue": "Crit Care Med",
            "volume": "31",
            "issn": "",
            "pages": "34-38",
            "other_ids": {
                "DOI": [
                    "10.1097/00003246-200301000-00005"
                ]
            }
        },
        "BIBREF76": {
            "title": "Interleukin-10 haplotype associated with increased mortality in critically ill patients with sepsis from pneumonia but not in patients with extrapulmonary sepsis",
            "authors": [
                {
                    "first": "A.",
                    "middle": [],
                    "last": "Wattanathum",
                    "suffix": ""
                },
                {
                    "first": "S.",
                    "middle": [],
                    "last": "Manocha",
                    "suffix": ""
                },
                {
                    "first": "H.",
                    "middle": [],
                    "last": "Groshaus",
                    "suffix": ""
                },
                {
                    "first": "J.A.",
                    "middle": [],
                    "last": "Russell",
                    "suffix": ""
                },
                {
                    "first": "K.R.",
                    "middle": [],
                    "last": "Walley",
                    "suffix": ""
                }
            ],
            "year": 2005,
            "venue": "Chest",
            "volume": "128",
            "issn": "",
            "pages": "1690-1698",
            "other_ids": {
                "DOI": [
                    "10.1378/chest.128.3.1690"
                ]
            }
        },
        "BIBREF77": {
            "title": "Importance of hemostatic gene polymorphisms for susceptibility to and outcome of severe sepsis",
            "authors": [
                {
                    "first": "J.",
                    "middle": [],
                    "last": "Texereau",
                    "suffix": ""
                },
                {
                    "first": "F.",
                    "middle": [],
                    "last": "Pene",
                    "suffix": ""
                },
                {
                    "first": "J.D.",
                    "middle": [],
                    "last": "Chiche",
                    "suffix": ""
                },
                {
                    "first": "C.",
                    "middle": [],
                    "last": "Rousseau",
                    "suffix": ""
                },
                {
                    "first": "J.P.",
                    "middle": [],
                    "last": "Mira",
                    "suffix": ""
                }
            ],
            "year": 2004,
            "venue": "Crit Care Med",
            "volume": "32",
            "issn": "",
            "pages": "S313-319",
            "other_ids": {
                "DOI": [
                    "10.1097/01.CCM.0000126363.46191.DC"
                ]
            }
        },
        "BIBREF78": {
            "title": "Plasminogen-activator-inhibitor-1 4G/5G promoter polymorphism and prognosis of severely injured patients",
            "authors": [
                {
                    "first": "T.",
                    "middle": [],
                    "last": "Menges",
                    "suffix": ""
                },
                {
                    "first": "P.W.",
                    "middle": [],
                    "last": "Hermans",
                    "suffix": ""
                },
                {
                    "first": "S.G.",
                    "middle": [],
                    "last": "Little",
                    "suffix": ""
                }
            ],
            "year": 2001,
            "venue": "Lancet",
            "volume": "357",
            "issn": "",
            "pages": "1096-1097",
            "other_ids": {
                "DOI": [
                    "10.1016/S0140-6736(00)04311-7"
                ]
            }
        },
        "BIBREF79": {
            "title": "4G/5G promoter polymorphism in the plasminogen-activator-inhibitor-1 gene in children with systemic meningococcaemia",
            "authors": [
                {
                    "first": "G.",
                    "middle": [],
                    "last": "Geishofer",
                    "suffix": ""
                },
                {
                    "first": "A.",
                    "middle": [],
                    "last": "Binder",
                    "suffix": ""
                },
                {
                    "first": "M.",
                    "middle": [],
                    "last": "Muller",
                    "suffix": ""
                }
            ],
            "year": 2005,
            "venue": "Eur J Pediatr",
            "volume": "164",
            "issn": "",
            "pages": "486-490",
            "other_ids": {
                "DOI": [
                    "10.1007/s00431-005-1673-4"
                ]
            }
        },
        "BIBREF80": {
            "title": "Role of functional plasminogen-activator-inhibitor-1 4G/5G promoter polymorphism in susceptibility, severity, and outcome of meningococcal disease in Caucasian children",
            "authors": [
                {
                    "first": "E.",
                    "middle": [],
                    "last": "Haralambous",
                    "suffix": ""
                },
                {
                    "first": "M.L.",
                    "middle": [],
                    "last": "Hibberd",
                    "suffix": ""
                },
                {
                    "first": "P.W.",
                    "middle": [],
                    "last": "Hermans",
                    "suffix": ""
                },
                {
                    "first": "N.",
                    "middle": [],
                    "last": "Ninis",
                    "suffix": ""
                },
                {
                    "first": "S.",
                    "middle": [],
                    "last": "Nadel",
                    "suffix": ""
                },
                {
                    "first": "M.",
                    "middle": [],
                    "last": "Levin",
                    "suffix": ""
                }
            ],
            "year": 2003,
            "venue": "Crit Care Med",
            "volume": "31",
            "issn": "",
            "pages": "2788-2793",
            "other_ids": {
                "DOI": [
                    "10.1097/01.CCM.0000100122.57249.5D"
                ]
            }
        },
        "BIBREF81": {
            "title": "The era of genomics: impact on sepsis clinical trial design",
            "authors": [
                {
                    "first": "A.",
                    "middle": [],
                    "last": "Cariou",
                    "suffix": ""
                },
                {
                    "first": "J.D.",
                    "middle": [],
                    "last": "Chiche",
                    "suffix": ""
                },
                {
                    "first": "J.",
                    "middle": [],
                    "last": "Charpentier",
                    "suffix": ""
                },
                {
                    "first": "J.F.",
                    "middle": [],
                    "last": "Dhainaut",
                    "suffix": ""
                },
                {
                    "first": "J.P.",
                    "middle": [],
                    "last": "Mira",
                    "suffix": ""
                }
            ],
            "year": 2002,
            "venue": "Crit Care Med",
            "volume": "30",
            "issn": "",
            "pages": "S341-348",
            "other_ids": {
                "DOI": [
                    "10.1097/00003246-200205001-00026"
                ]
            }
        },
        "BIBREF82": {
            "title": "The human genome sequence: impact on health care",
            "authors": [
                {
                    "first": "M.D.",
                    "middle": [],
                    "last": "Bashyam",
                    "suffix": ""
                },
                {
                    "first": "S.E.",
                    "middle": [],
                    "last": "Hasnain",
                    "suffix": ""
                }
            ],
            "year": 2003,
            "venue": "Indian J Med Res",
            "volume": "117",
            "issn": "",
            "pages": "43-65",
            "other_ids": {
                "DOI": []
            }
        },
        "BIBREF83": {
            "title": "Mannose-binding lectin: biology and clinical implications",
            "authors": [
                {
                    "first": "D.L.",
                    "middle": [],
                    "last": "Worthley",
                    "suffix": ""
                },
                {
                    "first": "P.G.",
                    "middle": [],
                    "last": "Bardy",
                    "suffix": ""
                },
                {
                    "first": "C.G.",
                    "middle": [],
                    "last": "Mullighan",
                    "suffix": ""
                }
            ],
            "year": 2005,
            "venue": "Intern Med J",
            "volume": "35",
            "issn": "",
            "pages": "548-555",
            "other_ids": {
                "DOI": [
                    "10.1111/j.1445-5994.2005.00908.x"
                ]
            }
        }
    }
}