{
    "paper_id": "4e09c0a8b829476d216d50c7c967c502f670a3b9",
    "metadata": {
        "title": "Enhanced Effect of DNA Immunization plus In Vivo Electroporation with a Combination of Hepatitis B Virus Core-PreS1 and S-PreS1 Plasmids \u1c14 Downloaded from",
        "authors": [
            {
                "first": "Hong",
                "middle": [],
                "last": "Chen",
                "suffix": "",
                "affiliation": {
                    "laboratory": "",
                    "institution": "Jilin University",
                    "location": {
                        "settlement": "Changchun",
                        "country": "People's Republic of China"
                    }
                },
                "email": ""
            },
            {
                "first": "Bo",
                "middle": [],
                "last": "Wen",
                "suffix": "",
                "affiliation": {
                    "laboratory": "",
                    "institution": "Jilin University",
                    "location": {
                        "settlement": "Changchun",
                        "country": "People's Republic of China"
                    }
                },
                "email": ""
            },
            {
                "first": "Yao",
                "middle": [],
                "last": "Deng",
                "suffix": "",
                "affiliation": {
                    "laboratory": "",
                    "institution": "Jilin University",
                    "location": {
                        "settlement": "Changchun",
                        "country": "People's Republic of China"
                    }
                },
                "email": ""
            },
            {
                "first": "Wen",
                "middle": [],
                "last": "Wang",
                "suffix": "",
                "affiliation": {
                    "laboratory": "",
                    "institution": "Jilin University",
                    "location": {
                        "settlement": "Changchun",
                        "country": "People's Republic of China"
                    }
                },
                "email": ""
            },
            {
                "first": "Xiao",
                "middle": [],
                "last": "Yin",
                "suffix": "",
                "affiliation": {
                    "laboratory": "",
                    "institution": "Jilin University",
                    "location": {
                        "settlement": "Changchun",
                        "country": "People's Republic of China"
                    }
                },
                "email": ""
            },
            {
                "first": "Jie",
                "middle": [],
                "last": "Guan",
                "suffix": "",
                "affiliation": {
                    "laboratory": "",
                    "institution": "Jilin University",
                    "location": {
                        "settlement": "Changchun",
                        "country": "People's Republic of China"
                    }
                },
                "email": ""
            },
            {
                "first": "Li",
                "middle": [],
                "last": "Ruan",
                "suffix": "",
                "affiliation": {
                    "laboratory": "",
                    "institution": "Jilin University",
                    "location": {
                        "settlement": "Changchun",
                        "country": "People's Republic of China"
                    }
                },
                "email": ""
            },
            {
                "first": "Wenjie",
                "middle": [],
                "last": "Tan",
                "suffix": "",
                "affiliation": {
                    "laboratory": "",
                    "institution": "Jilin University",
                    "location": {
                        "settlement": "Changchun",
                        "country": "People's Republic of China"
                    }
                },
                "email": ""
            },
            {
                "first": "\u2020",
                "middle": [
                    "H C"
                ],
                "last": "",
                "suffix": "",
                "affiliation": {},
                "email": ""
            },
            {
                "first": "B",
                "middle": [
                    "W"
                ],
                "last": "",
                "suffix": "",
                "affiliation": {},
                "email": ""
            },
            {
                "first": "Y",
                "middle": [
                    "D"
                ],
                "last": "",
                "suffix": "",
                "affiliation": {},
                "email": ""
            }
        ]
    },
    "abstract": [
        {
            "text": "To develop a novel, effective HBV therapeutic vaccine, we constructed two HBV DNA immunogens that contained PreS1, HBSS1, and HBCS1. Several delivery methods, such as intramuscular (i.m.) injection, intramuscular injection plus electroporation (i.m.-EP), and intradermal injection plus electroporation (i.d.-EP) were used in a murine model to analyze and compare the immune responses that were induced by the DNA immunogens. We found that i.d.-EP accelerated specific antibody seroconversion and produced high antibody (anti-PreS1, anti-S, and anti-C antibody) titers after HBSS1 and HBCS1 immunization. Combining the HBSS1 and HBCS1 DNA immunogens with i.d.-EP produced the strongest multiantigen (PreS1, S, and C)-specific cellular immune response and the highest specific PreS1 antibody levels. The results indicated that DNA immunization using HBSS1 and HBCS1 might be an ideal candidate, with its ability to elicit robust B and T cell immune responses against multiantigen when combined with optimized delivery technology. The present study provides a basis for the design and rational application of a novel HBV DNA vaccine.",
            "cite_spans": [],
            "ref_spans": [],
            "section": "Abstract"
        }
    ],
    "body_text": [
        {
            "text": "Hepatitis B virus (HBV) causes acute and chronic hepatitis and is associated with cirrhosis and liver cancer. Although the hepatitis B vaccine has been in use for over 20 years, HBV is still one of the most widespread pathogens (14) . The most widely used HBV vaccine is a subunit vaccine containing the full-length S particle that is expressed by yeast or CHO cells (34) . The HBV vaccine is very effective for mass immunization; however, 5% to 10% of the population do not produce protective anti-HBV surface (HBs) antigen antibodies, and in recent years, the S variant strains have increased in prevalence (5) . The drugs that are currently used for the clinical treatment of hepatitis B include interferon and nucleoside analogues, such as lamivudine (5) . Due to the limited effect of this drug treatment and the adverse reactions to their long-term application, new treatments for HBV, such as therapeutic HBV vaccines, are clearly needed (5) .",
            "cite_spans": [
                {
                    "start": 228,
                    "end": 232,
                    "text": "(14)",
                    "ref_id": "BIBREF14"
                },
                {
                    "start": 367,
                    "end": 371,
                    "text": "(34)",
                    "ref_id": "BIBREF34"
                },
                {
                    "start": 609,
                    "end": 612,
                    "text": "(5)",
                    "ref_id": "BIBREF4"
                },
                {
                    "start": 755,
                    "end": 758,
                    "text": "(5)",
                    "ref_id": "BIBREF4"
                },
                {
                    "start": 945,
                    "end": 948,
                    "text": "(5)",
                    "ref_id": "BIBREF4"
                }
            ],
            "ref_spans": [],
            "section": ""
        },
        {
            "text": "The direct injection of HBV DNA immunogens stimulates strong, long-lasting humoral and cellular immune responses in small-animal and chimpanzee models (11, 18, 22, 25, 27) and has become the focus of research on therapeutic HBV vaccines in recent years. However, applying these results to a larger population does not work well for small-animal models, and a large amount of DNA is needed to stimulate an effective immune response (17) . Therefore, scientists are exploring ways to enhance the immunogenicity of DNA vaccines (1, 16, 30, 32) . Currently, electroporation is the most effective method for DNA vaccine delivery (16, 30, 32) . Electroporation increases antigen (Ag) expression in muscle and skin 10-to 100-fold more than a direct injection, which leads to increased immunogenicity, a more durable response, and a reduced efficient dose in sheep, pigs, and other large animals.",
            "cite_spans": [
                {
                    "start": 151,
                    "end": 155,
                    "text": "(11,",
                    "ref_id": "BIBREF11"
                },
                {
                    "start": 156,
                    "end": 159,
                    "text": "18,",
                    "ref_id": "BIBREF18"
                },
                {
                    "start": 160,
                    "end": 163,
                    "text": "22,",
                    "ref_id": "BIBREF22"
                },
                {
                    "start": 164,
                    "end": 167,
                    "text": "25,",
                    "ref_id": "BIBREF25"
                },
                {
                    "start": 168,
                    "end": 171,
                    "text": "27)",
                    "ref_id": "BIBREF27"
                },
                {
                    "start": 431,
                    "end": 435,
                    "text": "(17)",
                    "ref_id": "BIBREF17"
                },
                {
                    "start": 525,
                    "end": 528,
                    "text": "(1,",
                    "ref_id": "BIBREF0"
                },
                {
                    "start": 529,
                    "end": 532,
                    "text": "16,",
                    "ref_id": "BIBREF16"
                },
                {
                    "start": 533,
                    "end": 536,
                    "text": "30,",
                    "ref_id": "BIBREF30"
                },
                {
                    "start": 537,
                    "end": 540,
                    "text": "32)",
                    "ref_id": "BIBREF32"
                },
                {
                    "start": 624,
                    "end": 628,
                    "text": "(16,",
                    "ref_id": "BIBREF16"
                },
                {
                    "start": 629,
                    "end": 632,
                    "text": "30,",
                    "ref_id": "BIBREF30"
                },
                {
                    "start": 633,
                    "end": 636,
                    "text": "32)",
                    "ref_id": "BIBREF32"
                }
            ],
            "ref_spans": [],
            "section": ""
        },
        {
            "text": "Another strategy for boosting the immunogenicity of DNA vaccines is to fuse exogenous B or T cell epitopes to virus-like particle (VLP) vectors to increase exposure after expression (26) . After expression, a number of viral structural proteins automatically assemble into virus-like particles and can carry modified foreign epitopes without altering the particle's structure. For example, the widely used HBV and human papillomavirus (HPV) vaccines are virus-like particle immunogens. HBs antigen (29) and HBV core (HBc) antigen (10) were two of the first VLP antigens that were used to carry foreign epitopes (8, 9, 13, 15, 20, 23, 28, 31, 33) .",
            "cite_spans": [
                {
                    "start": 182,
                    "end": 186,
                    "text": "(26)",
                    "ref_id": "BIBREF26"
                },
                {
                    "start": 498,
                    "end": 502,
                    "text": "(29)",
                    "ref_id": "BIBREF29"
                },
                {
                    "start": 611,
                    "end": 614,
                    "text": "(8,",
                    "ref_id": null
                },
                {
                    "start": 615,
                    "end": 617,
                    "text": "9,",
                    "ref_id": "BIBREF9"
                },
                {
                    "start": 618,
                    "end": 621,
                    "text": "13,",
                    "ref_id": "BIBREF13"
                },
                {
                    "start": 622,
                    "end": 625,
                    "text": "15,",
                    "ref_id": "BIBREF15"
                },
                {
                    "start": 626,
                    "end": 629,
                    "text": "20,",
                    "ref_id": "BIBREF20"
                },
                {
                    "start": 630,
                    "end": 633,
                    "text": "23,",
                    "ref_id": "BIBREF23"
                },
                {
                    "start": 634,
                    "end": 637,
                    "text": "28,",
                    "ref_id": "BIBREF28"
                },
                {
                    "start": 638,
                    "end": 641,
                    "text": "31,",
                    "ref_id": "BIBREF31"
                },
                {
                    "start": 642,
                    "end": 645,
                    "text": "33)",
                    "ref_id": "BIBREF33"
                }
            ],
            "ref_spans": [],
            "section": ""
        },
        {
            "text": "Previous data have shown that the HBCS1 that is expressed in Escherichia coli, containing core (amino acids [aa] 1 to 144) and PreS1 (aa 1 to 42), can form virus-like particles (33) . Moreover, the HBSS1 that is expressed in CHO cells, containing S (aa 1 to 223) and PreS1 (aa 21 to 47), form stable, secreted virus-like particles with an equivalent molar ratio of PreS1 to S antigens (28) . The two novel virus-like particle protein antigens can stimulate fast, effective humoral immune responses in animal models. Protein vaccines have a long life cycle and a complicated purification process and are expensive. Moreover, they are not effective in eliciting T cell immune responses and usually require adjuvants. In contrast, DNA immunogens are relatively fast to produce, are inexpensive, and can stimulate stronger cellular immune responses than protein immunogens (16) . In the present study, we constructed two DNA plasmids that contain the PreS1 particlelike antigen, i.e., pVRC-HBSS1 and pVRC-HBCS1, containing the S and C gene sequences, respectively, as described previously (28, 33) . The routes of administration of the two DNA immunogens, with and without electroporation, were compared by corresponding cell-mediated and humoral immune responses. Our results demonstrate that an intradermal injection plus electroporation with a combination of core-PreS1 and S-PreS1 can synergistically enhance the effects of the DNA immunogen. Therefore, this method is a potential strategy for the development of a novel HBV vaccine with therapeutic effect.",
            "cite_spans": [
                {
                    "start": 177,
                    "end": 181,
                    "text": "(33)",
                    "ref_id": "BIBREF33"
                },
                {
                    "start": 385,
                    "end": 389,
                    "text": "(28)",
                    "ref_id": "BIBREF28"
                },
                {
                    "start": 869,
                    "end": 873,
                    "text": "(16)",
                    "ref_id": "BIBREF16"
                },
                {
                    "start": 1085,
                    "end": 1089,
                    "text": "(28,",
                    "ref_id": "BIBREF28"
                },
                {
                    "start": 1090,
                    "end": 1093,
                    "text": "33)",
                    "ref_id": "BIBREF33"
                }
            ],
            "ref_spans": [],
            "section": ""
        },
        {
            "text": "To construct the HBV particlelike DNA immunogen plasmids, pVRC-HBSS1 and pVRC-HBCS1, the pVRC8301 plasmid (31) was digested with the restriction enzymes SalI and BamHI. The HBc (aa 1 to 144) and Pre S1 (aa 1 to 42) fusion gene fragment was amplified using PCR with the pET-HBCS1 plasmid (33) and was then digested with SalI and BamHI. The HBCS1 gene was purified from a gel after electrophoresis and was cloned into the SalI and BamHI sites of the pVRC8301 vector, resulting in pVRC-HBCS1. We used the same approach to amplify HBSS1 from the pcHBSS1 plasmid (S antigen, aa 1 to 223; Pre S1 antigen, aa 21 to 47) to create pVRC-HBSS1 (Fig. 1) . The HBV DNA immunogen plasmids were transformed in E. coli (Top 10 strain) and were propagated in LB medium containing kanamycin. The plasmid DNA was isolated and verified using restriction enzyme analysis and sequencing. For the DNA immunization, each DNA plasmid was first amplified in E. coli (Top 10; Invitrogen) and was purified using the Endofree Plasmid Giga kit (Qiagen). The purity of the DNA preparations was determined by reading the optical density at 260 and 280 nm.",
            "cite_spans": [
                {
                    "start": 287,
                    "end": 291,
                    "text": "(33)",
                    "ref_id": "BIBREF33"
                }
            ],
            "ref_spans": [
                {
                    "start": 633,
                    "end": 641,
                    "text": "(Fig. 1)",
                    "ref_id": "FIGREF0"
                }
            ],
            "section": "Plasmid construction and expression in vitro."
        },
        {
            "text": "The expression of the HBV antigen from the DNA immunogen plasmid was confirmed in 293T cells that were transiently transfected with pVRC-HBSS1 and pVRC-HBCS1. The transfected cells were maintained for 48 h at 37\u00b0C with 5% CO 2 and were then fixed with 50% methanol. The expressed HBV recombinant fusion proteins were detected using indirect immunofluorescence (IF) staining and rabbit antisera against HBcAg or HBsAg. The levels of the fusion proteins in the supernatant and 293T cell lysate, harvested after 48 to 72 h, were determined using Western blot analysis (28, 33) .",
            "cite_spans": [
                {
                    "start": 565,
                    "end": 569,
                    "text": "(28,",
                    "ref_id": "BIBREF28"
                },
                {
                    "start": 570,
                    "end": 573,
                    "text": "33)",
                    "ref_id": "BIBREF33"
                }
            ],
            "ref_spans": [],
            "section": "Plasmid construction and expression in vitro."
        },
        {
            "text": "Animals and DNA immunization. Female BALB/c (H-2 d ) mice between 6 and 8 weeks of age (Animal Care Center, Chinese Academy of Medical Science, Beijing, China) were randomly assigned to 10 groups (Table 1 ). In accordance with the Institutional Animal Care and Use Committee (IACUC)-approved protocol, all mice were immunized at weeks 0, 3, and 6 and bled at weeks 0, 2, 5, and 10. The mice were anesthetized and primed with phosphate-buffered saline (PBS) or the plasmid DNA using an injection into the tibialis anterior (TA) muscles (intramuscular [i.m.]; 50 g/100 l) or an intradermal (i.d.) injection into the lower dorsal side (10 g/30 l).",
            "cite_spans": [],
            "ref_spans": [
                {
                    "start": 196,
                    "end": 204,
                    "text": "(Table 1",
                    "ref_id": "TABREF0"
                }
            ],
            "section": "Plasmid construction and expression in vitro."
        },
        {
            "text": "The gene delivery using in vivo electroporation (EP) was performed as previously described (1, 30, 32) . In brief, for the i.m. immunization, the DNA plasmids in PBS (50 l per site; 50 g/dose) were injected into the TA muscle and were immediately pulsed with electricity using a two-needle array electrode (ECM830; BTX) with needles that were 5 mm apart. For the i.d. immunization, the DNA plasmids in PBS (25 l per site; 10 g/dose) were injected intradermally into the lower dorsal side. After 20 to 30 s, an in vivo EP was applied using a square-wave pulse generator (ECM830; BTX) with a caliper electrode that consisted of two brass plate electrodes (1 by 1 cm). The EP parameters were as follows: i.m., 27.5 v/mm, 20 ms, 8 times, with a 1-s interval between EPs; i.d., 10 v/mm, 15 ms, 3 times, followed by a reverse electrode at 7.5 v/mm, 20 ms, 3 times, with a 1-s interval between EPs.",
            "cite_spans": [
                {
                    "start": 91,
                    "end": 94,
                    "text": "(1,",
                    "ref_id": "BIBREF0"
                },
                {
                    "start": 95,
                    "end": 98,
                    "text": "30,",
                    "ref_id": "BIBREF30"
                },
                {
                    "start": 99,
                    "end": 102,
                    "text": "32)",
                    "ref_id": "BIBREF32"
                }
            ],
            "ref_spans": [],
            "section": "Plasmid construction and expression in vitro."
        },
        {
            "text": "Serum samples were collected as scheduled, and the separated serum was stored at \u03ea70\u00b0C. The mice were sacrificed 4 weeks after the last immunization. The spleens of the mice were removed, and a single-cell suspension of the splenocytes was prepared as previously described. The final splenocyte preparations contained 2 \u03eb 10 6 or 5 \u03eb 10 6 cells/ml in R10 medium (RPMI 1640 medium with 10% fetal bovine serum [FBS] and 1% penicillin-streptomycin).",
            "cite_spans": [],
            "ref_spans": [],
            "section": "Plasmid construction and expression in vitro."
        },
        {
            "text": "ELISA. The mouse sera were tested for an HBV antigen-specific IgG antibody (anti-PreS1, anti-S, and anti-C) response using a commercially available enzymelinked immunosorbent assay (ELISA) kit (WanTai Co.) according to the manufacturer's instructions (9) . The optical density was read using a 450-nm ELISA reader (Bio-Rad). The end titration titer was determined when the reading at the last serum dilution was 2-fold greater than that of the negative-control wells that contained normal mouse sera.",
            "cite_spans": [
                {
                    "start": 251,
                    "end": 254,
                    "text": "(9)",
                    "ref_id": "BIBREF9"
                }
            ],
            "ref_spans": [],
            "section": "Plasmid construction and expression in vitro."
        },
        {
            "text": "The determination of the IgG subclass was conducted as described previously (22) . The serum samples from the immunized mice were diluted 1:100, and the IgG subclass was determined using a murine antibody-isotyping ELISA kit (Sigma). Biotinylated rat anti-mouse IgG1 (1:1,000) or biotinylated rat antimouse IgG2a and IgG2b (1:2,000) were used as controls.",
            "cite_spans": [
                {
                    "start": 76,
                    "end": 80,
                    "text": "(22)",
                    "ref_id": "BIBREF22"
                }
            ],
            "ref_spans": [],
            "section": "Plasmid construction and expression in vitro."
        },
        {
            "text": "ELISpot analysis of antigen-specific T cells. Enzyme-linked immunospot (ELISpot) assays were performed on fresh mouse splenocytes, as previously described (9) . Multiscreen Immobilon P filtration plates (Millipore) were coated with 5 g/ml of purified rat anti-mouse gamma interferon (IFN-\u2425) IgG1 (clone R4-6A2; BD Biosciences) in PBS, and incubated at 4\u00b0C overnight. Afterward, these plates were washed 3 times with PBS, and each plate was blocked with 200 l of R10 medium per well for 2 to 3 h at 37\u00b0C. The peptides that were used in the present study were synthesized using an Applied Biosystems (Foster City, CA) 430A peptide synthesizer and 9-fluorenylmethyl carbonate (Fmoc) chemistry. After synthesis, the peptides were cleaved from the resin, and the protecting groups were removed. The peptides were purified using reverse-phase highperformance liquid chromatography (HPLC) to a purity of \u03fe95% and were characterized using mass spectrometry. The HBV PreS1 antigen-relevant peptides used were an 8-peptide array of 9-mers (GQNLSTSNP, STSNPLGFF, LGFFPDHQL, DHQLDPAFR, DPAFRANTA, RANTANPDW, NPDWDF NPN, and NPNKDTWPD). The HBV S antigen-relevant peptides used were separated into two pools of peptides: S-1 (VLQAGFFL, IPQSLDSWWTSL, and FLGGTPVCL, selected from amino acids 13 to 49 of S Ag) and S-2 (LLDYQ GMLP, GLSPTVWLS, and SILSPFIPLL, selected from amino acids 97 to 215 of S Ag). The HBV core antigen-relevant peptides used were a 4-peptide array (FLPSDFFPSV, YVNVNWGLK, CLTFGRETV, and TPPATRPPNAPLL). The HIV Env V3 (IGPGRAFYT) peptide was used as the nonrelevant negative control. The peptides (final concentration, 4 g/ml) were added to the wells with 100 l of freshly isolated splenocytes (100,000 or 500,000 cells/well in R10 medium) in duplicate. The plates were incubated for 20 to 24 h overnight at 37\u00b0C in 5% CO 2 . The plates were then washed, incubated with 100 l biotinylated rat anti-mouse IFN-\u2425 IgG1 (clone XMG1.2; BD Biosciences; 1 g/ml in PBS with 0.005% Tween 20 and 5% FBS), and incubated at 4\u00b0C overnight. After additional washes, 100 l of alkaline phosphatase-conjugated streptavidin complex (BD Bioscience) was added to each well and incubated for 2 h at room temperature. The plates were washed, and any spots representing individual IFN-\u2425-producing cells were detected after a 7-min color reaction using 1-Step nitroblue tetrazolium/5-bromo-4-chloro-3-indolylphosphate (NBT/BCIP) (Pierce). The IFN-\u2425 spot-forming cells (SFCs) were counted. The results are expressed as the number of SFCs per 10 6 input cells. The number of peptide-specific IFN-\u2425-secreting T cells was calculated by subtracting the background (no-peptide) control value from the established SFC count.",
            "cite_spans": [
                {
                    "start": 155,
                    "end": 158,
                    "text": "(9)",
                    "ref_id": "BIBREF9"
                }
            ],
            "ref_spans": [],
            "section": "Plasmid construction and expression in vitro."
        },
        {
            "text": "Statistical analysis. The statistical analyses were performed using analysis of variance (ANOVA), a Student-Newman-Keuls test, and a Pearson correlation analysis using SSPS 10.0. Differences with a P value of \u03fd0.05 were considered to be statistically significant.",
            "cite_spans": [],
            "ref_spans": [],
            "section": "Plasmid construction and expression in vitro."
        },
        {
            "text": "Our previous studies have shown that the fusion of amino acids 21 through 47 of HBV PreS1 (which may be the receptor-binding domain) to the C-terminal domain of the truncated S antigen (aa 1 to 223) results in the expression plasmid pCHBSS1. This plasmid can form a stable VLP structure antigen in CHO cells and can stimulate an immune response after in vitro immunization (9, 28) . Moreover, the fusion of amino acids 1 through 42 of the HBV PreS1 protein to the C terminus of the truncated core antigen (aa 1 to 144) resulted in the expression plasmid pET-HBCS1, which can also form VLP antigens in E. coli (8, 33) . Therefore, in the present study, we used PCR and restriction enzyme digestion to clone the two PreS1 antigens into the DNA vaccine vector pVRC and to form two candidate DNA immunogens, pVRC-HBSS1 and pVRC-HBCS1 (Fig. 1) . The in vitro transient transfection of the 293T cells confirmed the effective expression of the two fusion antigens by IF assay (IFA) and Western blot analysis using Ag-specific antibody (Fig. 2) . CS1 antigen was produced as 20 kDa. The SS1 antigen was detected as two protein species (molecular masses, 24 kDa and 27 kDa), presumably reflecting both nonglycosylated and glycosylated forms of SS1. These results are consistent with those of previous reports (28, 33) .",
            "cite_spans": [
                {
                    "start": 373,
                    "end": 376,
                    "text": "(9,",
                    "ref_id": "BIBREF9"
                },
                {
                    "start": 377,
                    "end": 380,
                    "text": "28)",
                    "ref_id": "BIBREF28"
                },
                {
                    "start": 609,
                    "end": 612,
                    "text": "(8,",
                    "ref_id": null
                },
                {
                    "start": 613,
                    "end": 616,
                    "text": "33)",
                    "ref_id": "BIBREF33"
                },
                {
                    "start": 1300,
                    "end": 1304,
                    "text": "(28,",
                    "ref_id": "BIBREF28"
                },
                {
                    "start": 1305,
                    "end": 1308,
                    "text": "33)",
                    "ref_id": "BIBREF33"
                }
            ],
            "ref_spans": [
                {
                    "start": 830,
                    "end": 838,
                    "text": "(Fig. 1)",
                    "ref_id": "FIGREF0"
                },
                {
                    "start": 1028,
                    "end": 1036,
                    "text": "(Fig. 2)",
                    "ref_id": null
                }
            ],
            "section": "Construction, expression, and identification of the DNA immunogen."
        },
        {
            "text": "Electroporation can accelerate the process of seroconversion and enhance the antibody response. To improve the immunogenicity of the DNA immunogen and to optimize the immunization program, we divided the mice into four groups, with 6 mice in each group ( Table 1 ). The three immunization methods that were performed were i.m, intramuscular injection plus electroporation (i.m.-EP) (using a two-array needle), and intradermal injection plus electroporation (i.d.-EP) (using a caliper electrode). The DNA-immunizing dose for the i.d. group was 10 g, which was approximately one-fifth that of the i.m. group (50 g).",
            "cite_spans": [],
            "ref_spans": [
                {
                    "start": 255,
                    "end": 262,
                    "text": "Table 1",
                    "ref_id": "TABREF0"
                }
            ],
            "section": "Construction, expression, and identification of the DNA immunogen."
        },
        {
            "text": "Two weeks after single or double HBV DNA immunization, the eyes and sera of the mice were sampled and diluted 1:10. Next, an ELISA was used to determine whether seroconversion with the specific antibodies (anti-PreS1, anti-S, and anti-C) had occurred. No seroconversion with anti-S or anti-C antibody was observed in the single-dose injection group, whereas seroconversion with anti-PreS1 antibodies was observed in the electroporation group. In the pVRC-HBSS1 immunogen group, the anti-PreS1 seroconversion rate of the i.d.-EP group (5/6) was significantly higher than that of the i.m.-EP group (1/6 or 2/6). Immune seroconversion (1/6 or 2/6) with anti-S or anti-C antibody was observed after the i.m. injection in the double-immunization group; however, the amount of seroconversion was significantly lower than that in the injection plus electroporation group (3/6 to 6/6). The i.m.-EP group exhibited the highest seroconversion rate (5/6 or 6/6) of all groups.",
            "cite_spans": [],
            "ref_spans": [],
            "section": "Construction, expression, and identification of the DNA immunogen."
        },
        {
            "text": "After three immunizations with the DNA immunogen, the specific antibody titer was determined using an ELISA (Fig. 3) . There was no statistically significant difference between the anti-S antibody titers within each group; however, the dose that was required to induce antibodies in the i. There was no significant difference between the three groups after pVRC-HBCS1 immunization. The mean antibody titers of the two electroporation groups were slightly higher than that of the direct i.m. group, and that in the i.m.-EP group that was immunized with both plasmids was higher than that in the group immunized with individual plasmids, likely due to the supplementary effect of the PerS1 antigen encoded by both plasmids. In short, these results indicate that the electroporation of a DNA immunogen can accelerate seroconversion and increase the level of the antibody response. Moreover, an intradermal injection plus electroporation is superior to an intramuscular injection plus electroporation, as it induces higher antibody levels and accelerated seroconversion with specific antibodies.",
            "cite_spans": [],
            "ref_spans": [
                {
                    "start": 108,
                    "end": 116,
                    "text": "(Fig. 3)",
                    "ref_id": null
                }
            ],
            "section": "Construction, expression, and identification of the DNA immunogen."
        },
        {
            "text": "The IgG subtype after immunization with several HBV DNA immunogens. To further understand the immune response of each group after immunization, we also analyzed the IgG subtype that was induced in each group with 1:100-diluted blood samples that were collected 4 weeks after the last immunization (Fig. 4) . The IgG subtypes of the antibodies against the S and core antigens that were induced by the DNA immunogen were mainly composed of IgG2a, whereas the anti-PreS1 antibody subtypes were mixtures of IgG1, IgG2a, and IgG2b. There was a slightly larger amount of IgG1 antibodies than of IgG2a antibodies against PreS1, and the IgG2b subtype antibodies were observed in all of the groups that contained pVRC-HBSS1. In summary, the DNA immunogen induced a Th1-type immune response against the C and S antigens; however, the immune response against the PreS1 antigen was diverse and was slightly biased in favor of the Th2-type response.",
            "cite_spans": [],
            "ref_spans": [
                {
                    "start": 297,
                    "end": 305,
                    "text": "(Fig. 4)",
                    "ref_id": null
                }
            ],
            "section": "Construction, expression, and identification of the DNA immunogen."
        },
        {
            "text": "A combination of the two HBV DNA immunogens that were administered using intradermal electroporation can synergistically enhance the antigen-specific cellular immune response. The cellular immune response is the most critical assessment index of the effectiveness of therapeutic vaccines. Therefore, we used IFN-\u2425 ELISpot to detect the antigen-specific IFN-\u2425secreting cells in the spleen cells of mice 4 weeks after they received three DNA immunizations. The peptide library that was used to stimulate the spleen cells is described above, and the results are shown in Fig. 5 .",
            "cite_spans": [],
            "ref_spans": [
                {
                    "start": 568,
                    "end": 574,
                    "text": "Fig. 5",
                    "ref_id": null
                }
            ],
            "section": "Construction, expression, and identification of the DNA immunogen."
        },
        {
            "text": "Of the cells that secreted IFN-\u2425 specifically in response to the S, C, and PreS1 antigens, the S-specific SFC readings were the highest. The reading after stimulation with the S-1-specific peptide pool was significantly higher than that from the S-2specific peptide pool (Fig. 5A) . The S antigen-specific SFC readings among all groups were significant; however, the number of IFN-\u2425-secreting cells in response to C and PreS1 after immunization with a single plasmid (pVRC-HBSS1 or pVRC-HBCS1) was low (\u03fd50 SFC/10 6 spleen cells) and was not statistically different. Interestingly, after immunization with both plasmids (pVRC-HBSS1 and pVRC-HBCS1) and intradermal electroporation, the PreS1-and C-specific SFC levels were higher than 50 SFC/10 6 spleen cells, which was significantly higher than that of the single-plasmid DNA immunogen groups. The S antigen-specific SFC levels were higher than 500 SFC/10 6 spleen cells in the group with both plasmids with intradermal electroporation. Therefore, the dual-plasmid DNA immunogens with intradermal electroporation can synergistically enhance the antigen-specific cellular immune responses.",
            "cite_spans": [],
            "ref_spans": [
                {
                    "start": 271,
                    "end": 280,
                    "text": "(Fig. 5A)",
                    "ref_id": null
                }
            ],
            "section": "Construction, expression, and identification of the DNA immunogen."
        },
        {
            "text": "Traditional vaccines are designed to induce high titers of neutralizing antibodies. However, a number of intracellular pathogens, including HBV, can still cause a persistent infection (34) . In addition to neutralizing antibodies, the specific cellular immune responses support antibody production and are also crucial to the control and clearance of infections (5, 34) . Many immunological studies (34) have shown that strong cellular immune responses to specific HBV proteins (including Th cells and cytotoxic T lymphocytes [CTL]) are detected during the FIG. 3 . Antibody responses elicited by HBV DNA vaccines that were administered using an injection or an injection plus EP. Each group of mice (6 mice/group) was immunized using the plasmid at either 50 g (i.m.) or 10 g (i.d.) in PBS three times at 3-week intervals. The antisera were collected at 28 days postimmunization, and the total IgG titers that were specific for the HBV antigen were determined using an ELISA and plotted as described in Materials and Methods. The symbols represent the titers of the sera from the individual mice. The horizontal lines represent the means (n \u03ed 6). The experiments were repeated at least three times, and similar results were obtained. acute phase of an HBV infection in recovering patients, but in patients with chronic persistent HBV infection, the cellular immune responses are very weak or undetectable. The animal experiment results show that the secreted Th1 cytokines, including IFN and tumor necrosis factor alpha (TNF-\u2423), can eliminate a liver HBV infection in transgenic mice. Therefore, the simultaneous induction of strong humoral and cellular immune responses to multiple antigens is the goal for the development of a new therapeutic HBV vaccine (5) . Most of the therapeutic HBV vaccines in ongoing clinical trials have used envelope proteins as the target antigen, but other antigens (such as core, PreS, and polymerase) are also specific targets of the immune response during self-limiting hepatitis B. As previously reported, HBVc antigen contains multiple Th and CTL epitopes (9, 15) , and the HBc-specific cellular immune response might cause a self-limiting HBV infection (34) . Truncated HBc antigen-specific heterologous epitopes may be used as effective VLP vectors and can significantly enhance the heterologous epitope immunogenicity and immune response of Th1 cells (8, 20) . In addition, the HBs antigen that is expressed in CHO cells or yeast can self-assemble into 22-nm spherical VLPs and has been used to provide effective protection for the commercially available HBV vaccine (34) . A novel immunization approach, based on the use of a combination of recombinant HBsAg and HBcAg (which both form virus-like particles), known as \"NASVAC,\" is currently being developed for both the prevention and cure of hepatitis B (2). The vaccine was found to be safe and immunogenic, eliciting anti-HBc and anti-HBs seroconversion in a phase I/II trial (3, 6) .To our knowledge, PreS1 is the priority target antigen for the new HBV vaccines, because PreS1 has a greater number of immunogenic T cell and B cell epitopes than the S protein (9, 12, 15) , including a strong T cell epitope (aa 21 to 28) and an effective B cell epitope (aa 12 to 32 and 32 to 53). The PreS1 protein has binding sites for liver cells (aa 21 to 47) that play an important role in viral attachment and entry (13, 15) . Neurath et al. have shown that direct immunization with a PreS1 polypeptide (aa 21 to 47) can protect against HBV infection in chimpanzees (21) . Additionally, the PreS1 antibody is produced earlier than the S antibody, and the PreS1-specific cell-mediated immunity may help overcome immune unresponsiveness to the S protein in certain individuals (19, 24) . Therefore, the PreS1 antigen may play an important role in the neutralization, blockade, and clearance of HBV infections. In the present study, we constructed two kinds of particle-like structures expressing plasmids containing S and PreS1 antigens that contained HBVneutralizing epitopes and a C antigen to induce a Th1-type response. Our results suggest that DNA immunogens that contain HBSS1 and HBCS1 can generate powerful cellular immune responses, and the PreS1 antibody was indeed produced earlier than the S antibody. Furthermore, this response was specific to multiple antigens (PreS1, S, and C) and was biased in favor of the Th1-type response, as indicated by the production of IgG2a anti-C and anti-S antibodies.",
            "cite_spans": [
                {
                    "start": 184,
                    "end": 188,
                    "text": "(34)",
                    "ref_id": "BIBREF34"
                },
                {
                    "start": 362,
                    "end": 365,
                    "text": "(5,",
                    "ref_id": "BIBREF4"
                },
                {
                    "start": 366,
                    "end": 369,
                    "text": "34)",
                    "ref_id": "BIBREF34"
                },
                {
                    "start": 399,
                    "end": 403,
                    "text": "(34)",
                    "ref_id": "BIBREF34"
                },
                {
                    "start": 557,
                    "end": 563,
                    "text": "FIG. 3",
                    "ref_id": null
                },
                {
                    "start": 1758,
                    "end": 1761,
                    "text": "(5)",
                    "ref_id": "BIBREF4"
                },
                {
                    "start": 2093,
                    "end": 2096,
                    "text": "(9,",
                    "ref_id": "BIBREF9"
                },
                {
                    "start": 2097,
                    "end": 2100,
                    "text": "15)",
                    "ref_id": "BIBREF15"
                },
                {
                    "start": 2191,
                    "end": 2195,
                    "text": "(34)",
                    "ref_id": "BIBREF34"
                },
                {
                    "start": 2391,
                    "end": 2394,
                    "text": "(8,",
                    "ref_id": null
                },
                {
                    "start": 2395,
                    "end": 2398,
                    "text": "20)",
                    "ref_id": "BIBREF20"
                },
                {
                    "start": 2607,
                    "end": 2611,
                    "text": "(34)",
                    "ref_id": "BIBREF34"
                },
                {
                    "start": 2970,
                    "end": 2973,
                    "text": "(3,",
                    "ref_id": "BIBREF2"
                },
                {
                    "start": 2974,
                    "end": 2976,
                    "text": "6)",
                    "ref_id": "BIBREF5"
                },
                {
                    "start": 3155,
                    "end": 3158,
                    "text": "(9,",
                    "ref_id": "BIBREF9"
                },
                {
                    "start": 3159,
                    "end": 3162,
                    "text": "12,",
                    "ref_id": "BIBREF12"
                },
                {
                    "start": 3163,
                    "end": 3166,
                    "text": "15)",
                    "ref_id": "BIBREF15"
                },
                {
                    "start": 3401,
                    "end": 3405,
                    "text": "(13,",
                    "ref_id": "BIBREF13"
                },
                {
                    "start": 3406,
                    "end": 3409,
                    "text": "15)",
                    "ref_id": "BIBREF15"
                },
                {
                    "start": 3412,
                    "end": 3431,
                    "text": "Neurath et al. have",
                    "ref_id": null
                },
                {
                    "start": 3551,
                    "end": 3555,
                    "text": "(21)",
                    "ref_id": "BIBREF21"
                },
                {
                    "start": 3760,
                    "end": 3764,
                    "text": "(19,",
                    "ref_id": "BIBREF19"
                },
                {
                    "start": 3765,
                    "end": 3768,
                    "text": "24)",
                    "ref_id": "BIBREF24"
                }
            ],
            "ref_spans": [],
            "section": "DISCUSSION"
        },
        {
            "text": "The major current challenge associated with the use of DNA immunogens is to determine ways to enhance the response of the immune system (16) . Recently, reports (1, 30, 32) have indicated that in vivo electroporation can significantly enhance the cellular uptake of exogenous DNA and that the expression of exogenous protein can lead to the aggregation of local inflammatory factors. Thus, the humoral and cellular immune responses that are induced by DNA immunogens can be simultaneously increased. As a result, the effective dose of the DNA immunogen can be greatly reduced in the large-animal model (4) . Furthermore, many preclinical and clinical studies have indicated that in vivo electroporation is a safe, effective, and acceptable method in animals and human beings (7) . Therefore, in the present study, in addition to a conventional direct intramuscular injection, we applied two immunization methods with in vivo electroporation. Our results indicate that an intradermal injection plus electroporation increases the amount of specific antibody seroconversion. Moreover, small doses (10 g) resulted in humoral and cellular immune responses that were as robust as those achieved by high doses (50 g) of a direct immunization. Interestingly, we found that the core-and PreS1-specific immune responses induced by separate HBCS1 or HBSS1 plasmids were weak; however, a com- FIG. 4 . Subtype analysis of the HBV antigen-specific IgGs in mouse sera that were exposed to the HBV DNA vaccines. The antigenspecific IgG1 and IgG2a or IgG2b were measured using an IgGisotyping ELISA, as described in Materials and Methods. The mouse sera were collected 4 weeks after the 3rd DNA immunization and were diluted 1:100. The bars indicate the average optical density at 450 nm (OD 450 ) of the IgG subtype-derived mixed sera of each group. on March 24, 2020 by guest http://cvi.asm.org/ bined HBSS1/HBCS1 DNA immunogen using i.d.-EP induced the most powerful immune responses to PreS1, S, and C antigens. Immunization with DNA immunogens that contain the weak antigen CS1 and the strong antigen SS1 can synergistically enhance the cellular immune response. Therefore, the specific molecular mechanism that is responsible for this phenomenon deserves further study.",
            "cite_spans": [
                {
                    "start": 136,
                    "end": 140,
                    "text": "(16)",
                    "ref_id": "BIBREF16"
                },
                {
                    "start": 161,
                    "end": 164,
                    "text": "(1,",
                    "ref_id": "BIBREF0"
                },
                {
                    "start": 165,
                    "end": 168,
                    "text": "30,",
                    "ref_id": "BIBREF30"
                },
                {
                    "start": 169,
                    "end": 172,
                    "text": "32)",
                    "ref_id": "BIBREF32"
                },
                {
                    "start": 602,
                    "end": 605,
                    "text": "(4)",
                    "ref_id": "BIBREF3"
                },
                {
                    "start": 775,
                    "end": 778,
                    "text": "(7)",
                    "ref_id": "BIBREF6"
                },
                {
                    "start": 1381,
                    "end": 1387,
                    "text": "FIG. 4",
                    "ref_id": null
                }
            ],
            "ref_spans": [],
            "section": "DISCUSSION"
        },
        {
            "text": "In conclusion, our study indicated that the combined DNA immunogen and immunization program is an important first step in the development of a new and effective therapeutic HBV vaccine and is worthy of further evaluation and application in large animals and humans. We also believe that with the further integration of molecular adjuvants with vaccine and various boosting approaches, this novel immunization program may become the best candidate strategy for research into and development of a new therapeutic HBV vaccine.",
            "cite_spans": [],
            "ref_spans": [],
            "section": "DISCUSSION"
        }
    ],
    "bib_entries": {
        "BIBREF0": {
            "ref_id": "b0",
            "title": "DNA vaccines: developing new strategies to enhance immune responses",
            "authors": [
                {
                    "first": "S",
                    "middle": [
                        "A"
                    ],
                    "last": "Abdulhaqq",
                    "suffix": ""
                },
                {
                    "first": "D",
                    "middle": [
                        "B"
                    ],
                    "last": "Weiner",
                    "suffix": ""
                }
            ],
            "year": 2008,
            "venue": "Immunol. Res",
            "volume": "42",
            "issn": "",
            "pages": "219--232",
            "other_ids": {}
        },
        "BIBREF1": {
            "ref_id": "b1",
            "title": "Development of a nasal vaccine for chronic hepatitis B infection that uses the ability of hepatitis B core antigen to stimulate a strong Th1 response against hepatitis B surface antigen",
            "authors": [
                {
                    "first": "J",
                    "middle": [
                        "C"
                    ],
                    "last": "Aguilar",
                    "suffix": ""
                }
            ],
            "year": 2004,
            "venue": "Immunol. Cell Biol",
            "volume": "82",
            "issn": "",
            "pages": "539--546",
            "other_ids": {}
        },
        "BIBREF2": {
            "ref_id": "b2",
            "title": "A therapeutic nasal vaccine combining both HBsAg and HBcAg was safe, has antiviral potential and induced antigen-specific immunity in patients with chronic hepatitis B",
            "authors": [
                {
                    "first": "S",
                    "middle": [
                        "M"
                    ],
                    "last": "Akbar",
                    "suffix": ""
                }
            ],
            "year": 2010,
            "venue": "Hepatol. Int",
            "volume": "4",
            "issn": "",
            "pages": "",
            "other_ids": {}
        },
        "BIBREF3": {
            "ref_id": "b3",
            "title": "Electroporation improves the efficacy of DNA vaccines in large animals",
            "authors": [
                {
                    "first": "S",
                    "middle": [],
                    "last": "Babiuk",
                    "suffix": ""
                }
            ],
            "year": 2002,
            "venue": "Vaccine",
            "volume": "20",
            "issn": "",
            "pages": "3399--3408",
            "other_ids": {}
        },
        "BIBREF4": {
            "ref_id": "b4",
            "title": "Therapeutic vaccination and novel strategies to treat chronic HBV infection",
            "authors": [
                {
                    "first": "A",
                    "middle": [],
                    "last": "Bertoletti",
                    "suffix": ""
                },
                {
                    "first": "A",
                    "middle": [],
                    "last": "Gehring",
                    "suffix": ""
                }
            ],
            "year": 2009,
            "venue": "Expert Rev. Gastroenterol. Hepatol",
            "volume": "3",
            "issn": "",
            "pages": "561--569",
            "other_ids": {}
        },
        "BIBREF5": {
            "ref_id": "b5",
            "title": "Phase I clinical trial in healthy adults of a nasal vaccine candidate containing recombinant hepatitis B surface and core antigens",
            "authors": [
                {
                    "first": "A",
                    "middle": [
                        "A"
                    ],
                    "last": "Betancourt",
                    "suffix": ""
                }
            ],
            "year": 2007,
            "venue": "Int. J. Infect. Dis",
            "volume": "11",
            "issn": "",
            "pages": "394--401",
            "other_ids": {}
        },
        "BIBREF6": {
            "ref_id": "b6",
            "title": "Electroporation for the delivery of DNA-based vaccines and immunotherapeutics: current clinical developments",
            "authors": [
                {
                    "first": "A",
                    "middle": [
                        "M"
                    ],
                    "last": "Bodles-Brakhop",
                    "suffix": ""
                },
                {
                    "first": "R",
                    "middle": [],
                    "last": "Heller",
                    "suffix": ""
                },
                {
                    "first": "R",
                    "middle": [],
                    "last": "Draghia-Akli",
                    "suffix": ""
                }
            ],
            "year": 2009,
            "venue": "Mol. Ther",
            "volume": "17",
            "issn": "",
            "pages": "585--592",
            "other_ids": {}
        },
        "BIBREF8": {
            "ref_id": "b8",
            "title": "ELISpot analysis of IFN-\u2425 secretion in mouse splenocytes immunized with HBV DNA vaccines as indicated. (A) Sample wells with spots with mock or HBV peptide stimulation. (B) Frequencies of HBV peptide-specific spots per million splenocytes in HBSS1, HBCS1, or combined vaccine (HBSS1-HBCS1)-immunized mice. The data represent the average numbers of SFCs per million splenocytes from 6 mice/group plus standard deviations. The splenocytes were collected 4 weeks after the 3rd DNA immunization. core antigen carrying preS1 epitopes induce immune response against chronic HBV infection",
            "authors": [
                {
                    "first": "",
                    "middle": [],
                    "last": "Fig",
                    "suffix": ""
                }
            ],
            "year": null,
            "venue": "Vaccine",
            "volume": "22",
            "issn": "",
            "pages": "439--446",
            "other_ids": {}
        },
        "BIBREF9": {
            "ref_id": "b9",
            "title": "Impact of different adjuvants on immunogenicity of HBV particle vaccine containing the S\u03e9PreS1 fusion antigen in Balb/C mice",
            "authors": [
                {
                    "first": "H",
                    "middle": [],
                    "last": "Chen",
                    "suffix": ""
                }
            ],
            "year": 2010,
            "venue": "Chinese J. Biotechnol",
            "volume": "26",
            "issn": "",
            "pages": "74--78",
            "other_ids": {}
        },
        "BIBREF10": {
            "ref_id": "b10",
            "title": "Improved immunogenicity of a peptide epitope after fusion to hepatitis B core protein",
            "authors": [
                {
                    "first": "B",
                    "middle": [
                        "E"
                    ],
                    "last": "Clarke",
                    "suffix": ""
                }
            ],
            "year": 1987,
            "venue": "Nature",
            "volume": "330",
            "issn": "",
            "pages": "381--384",
            "other_ids": {}
        },
        "BIBREF11": {
            "ref_id": "b11",
            "title": "DNA vaccine for hepatitis B: evidence for immunogenicity in chimpanzees and comparison with other vaccines",
            "authors": [
                {
                    "first": "H",
                    "middle": [
                        "L"
                    ],
                    "last": "Davis",
                    "suffix": ""
                },
                {
                    "first": "M",
                    "middle": [
                        "J"
                    ],
                    "last": "Mccluskie",
                    "suffix": ""
                },
                {
                    "first": "J",
                    "middle": [
                        "L"
                    ],
                    "last": "Gerin",
                    "suffix": ""
                },
                {
                    "first": "R",
                    "middle": [
                        "H"
                    ],
                    "last": "Purcell",
                    "suffix": ""
                }
            ],
            "year": 1996,
            "venue": "Proc. Natl. Acad. Sci. U. S. A",
            "volume": "93",
            "issn": "",
            "pages": "7213--7218",
            "other_ids": {}
        },
        "BIBREF12": {
            "ref_id": "b12",
            "title": "The preS1 antigen of HBV is highly immunogenic at T-cell level in man",
            "authors": [
                {
                    "first": "C",
                    "middle": [],
                    "last": "Ferrari",
                    "suffix": ""
                }
            ],
            "year": 1989,
            "venue": "J. Clin. Invest",
            "volume": "84",
            "issn": "",
            "pages": "1314--1319",
            "other_ids": {}
        },
        "BIBREF13": {
            "ref_id": "b13",
            "title": "Immunization with a plasmid encoding a modified hepatitis B surface antigen carrying the receptor-binding site for hepatocytes",
            "authors": [
                {
                    "first": "J",
                    "middle": [],
                    "last": "Hui",
                    "suffix": ""
                }
            ],
            "year": 1999,
            "venue": "Vaccine",
            "volume": "17",
            "issn": "",
            "pages": "1711--1718",
            "other_ids": {}
        },
        "BIBREF14": {
            "ref_id": "b14",
            "title": "Worldwide epidemiology of HBV infection, disease burden, and vaccine prevention",
            "authors": [
                {
                    "first": "D",
                    "middle": [],
                    "last": "Leachy",
                    "suffix": ""
                }
            ],
            "year": 2005,
            "venue": "J. Clin. Virol",
            "volume": "34",
            "issn": "",
            "pages": "1--3",
            "other_ids": {}
        },
        "BIBREF15": {
            "ref_id": "b15",
            "title": "Immunization with the HBV core 18-27 epitope elicits CTL responses in humans expressing different HLA-A2 supertype molecules",
            "authors": [
                {
                    "first": "B",
                    "middle": [
                        "D"
                    ],
                    "last": "Livingston",
                    "suffix": ""
                }
            ],
            "year": 1999,
            "venue": "Hum. Immunol",
            "volume": "60",
            "issn": "",
            "pages": "1013--1017",
            "other_ids": {}
        },
        "BIBREF16": {
            "ref_id": "b16",
            "title": "Current progress of DNA vaccine studies in humans",
            "authors": [
                {
                    "first": "S",
                    "middle": [],
                    "last": "Lu",
                    "suffix": ""
                },
                {
                    "first": "S",
                    "middle": [],
                    "last": "Wang",
                    "suffix": ""
                },
                {
                    "first": "J",
                    "middle": [
                        "M"
                    ],
                    "last": "Grimes-Serrano",
                    "suffix": ""
                }
            ],
            "year": 2008,
            "venue": "Expert Rev. Vaccines",
            "volume": "7",
            "issn": "",
            "pages": "175--191",
            "other_ids": {}
        },
        "BIBREF17": {
            "ref_id": "b17",
            "title": "Immunogenicity of a hepatitis B DNA vaccine administered to chronic HBV carriers",
            "authors": [
                {
                    "first": "M",
                    "middle": [],
                    "last": "Mancini-Bourgine",
                    "suffix": ""
                },
                {
                    "first": "H",
                    "middle": [],
                    "last": "Fontaine",
                    "suffix": ""
                },
                {
                    "first": "C",
                    "middle": [],
                    "last": "Brechot",
                    "suffix": ""
                },
                {
                    "first": "S",
                    "middle": [],
                    "last": "Pol",
                    "suffix": ""
                },
                {
                    "first": "M",
                    "middle": [
                        "L"
                    ],
                    "last": "Michel",
                    "suffix": ""
                }
            ],
            "year": 2006,
            "venue": "Vaccine",
            "volume": "24",
            "issn": "",
            "pages": "4482--4489",
            "other_ids": {}
        },
        "BIBREF18": {
            "ref_id": "b18",
            "title": "DNA-mediated immunization to the hepatitis B surface antigen in mice: aspects of the humoral response mimic hepatitis B viral infection in humans",
            "authors": [
                {
                    "first": "M",
                    "middle": [
                        "L"
                    ],
                    "last": "Michel",
                    "suffix": ""
                }
            ],
            "year": 1995,
            "venue": "Proc. Natl. Acad. Sci. U. S. A",
            "volume": "92",
            "issn": "",
            "pages": "5307--5311",
            "other_ids": {}
        },
        "BIBREF19": {
            "ref_id": "b19",
            "title": "T-cell recognition of preS regions of HbsAg can bypass nonresponse to the S region",
            "authors": [
                {
                    "first": "D",
                    "middle": [
                        "R"
                    ],
                    "last": "Milich",
                    "suffix": ""
                },
                {
                    "first": "A",
                    "middle": [],
                    "last": "Melachlan",
                    "suffix": ""
                },
                {
                    "first": "G",
                    "middle": [
                        "B"
                    ],
                    "last": "Thormton",
                    "suffix": ""
                }
            ],
            "year": 1987,
            "venue": "Adv. Exp. Med. Biol",
            "volume": "225",
            "issn": "",
            "pages": "233--239",
            "other_ids": {}
        },
        "BIBREF20": {
            "ref_id": "b20",
            "title": "The hepatitis nucleocapsid as a vaccine carrier moiety",
            "authors": [
                {
                    "first": "D",
                    "middle": [
                        "R"
                    ],
                    "last": "Milich",
                    "suffix": ""
                }
            ],
            "year": 1995,
            "venue": "Ann. N. Y. Acad. Sci",
            "volume": "754",
            "issn": "",
            "pages": "187--201",
            "other_ids": {}
        },
        "BIBREF21": {
            "ref_id": "b21",
            "title": "Antibodies to synthetic peptides from PreS1 region of hepatitis B virus (HBV) envelop (env) protein is virus-neutralizing and protective",
            "authors": [
                {
                    "first": "A",
                    "middle": [
                        "R"
                    ],
                    "last": "Neurath",
                    "suffix": ""
                },
                {
                    "first": "B",
                    "middle": [],
                    "last": "Seto",
                    "suffix": ""
                },
                {
                    "first": "N",
                    "middle": [],
                    "last": "Strick",
                    "suffix": ""
                }
            ],
            "year": 1989,
            "venue": "Vaccine",
            "volume": "7",
            "issn": "",
            "pages": "234--236",
            "other_ids": {}
        },
        "BIBREF22": {
            "ref_id": "b22",
            "title": "Mechanism and therapeutic potential of DNA-based immunization against the envelope proteins of hepatitis B virus in normal and transgenic mice",
            "authors": [
                {
                    "first": "Y",
                    "middle": [],
                    "last": "Oka",
                    "suffix": ""
                },
                {
                    "first": "S",
                    "middle": [
                        "M"
                    ],
                    "last": "Fazle Akbar",
                    "suffix": ""
                },
                {
                    "first": "N",
                    "middle": [],
                    "last": "Horiike",
                    "suffix": ""
                },
                {
                    "first": "K",
                    "middle": [],
                    "last": "Joko",
                    "suffix": ""
                },
                {
                    "first": "M",
                    "middle": [],
                    "last": "Onji",
                    "suffix": ""
                }
            ],
            "year": 2001,
            "venue": "Immunology",
            "volume": "103",
            "issn": "",
            "pages": "90--97",
            "other_ids": {}
        },
        "BIBREF23": {
            "ref_id": "b23",
            "title": "HBV core particles as a carrier for B cell/T cell epitopes",
            "authors": [
                {
                    "first": "P",
                    "middle": [],
                    "last": "Pumpens",
                    "suffix": ""
                },
                {
                    "first": "E",
                    "middle": [],
                    "last": "Grens",
                    "suffix": ""
                }
            ],
            "year": 2001,
            "venue": "Intervirology",
            "volume": "44",
            "issn": "",
            "pages": "98--114",
            "other_ids": {}
        },
        "BIBREF24": {
            "ref_id": "b24",
            "title": "Evaluation of B and T-cell response in chimpanzees immunized with hepagene, a hepatitis B vaccine containing PreS1, PreS2 and S gene products",
            "authors": [
                {
                    "first": "M",
                    "middle": [
                        "W"
                    ],
                    "last": "Pride",
                    "suffix": ""
                },
                {
                    "first": "C",
                    "middle": [
                        "R"
                    ],
                    "last": "Bailey",
                    "suffix": ""
                },
                {
                    "first": "E",
                    "middle": [],
                    "last": "Muchmore",
                    "suffix": ""
                },
                {
                    "first": "Y",
                    "middle": [],
                    "last": "Thanavala",
                    "suffix": ""
                }
            ],
            "year": 1998,
            "venue": "Vaccine",
            "volume": "16",
            "issn": "",
            "pages": "543--550",
            "other_ids": {}
        },
        "BIBREF25": {
            "ref_id": "b25",
            "title": "Hepatitis B DNA vaccine induces protective antibody responses in human non-responders to conventional vaccination",
            "authors": [
                {
                    "first": "S",
                    "middle": [
                        "T"
                    ],
                    "last": "Rottinghaus",
                    "suffix": ""
                },
                {
                    "first": "G",
                    "middle": [
                        "A"
                    ],
                    "last": "Poland",
                    "suffix": ""
                },
                {
                    "first": "R",
                    "middle": [
                        "M"
                    ],
                    "last": "Jacobson",
                    "suffix": ""
                },
                {
                    "first": "L",
                    "middle": [
                        "J"
                    ],
                    "last": "Barr",
                    "suffix": ""
                },
                {
                    "first": "M",
                    "middle": [
                        "J"
                    ],
                    "last": "Roy",
                    "suffix": ""
                }
            ],
            "year": 2003,
            "venue": "Vaccine",
            "volume": "21",
            "issn": "",
            "pages": "4604--4608",
            "other_ids": {}
        },
        "BIBREF26": {
            "ref_id": "b26",
            "title": "Virus-like particles as a vaccine delivery system: myths and facts",
            "authors": [
                {
                    "first": "P",
                    "middle": [],
                    "last": "Roy",
                    "suffix": ""
                },
                {
                    "first": "R",
                    "middle": [],
                    "last": "Noad",
                    "suffix": ""
                }
            ],
            "year": 2008,
            "venue": "Hum. Vaccin",
            "volume": "4",
            "issn": "",
            "pages": "5--12",
            "other_ids": {}
        },
        "BIBREF27": {
            "ref_id": "b27",
            "title": "Attempted therapeutic immunization in a chimpanzee chronic HBV carrier with a high viral load",
            "authors": [
                {
                    "first": "M",
                    "middle": [
                        "T"
                    ],
                    "last": "Shata",
                    "suffix": ""
                }
            ],
            "year": 2006,
            "venue": "J. Med. Primatol",
            "volume": "35",
            "issn": "",
            "pages": "165--171",
            "other_ids": {}
        },
        "BIBREF28": {
            "ref_id": "b28",
            "title": "The physicochemical and biological properties of SS1 fusion antigen of HBsAg secreted by mammalian cells",
            "authors": [
                {
                    "first": "S",
                    "middle": [
                        "F"
                    ],
                    "last": "Tian",
                    "suffix": ""
                }
            ],
            "year": 2002,
            "venue": "Chinese J. Virol",
            "volume": "18",
            "issn": "",
            "pages": "312--316",
            "other_ids": {}
        },
        "BIBREF29": {
            "ref_id": "b29",
            "title": "Antigen engineering in yeast: synthesis and assembly of hybrid hepatitis B surface antigen-herpes simplex 1 gD particles",
            "authors": [
                {
                    "first": "P",
                    "middle": [],
                    "last": "Valenzuela",
                    "suffix": ""
                }
            ],
            "year": 1985,
            "venue": "Nat. Biotechnol",
            "volume": "3",
            "issn": "",
            "pages": "323--326",
            "other_ids": {}
        },
        "BIBREF30": {
            "ref_id": "b30",
            "title": "Increased DNA vaccine delivery and immunogenicity by electroporation in vivo",
            "authors": [
                {
                    "first": "G",
                    "middle": [],
                    "last": "Widera",
                    "suffix": ""
                }
            ],
            "year": 2000,
            "venue": "J. Immunol",
            "volume": "164",
            "issn": "",
            "pages": "4635--4640",
            "other_ids": {}
        },
        "BIBREF31": {
            "ref_id": "b31",
            "title": "A DNA vaccine induces SARS coronavirus neutralization and protective immunity in mice",
            "authors": [
                {
                    "first": "Z",
                    "middle": [
                        "Y"
                    ],
                    "last": "Yang",
                    "suffix": ""
                }
            ],
            "year": 2004,
            "venue": "Nature",
            "volume": "428",
            "issn": "",
            "pages": "561--564",
            "other_ids": {}
        },
        "BIBREF32": {
            "ref_id": "b32",
            "title": "Enhanced delivery of naked DNA to the skin by non-invasive in vivo electroporation",
            "authors": [
                {
                    "first": "L",
                    "middle": [],
                    "last": "Zhang",
                    "suffix": ""
                },
                {
                    "first": "E",
                    "middle": [],
                    "last": "Nolan",
                    "suffix": ""
                },
                {
                    "first": "S",
                    "middle": [],
                    "last": "Kreitschitz",
                    "suffix": ""
                },
                {
                    "first": "D",
                    "middle": [
                        "P"
                    ],
                    "last": "Rabussay",
                    "suffix": ""
                }
            ],
            "year": 2002,
            "venue": "Biochim. Biophys. Acta",
            "volume": "1572",
            "issn": "",
            "pages": "1--9",
            "other_ids": {}
        },
        "BIBREF33": {
            "ref_id": "b33",
            "title": "Study on the immunogenicity of fusion protein CS1 of hepatitis B virus",
            "authors": [
                {
                    "first": "Y",
                    "middle": [
                        "Q"
                    ],
                    "last": "Zhao",
                    "suffix": ""
                },
                {
                    "first": "M",
                    "middle": [
                        "Y"
                    ],
                    "last": "Zhan",
                    "suffix": ""
                }
            ],
            "year": 2001,
            "venue": "Chinese J. Virol",
            "volume": "17",
            "issn": "",
            "pages": "333--337",
            "other_ids": {}
        },
        "BIBREF34": {
            "ref_id": "b34",
            "title": "Vaccination against hepatitis B: the Chinese experience",
            "authors": [
                {
                    "first": "Y",
                    "middle": [
                        "H"
                    ],
                    "last": "Zhou",
                    "suffix": ""
                },
                {
                    "first": "C",
                    "middle": [],
                    "last": "Wu",
                    "suffix": ""
                },
                {
                    "first": "H",
                    "middle": [],
                    "last": "Zhuang",
                    "suffix": ""
                }
            ],
            "year": 2009,
            "venue": "Chin Med. J",
            "volume": "122",
            "issn": "",
            "pages": "98--102",
            "other_ids": {}
        },
        "BIBREF35": {
            "ref_id": "b35",
            "title": "DNA IMMUNIZATION PLUS ELECTROPORATION WITH HBV PLASMIDS",
            "authors": [],
            "year": 2011,
            "venue": "",
            "volume": "18",
            "issn": "",
            "pages": "",
            "other_ids": {}
        }
    },
    "ref_entries": {
        "FIGREF0": {
            "text": "Schematic diagram of the HBV DNA vaccines that contain PreS1 and the S or C fusion gene. The protein boxes are shown to scale (in amino acid residues).",
            "latex": null,
            "type": "figure"
        },
        "FIGREF1": {
            "text": "d.-EP group was one-fifth of that of the i.m. group or the i.m.-EP group. Additionally, the average antibody titer was slightly higher in the i.d.-EP group than in either of the other two groups. The anti-C antibody titer of the i.d.-EP group was significantly higher than those of the direct i.m. and i.m.-EP groups (P \u03fd FIG. 2. Expression of the HBV SS1 and CS1 antigen-derived DNA vaccine constructs in 293T cells. The cells were transfected with the DNA vectors as follows: Con, pVRC8301 as a control; SS1, pVRC-HBSS1 expressing PreS1 and S fusion protein; CS1, pVRC-HBCS1 expressing the PreS1 and C fusion protein. (Top) IFA. Transfected Th cells were fixed, permeabilized, stained with rabbit anti-PreS1 antibody and fluorescein isothiocyanate (FITC) conjugated with a secondary antibody and were then visualized using fluorescence microscopy. (Bottom) Western blot analysis of HBV antigen expression. The cell lysates were run on a 12.5% SDS polyacrylamide gel and analyzed using Western blotting with antibodies for the individual antigens, as indicated. The expression bands of the SS1 and CS1 proteins are indicated by arrowheads. 05). After immunization with pVRC-HBSS1, the anti-PreS1 antibody titer in the i.m.-EP group was significantly higher than that in the direct i.m. group (P \u03fd 0.05). Furthermore, the antibody titer in the i.d.-EP group was significantly higher than that in the i.m.-EP group (P \u03fd 0.05).",
            "latex": null,
            "type": "figure"
        },
        "TABREF0": {
            "text": "Vaccination groups and administration strategy for HBV DNA vaccines",
            "latex": null,
            "type": "table"
        },
        "TABREF1": {
            "text": "-EP a EP parameters: i.m. (pulse generator \u0353ECM830; BTX\u0354 with a two-array needle electrode), 27.5 v/mm for 20 ms, 8 times, with a 1-s interval between the EPs. b EP parameters: i.d. (square-wave pulse generator \u0353ECM830; BTX\u0354 with a caliper electrode consisting of two brass plate electrodes, 1 by 1 cm), 10 v/mm for 15 ms, 3 times, followed by reverse electroporation at 7.5 v/mm for 20 ms, 3 times, with a 1-s interval between the EPs.",
            "latex": null,
            "type": "table"
        },
        "TABREF2": {
            "text": "VOL.18, 2011   DNA IMMUNIZATION PLUS ELECTROPORATION WITH HBV PLASMIDS 1793",
            "latex": null,
            "type": "table"
        }
    },
    "back_matter": [
        {
            "text": "We thank Gary Nabel (VRC, NIAID, NIH) for the pVRC plasmid. ",
            "cite_spans": [],
            "ref_spans": [],
            "section": "ACKNOWLEDGMENTS"
        }
    ]
}