{
    "paper_id": "182ce5f44e7fafb2490c27871ebf1e9c4ecb556f",
    "metadata": {
        "title": "Journal Pre-proof Coronavirus Outbreak, is Radiology Ready? Mass Casualty Incident Planning Coronavirus Outbreak, is Radiology Ready? Mass Casualty Incident Planning",
        "authors": [
            {
                "first": "Lee",
                "middle": [],
                "last": "Myers",
                "suffix": "",
                "affiliation": {},
                "email": "leemyers@med.usc.edu"
            },
            {
                "first": "Sudheer",
                "middle": [],
                "last": "Balakrishnan",
                "suffix": "",
                "affiliation": {},
                "email": ""
            },
            {
                "first": "Sravanthi",
                "middle": [],
                "last": "Reddy",
                "suffix": "",
                "affiliation": {},
                "email": ""
            },
            {
                "first": "Ali",
                "middle": [],
                "last": "Gholamrezanezhad",
                "suffix": "",
                "affiliation": {},
                "email": ""
            }
        ]
    },
    "abstract": [],
    "body_text": [
        {
            "text": "It's 2 a.m. on a busy Saturday night, you're the only radiologist in-house and you receive a call from the Emergency Department. \" We have 15 patients that we suspect have the coronavirus, we are sending them to CT now for diagnosis\". You call the CT technologist and ask how many technologists are in-house for the 4 CT scanners that are available. The technologist responds with, \"just me.\" You know the CT image acquisition won't take much time, but how much time is needed to transport each patient, clean the CT scanner, and the added time for the CT technologist to adhere to standard, droplet and airborne precautions? How will this affect patient throughput for trauma, stroke and emergent surgical cases?",
            "cite_spans": [
                {
                    "start": 129,
                    "end": 130,
                    "text": "\"",
                    "ref_id": null
                }
            ],
            "ref_spans": [],
            "section": "Introduction"
        },
        {
            "text": "The scenario above illustrates the importance of involving the Radiology Department in a hospital's mass casualty incident plan. A mass casualty incident (MCI) is defined as an event that overwhelms a hospital's available resources, both structural and technological. 1 Conventionally, this would include terrorist attacks, bombings, mass shootings and natural disasters. An infectious disease outbreak however, could also quickly exhaust a hospital's resources. In the case of a viral outbreak such as the coronavirus disease 2019 (COVID-19), the inciting event leads to a more protracted course of resource utilization and depletion. Radiologists can play an important adjunct role in triaging and diagnosing patients during a mass casualty incident, including a COVID-19 outbreak. Even the most efficient radiology department will undergo tremendous stress when victims of a mass casualty flood the Emergency Department and in turn the Radiology Department. This plan will answer many of the questions that affect the Radiology response for the Emergency Department and inpatient imaging, but it is not tailored toward planning or discussion of challenges in the workflow of outpatient imaging.",
            "cite_spans": [
                {
                    "start": 268,
                    "end": 269,
                    "text": "1",
                    "ref_id": "BIBREF0"
                }
            ],
            "ref_spans": [],
            "section": "Introduction"
        },
        {
            "text": "Although some patients will contract the virus from close contact with symptomatic individuals, others will contract COVID-19 from a population that is asymptomatic. In the healthcare setting, this can include patient-to-patient, patientto-staff and staff-to-patient transmission, if strict precautions are not followed 2 . As more symptomatic patients seek medical care for coronavirus infection in an outbreak scenario, hospital resources will progressively be diverted away from those patients not affected by the disease.",
            "cite_spans": [],
            "ref_spans": [],
            "section": "Introduction"
        },
        {
            "text": "In late December 2019, an outbreak of a novel coronavirus (SARS-Cov-2) was announced in Wuhan, China 3 . Although rigorous attempts were made to confine the disease, this infection has continued to spread throughout the world. At the date of this publication, there are confirmed COVID-19 cases in 162 countries worldwide with growing concern that the infection will quickly reach pandemic proportions. As per Bruce Aylward, head of a World Health Organization (WHO) expert mission to China, the world is \"simply not ready\" to contain this outbreak. 4 China's extraordinary measure of instituting a quarantine in Wuhan and surrounding areas afforded the world a few months of lead time to prepare. However, according to the Dr. Tom Frieden who is the former director of the US Centers for Disease Control and Prevention (CDC), a coronavirus pandemic is inevitable. 5 The number of confirmed cases and patient deaths from coronavirus disease 2019 (COVID-19) have already exceeded those of severe acute respiratory syndrome (SARS) and middle east respiratory syndrome (MERS). 6 Healthcare systems worldwide should be prepared for an unusually high volume of patients in the next few months. This will include patients with COVID-19 in addition to patients requiring emergent care for other illnesses. Rapid diagnosis is essential for efficient patient triage. The RT-PCR test kits disseminated by the CDC are considered the gold of standard for COVID-19 diagnosis 7 , but several studies have shown that a negative initial PCR does not exclude COVID-19 infection 8, 9 . Additionally, it may take up to 48 hours to receive the final results, which limits the utility of this diagnostic test during initial triage of these patients in the emergency setting. In a recent study published in Radiology, based on a retrospective study of 1014 patients, the diagnostic sensitivity of chest CT for COVID-19 is significantly greater than that of RT-PCR (98% vs 59%), but the specificity is limited (25%) 7 . Proposed explanations for the decreased sensitivity of RT-PCR include low viral load, immature development of RT-PCR technology, and suboptimal clinical sampling. This study concluded that chest CT can be used as a screening tool for COVID-19 in cases with a high pretest probability, as evidenced by patients demonstrating clinical manifestations compatible with COVID-19 infection. Therefore, it is expected that there will be a significant interest in increasing in the number of imaging studies ordered for suspected cases of COVID-19 from both Emergency Medicine Department and Inpatient services. Given the low specificity of CT for diagnosing COVID-19, the American College of Radiology (ACR) does not recommend the use of CT for screening or as a first-line test for diagnosing COVID-19. 10",
            "cite_spans": [
                {
                    "start": 550,
                    "end": 551,
                    "text": "4",
                    "ref_id": "BIBREF3"
                },
                {
                    "start": 865,
                    "end": 866,
                    "text": "5",
                    "ref_id": "BIBREF4"
                },
                {
                    "start": 1074,
                    "end": 1075,
                    "text": "6",
                    "ref_id": "BIBREF6"
                },
                {
                    "start": 1561,
                    "end": 1563,
                    "text": "8,",
                    "ref_id": "BIBREF8"
                },
                {
                    "start": 1564,
                    "end": 1565,
                    "text": "9",
                    "ref_id": "BIBREF9"
                },
                {
                    "start": 1993,
                    "end": 1994,
                    "text": "7",
                    "ref_id": "BIBREF7"
                }
            ],
            "ref_spans": [],
            "section": "Global Crisis"
        },
        {
            "text": "Creating a mass casualty incident plan for a radiology department can be a daunting task. In the discussion below, the authors will highlight recommendations for developing and implementing an MCI plan for a viral outbreak, such as the current COVID-19 infection. Generally, in the MCI setting, a catastrophic event occurs and multiple victims arrive in a hospital's emergency room within minutes to hours. This is considered the \"surge\" period, in which hospital resources are rapidly utilized and possibly overwhelmed by the large number of patient casualties examined within a very short period. 11 Patients are triaged by first responders (paramedics, firefighters, police officers, military personnel) before entering the hospital alongside walking-wounded who arrive by other means. During a viral outbreak however, there will be a steady increase in patients over a longer period of time, a \"protracted-surge.\" This can similarly overburden and inevitably overwhelm a hospital's resources over the span of days, weeks or even months.",
            "cite_spans": [
                {
                    "start": 599,
                    "end": 601,
                    "text": "11",
                    "ref_id": "BIBREF11"
                }
            ],
            "ref_spans": [],
            "section": "Mass Casualty Incident Planning: Viral Outbreak"
        },
        {
            "text": "The major considerations for a Radiology MCI plan for a viral outbreak are to increase throughput of patients that need imaging and protect patients and staff from transmission.",
            "cite_spans": [],
            "ref_spans": [],
            "section": "Preparation"
        },
        {
            "text": "The first step in developing a Radiology Department MCI plan for a viral outbreak is to build upon your standard Radiology MCI plan. Communicate with your hospital's Emergency Medicine (EM) leadership and request the institution's MCI plan, specifically for a viral outbreak. This can be used to help structure the radiology plan around the logistics of the Emergency Department. Emergency Medicine will provide a contact person to discuss all policies and protocols for imaging in the Emergency Department. Creating an ordering algorithm for specific circumstances will increase overall throughput of essential imaging.",
            "cite_spans": [],
            "ref_spans": [],
            "section": "Preparation"
        },
        {
            "text": "The second step is to contact the Infectious Disease Department to designate a point person to provide instructions for cleaning equipment (portable X-Ray machines, ultrasound machines and CT scanners) and advise specific precautions to protect hospital staff and patients from transmission. As new guidelines become available, this individual will be able to update your staff.",
            "cite_spans": [],
            "ref_spans": [],
            "section": "Preparation"
        },
        {
            "text": "The third step is to coordinate with Environmental Services for procedures and time needed for cleaning stationary rooms (CT, MRI and X-Ray). Request air exchange rates for all stationary equipment rooms to help calculate room downtime between examinations.",
            "cite_spans": [],
            "ref_spans": [],
            "section": "Preparation"
        },
        {
            "text": "During the preparation phase, it is also important to update contact information for all staff including pager, home and mobile phone numbers for leadership in Radiology, Emergency Medicine and Infectious Disease. Policy and procedures may need to change quickly to adapt to immediate needs of patients and direct communication with chairs will help streamline these changes. Section heads are responsible for mobilizing Radiologists and the Chief Radiologic Technologist will be responsible for mobilizing technologists as needed.",
            "cite_spans": [],
            "ref_spans": [],
            "section": "Preparation"
        },
        {
            "text": "Communication within the Department of Radiology is of critical importance in an ongoing process during an MCI. The radiology leadership, chief technologist and the MCI plan liaison should communicate at least daily to evaluate the needs of Emergency Department and inpatient services. Section heads should also communicate at least daily to identify increasing demands and provide additional coverage for services that are being overutilized.",
            "cite_spans": [],
            "ref_spans": [],
            "section": "Preparation"
        },
        {
            "text": "Radiologic equipment and personnel are the two main resources in the Radiology Department. The use of portable equipment is recommended, as it will limit virus transmission by decreasing the number of patients being transported throughout the hospital. 12 Designate a suitable number of portable X-ray units to the Emergency Department with the ability to increase the number as needed, while still maintaining adequate resources for inpatients. If multiple CT scanners are available and CT imaging is being performed on patients with suspected COVID-19, a dedicated CT scanner is recommended for these patients based on the number of available CT scanners, number of infected versus noninfected patients, and available staff. Stationary equipment should be cleaned based on intuitional policies in concert with the Infectious Disease Department. Imaging throughput will heavily relay on hospital cleaning recommendations for stationary equipment.",
            "cite_spans": [
                {
                    "start": 253,
                    "end": 255,
                    "text": "12",
                    "ref_id": "BIBREF12"
                }
            ],
            "ref_spans": [],
            "section": "Mobilization of Resources"
        },
        {
            "text": "Essential Radiology Department personnel include technologists, ancillary staff, supervisors and radiologists. Without a true surge, the early stages of a viral outbreak may not necessitate more radiologists, however more ancillary staff and technologists will be needed as each exam will require more time and effort due to added precautions, transport and cleaning equipment. As more infected patients arrive to the hospital, the Radiology Department may become overwhelmed, especially if chest CT is utilized for screening. An automated or manual system should be in place to call in extra staff as needed and the system should be routinely updated with correct contact information. 13 Increasing the number of CT technologists proportionate to the number of available CT scanners will be crucial for decreasing turnaround-times and time-to-diagnosis.",
            "cite_spans": [
                {
                    "start": 686,
                    "end": 688,
                    "text": "13",
                    "ref_id": "BIBREF13"
                }
            ],
            "ref_spans": [],
            "section": "Mobilization of Resources"
        },
        {
            "text": "After throughput calculations have been made for a specific institution, an appropriate number of radiologists should be added to limit the bottleneck at the stage of interpretation. Radiology is in a unique position to be able to provide interpretations from home. Radiologists can be equipped with at-home workstations to decrease the burden of the hospital-based radiologists, especially \"after-hours.\" As nonessential outpatient imaging is being rescheduled, the volumes will be shifted to inpatient and Emergency Department examinations.",
            "cite_spans": [],
            "ref_spans": [],
            "section": "Mobilization of Resources"
        },
        {
            "text": "An MCI plan \"manager\" should be designated by the Radiology Department as the person who will oversee radiology operations during a mass casualty scenario. The Radiology Department MCI plan \"manager\" will decide when radiology resources will be mobilized and the best use of these resources.",
            "cite_spans": [],
            "ref_spans": [],
            "section": "Mobilization of Resources"
        },
        {
            "text": "The imaging chain refers to the process in which a radiologic examination is obtained. Each stage of the imaging chain from the time an order is placed until the imaging findings are communicated should be evaluated. In a viral outbreak, the imaging chain will be most impacted between the transport to and from the radiology department and the cleaning of the scanner. Strategies should be implemented to avoid the potential overuse of radiologic studies. 14 This can be accomplished through use of algorithms for clinical decision-making. See Table 1 for imaging chain categories and considerations. ",
            "cite_spans": [],
            "ref_spans": [
                {
                    "start": 545,
                    "end": 552,
                    "text": "Table 1",
                    "ref_id": "TABREF0"
                }
            ],
            "section": "Imaging Chain"
        },
        {
            "text": "Order Who will order examinations for suspected COVID-19? Is there an algorithm used to determine which patients get a CT Scan? Recommend indication/reason for exam to include the term \"Coronavirus Precautions\" Protocol Will you use a standard chest CT or low dose chest CT coronavirus protocol? Scheduling",
            "cite_spans": [],
            "ref_spans": [],
            "section": "Imaging Chain (CT) Considerations"
        },
        {
            "text": "Who determines the next patient and when imaging is available? Transport to/from radiology Is there a dedicated transport team? Imaging",
            "cite_spans": [],
            "ref_spans": [],
            "section": "Imaging Chain (CT) Considerations"
        },
        {
            "text": "Image acquisition based on protocol, see \"Adjusting Imaging Protocols\" section CT Scanner Cleaning Determine if facilities management, ancillary staff or CT technologist will clean the scanner Interpretation/communication Determine communication of findings of COVID-19 cases: Written and/or verbal communication.",
            "cite_spans": [],
            "ref_spans": [],
            "section": "Imaging Chain (CT) Considerations"
        },
        {
            "text": "It is unclear how large of a role CT will play in screening patients for COVID-19 given the recent literature on chest CT versus RT-PCR and the ACR recommendations. Imaging acquisition time is trivial compared to the time to transport the patient, don personal protective equipment and clean the scanner. If an institution has opted to use chest CT for screening, low-dose chest CT has been shown to be a suitable option for evaluation of pneumonia. Given the added time burden and the potential increase in radiologic exams in the Emergency Department and inpatient services, consider adjusting imaging protocols for polytrauma patients and to limit time-intensive studies, i.e., gated CTA and multiphase imaging.",
            "cite_spans": [],
            "ref_spans": [],
            "section": "Adjusting Imaging Protocols"
        },
        {
            "text": "Education has an important role in decreasing transmission rates and improving patient throughput efficiency. The use of proper precautions can help protect patients and radiology staff. Simulation of MCI plans, including for a viral outbreak, will improve throughput efficiency and find bottlenecks in the imaging chain.",
            "cite_spans": [],
            "ref_spans": [],
            "section": "Education: Mass Casualty Incident Plan"
        },
        {
            "text": "COVID-19 is highly contagious and direct contact with blood, sputum and respiratory droplets carry the greatest risk for transmission. 9 The Center for Disease Control (CDC) recommends waiting areas for a patient with suspected COVID-19 should include separation by at least 6 feet and recommends standard, contact and droplet precautions as well as airborne precautions during aerosolizing procedures. 15 Personal protective equipment (PPE) includes gowns, gloves, masks and eye protection. 16 Imaging equipment should be cleaned according to manufacturer's instructions and facility policies. Portable imaging is recommended to limit exposure.",
            "cite_spans": [
                {
                    "start": 135,
                    "end": 136,
                    "text": "9",
                    "ref_id": "BIBREF9"
                },
                {
                    "start": 403,
                    "end": 405,
                    "text": "15",
                    "ref_id": "BIBREF15"
                },
                {
                    "start": 492,
                    "end": 494,
                    "text": "16",
                    "ref_id": "BIBREF16"
                }
            ],
            "ref_spans": [],
            "section": "Recommended Precautions"
        },
        {
            "text": "The use of simulations can identify breakdowns and bottlenecks in the imaging chain. 1 This can also identify the minimum number of personnel needed from start to finish of the exam. In viral outbreaks, staff may be absent due to illness, so it is important that during these simulations, personnel (i.e., Xray and CT technologists, transporters) should be systematically removed to test how these affect turn-around-times and throughput. Although large-scale simulations can be expensive, time-consuming, require a lot of space and disrupt the day-to-day operations, they have many invaluable benefits. The use of live moulaged actors have the added benefit of offering more realistic encounters. 17 Alternatively, the use of tabletop exercises for MCI can also play a role in MCI simulations. See Table 2 for important questions to answer during an MCI simulation. Table 2 . Suggested questions to answer during MCI simulation. Important to have an algorithm in place for patient priority",
            "cite_spans": [
                {
                    "start": 85,
                    "end": 86,
                    "text": "1",
                    "ref_id": "BIBREF0"
                },
                {
                    "start": 698,
                    "end": 700,
                    "text": "17",
                    "ref_id": "BIBREF17"
                }
            ],
            "ref_spans": [
                {
                    "start": 799,
                    "end": 806,
                    "text": "Table 2",
                    "ref_id": null
                },
                {
                    "start": 867,
                    "end": 874,
                    "text": "Table 2",
                    "ref_id": null
                }
            ],
            "section": "MCI Plan Simulation"
        },
        {
            "text": "Not all radiology personnel will be available for MCI plan simulations, additional comprehensive in-service training should be given to all staff in the radiology department. The in-service modules should be specific to the role of the personnel. In-service modules specifically designed for radiologists including trainees, technologists (X-ray, CT, US), ancillary staff, dedicated transporters and radiology supervisors are recommended. This material should be used as a guide to describe the role and specific expectations for that role. The MCI plan should be available both as a hard copy in an easily accessible location and electronically for all staff to refer to during a crisis. In-service training should also include who to call, how to call and when to call for additional resources.",
            "cite_spans": [],
            "ref_spans": [],
            "section": "In-Service Training"
        },
        {
            "text": "It is clear that the Radiology Department will need to be ready for the COVID-19 outbreak. Major factors that will affect radiology throughput are transportation, cleaning equipment, proper usage of personal protective equipment and interpretation of radiologic examinations. Having an MCI plan in place for a viral outbreak will protect patients and staff and ultimately decrease virus transmission. The use of simulations will help identify throughput and logistical issues. Although screening for COVID-19 with CT is not recommended by the American College of Radiology, as prevalence of this disease increases, imaging patients with COVID-19 will increase, i.e., polytrauma, stroke, pulmonary embolism and surgical abdomen. The radiology department should be ready to mobilize equipment and staff to meet the needs of our patients.",
            "cite_spans": [],
            "ref_spans": [],
            "section": "Conclusion"
        }
    ],
    "bib_entries": {
        "BIBREF0": {
            "ref_id": "b0",
            "title": "Mass casualty incidents-are you ready? A major incident planning template for diagnostic radiology",
            "authors": [
                {
                    "first": "J",
                    "middle": [
                        "W"
                    ],
                    "last": "Ryan",
                    "suffix": ""
                },
                {
                    "first": "A",
                    "middle": [],
                    "last": "Murphy",
                    "suffix": ""
                },
                {
                    "first": "P",
                    "middle": [
                        "J"
                    ],
                    "last": "Macmahon",
                    "suffix": ""
                },
                {
                    "first": "F",
                    "middle": [],
                    "last": "Bolster",
                    "suffix": ""
                }
            ],
            "year": 2020,
            "venue": "Emerg Radiol",
            "volume": "",
            "issn": "",
            "pages": "",
            "other_ids": {}
        },
        "BIBREF1": {
            "ref_id": "b1",
            "title": "Practical recommendations for critical care and anesthesiology teams caring for novel coronavirus (2019-nCoV) patients",
            "authors": [
                {
                    "first": "R",
                    "middle": [
                        "S"
                    ],
                    "last": "Wax",
                    "suffix": ""
                },
                {
                    "first": "M",
                    "middle": [
                        "D"
                    ],
                    "last": "Christian",
                    "suffix": ""
                }
            ],
            "year": 2020,
            "venue": "Can J Anaesth",
            "volume": "",
            "issn": "",
            "pages": "",
            "other_ids": {}
        },
        "BIBREF2": {
            "ref_id": "b2",
            "title": "A Novel Coronavirus Emerging in China -Key Questions for Impact Assessment",
            "authors": [
                {
                    "first": "V",
                    "middle": [
                        "J"
                    ],
                    "last": "Munster",
                    "suffix": ""
                },
                {
                    "first": "M",
                    "middle": [],
                    "last": "Koopmans",
                    "suffix": ""
                },
                {
                    "first": "N",
                    "middle": [],
                    "last": "Van Doremalen",
                    "suffix": ""
                },
                {
                    "first": "D",
                    "middle": [],
                    "last": "Van Riel",
                    "suffix": ""
                },
                {
                    "first": "E",
                    "middle": [],
                    "last": "De Wit",
                    "suffix": ""
                }
            ],
            "year": 2020,
            "venue": "N Engl J Med",
            "volume": "382",
            "issn": "8",
            "pages": "692--694",
            "other_ids": {}
        },
        "BIBREF3": {
            "ref_id": "b3",
            "title": "Coronavirus spreads further as WHO expert warns world 'not ready' for pandemic",
            "authors": [
                {
                    "first": "The",
                    "middle": [],
                    "last": "Guardian",
                    "suffix": ""
                }
            ],
            "year": 2020,
            "venue": "",
            "volume": "",
            "issn": "",
            "pages": "",
            "other_ids": {}
        },
        "BIBREF4": {
            "ref_id": "b4",
            "title": "Former CDC director: A coronavirus pandemic is inevitable. What now?",
            "authors": [
                {
                    "first": "",
                    "middle": [],
                    "last": "Cnn Wire",
                    "suffix": ""
                }
            ],
            "year": 2020,
            "venue": "",
            "volume": "",
            "issn": "",
            "pages": "",
            "other_ids": {}
        },
        "BIBREF6": {
            "ref_id": "b6",
            "title": "Radiology Perspective of Coronavirus Disease 2019 (COVID-19): Lessons From Severe Acute Respiratory Syndrome and Middle East Respiratory Syndrome",
            "authors": [
                {
                    "first": "M",
                    "middle": [],
                    "last": "Hosseiny",
                    "suffix": ""
                },
                {
                    "first": "S",
                    "middle": [],
                    "last": "Kooraki",
                    "suffix": ""
                },
                {
                    "first": "A",
                    "middle": [],
                    "last": "Gholamrezanezhad",
                    "suffix": ""
                },
                {
                    "first": "S",
                    "middle": [],
                    "last": "Reddy",
                    "suffix": ""
                },
                {
                    "first": "L",
                    "middle": [],
                    "last": "Myers",
                    "suffix": ""
                }
            ],
            "year": null,
            "venue": "AJR Am J Roentgenol",
            "volume": "2020",
            "issn": "",
            "pages": "1--5",
            "other_ids": {}
        },
        "BIBREF7": {
            "ref_id": "b7",
            "title": "Correlation of Chest CT and RT-PCR Testing in Coronavirus Disease 2019 (COVID-19) in China: A Report of 1014 Cases",
            "authors": [
                {
                    "first": "T",
                    "middle": [],
                    "last": "Ai",
                    "suffix": ""
                },
                {
                    "first": "Z",
                    "middle": [],
                    "last": "Yang",
                    "suffix": ""
                },
                {
                    "first": "H",
                    "middle": [],
                    "last": "Hou",
                    "suffix": ""
                }
            ],
            "year": 2006,
            "venue": "Radiology",
            "volume": "2020",
            "issn": "",
            "pages": "",
            "other_ids": {}
        },
        "BIBREF8": {
            "ref_id": "b8",
            "title": "Positive rate of RT-PCR detection of SARS-CoV-2 infection in 4880 cases from one hospital in",
            "authors": [
                {
                    "first": "R",
                    "middle": [],
                    "last": "Liu",
                    "suffix": ""
                },
                {
                    "first": "H",
                    "middle": [],
                    "last": "Han",
                    "suffix": ""
                },
                {
                    "first": "F",
                    "middle": [],
                    "last": "Liu",
                    "suffix": ""
                }
            ],
            "year": 2020,
            "venue": "Clin Chim Acta",
            "volume": "505",
            "issn": "",
            "pages": "172--175",
            "other_ids": {}
        },
        "BIBREF9": {
            "ref_id": "b9",
            "title": "Consistent detection of 2019 novel coronavirus in saliva",
            "authors": [
                {
                    "first": "K",
                    "middle": [
                        "K"
                    ],
                    "last": "To",
                    "suffix": ""
                },
                {
                    "first": "O",
                    "middle": [
                        "T"
                    ],
                    "last": "Tsang",
                    "suffix": ""
                },
                {
                    "first": "C",
                    "middle": [],
                    "last": "Chik-Yan Yip",
                    "suffix": ""
                }
            ],
            "year": 2020,
            "venue": "Clin Infect Dis",
            "volume": "",
            "issn": "",
            "pages": "",
            "other_ids": {}
        },
        "BIBREF10": {
            "ref_id": "b10",
            "title": "ACR Recommendations for the use of Chest Radiography and Computed Tomography (CT) for Suspected COVID-19 Infection",
            "authors": [
                {
                    "first": "American",
                    "middle": [],
                    "last": "College",
                    "suffix": ""
                },
                {
                    "first": "",
                    "middle": [],
                    "last": "Radiology",
                    "suffix": ""
                }
            ],
            "year": 2020,
            "venue": "",
            "volume": "",
            "issn": "",
            "pages": "",
            "other_ids": {}
        },
        "BIBREF11": {
            "ref_id": "b11",
            "title": "Emergency imaging after a mass casualty incident: role of the radiology department during training for and activation of a disaster management plan",
            "authors": [
                {
                    "first": "F",
                    "middle": [
                        "H"
                    ],
                    "last": "Berger",
                    "suffix": ""
                },
                {
                    "first": "M",
                    "middle": [],
                    "last": "Korner",
                    "suffix": ""
                },
                {
                    "first": "M",
                    "middle": [
                        "P"
                    ],
                    "last": "Bernstein",
                    "suffix": ""
                }
            ],
            "year": null,
            "venue": "Br J Radiol",
            "volume": "89",
            "issn": "",
            "pages": "",
            "other_ids": {}
        },
        "BIBREF12": {
            "ref_id": "b12",
            "title": "COVID-19) Outbreak: What the Department of Radiology Should Know",
            "authors": [
                {
                    "first": "S",
                    "middle": [],
                    "last": "Kooraki",
                    "suffix": ""
                },
                {
                    "first": "M",
                    "middle": [],
                    "last": "Hosseiny",
                    "suffix": ""
                },
                {
                    "first": "L",
                    "middle": [],
                    "last": "Myers",
                    "suffix": ""
                },
                {
                    "first": "Gholamrezanezhad",
                    "middle": [
                        "A"
                    ],
                    "last": "Coronavirus",
                    "suffix": ""
                }
            ],
            "year": 2020,
            "venue": "J Am Coll Radiol",
            "volume": "",
            "issn": "",
            "pages": "",
            "other_ids": {}
        },
        "BIBREF13": {
            "ref_id": "b13",
            "title": "Emergency radiology and mass casualty incidents-report of a mass casualty incident at a level 1 trauma center",
            "authors": [
                {
                    "first": "F",
                    "middle": [],
                    "last": "Bolster",
                    "suffix": ""
                },
                {
                    "first": "K",
                    "middle": [],
                    "last": "Linnau",
                    "suffix": ""
                },
                {
                    "first": "S",
                    "middle": [],
                    "last": "Mitchell",
                    "suffix": ""
                }
            ],
            "year": 2017,
            "venue": "Emerg Radiol",
            "volume": "24",
            "issn": "1",
            "pages": "47--53",
            "other_ids": {}
        },
        "BIBREF14": {
            "ref_id": "b14",
            "title": "Reconsidering the Resources Needed for Multiple Casualty Events: Lessons Learned From the Crash of Asiana Airlines Flight 214",
            "authors": [
                {
                    "first": "E",
                    "middle": [
                        "M"
                    ],
                    "last": "Campion",
                    "suffix": ""
                },
                {
                    "first": "C",
                    "middle": [],
                    "last": "Juillard",
                    "suffix": ""
                },
                {
                    "first": "M",
                    "middle": [
                        "M"
                    ],
                    "last": "Knudson",
                    "suffix": ""
                }
            ],
            "year": 2016,
            "venue": "JAMA Surg",
            "volume": "151",
            "issn": "6",
            "pages": "512--517",
            "other_ids": {}
        },
        "BIBREF15": {
            "ref_id": "b15",
            "title": "COVID-19) or Persons Under Investigation for COVID-19 in Healthcare Settings",
            "authors": [],
            "year": 2019,
            "venue": "Centers for Disease Control and Prevention. Interim Infection Prevention and Control Recommendations for Patients with Confirmed Coronavirus Disease",
            "volume": "",
            "issn": "",
            "pages": "",
            "other_ids": {}
        },
        "BIBREF16": {
            "ref_id": "b16",
            "title": "What healthcare personnel should know about caring for patients with confirmed or possible covid-19 infection",
            "authors": [],
            "year": 2020,
            "venue": "",
            "volume": "",
            "issn": "",
            "pages": "",
            "other_ids": {}
        },
        "BIBREF17": {
            "ref_id": "b17",
            "title": "Comparison of Computerized Patients versus Live Moulaged Actors for a Mass-casualty Drill",
            "authors": [
                {
                    "first": "I",
                    "middle": [],
                    "last": "Claudius",
                    "suffix": ""
                },
                {
                    "first": "A",
                    "middle": [],
                    "last": "Kaji",
                    "suffix": ""
                },
                {
                    "first": "G",
                    "middle": [],
                    "last": "Santillanes",
                    "suffix": ""
                }
            ],
            "year": 2015,
            "venue": "Prehosp Disaster Med",
            "volume": "30",
            "issn": "5",
            "pages": "438--442",
            "other_ids": {}
        }
    },
    "ref_entries": {
        "TABREF0": {
            "text": "Imaging chain: From order to communication with questions to provoke discussion.",
            "latex": null,
            "type": "table"
        },
        "TABREF1": {
            "text": "Turn-Around-Time (TAT) from Order to communication This provides information on efficiency and throughput Where does the patient wait to be imaged? Does the radiology department need a waiting area that meets the CDC recommendations What is the \"waiting area\" capacity? This determines how many patients can wait in the radiology department Who determines if a patient can come to radiology and who decides priority? Radiology Nurse, Radiology Nursing Assistant, Emergency Medicine (EM) representative Who transports the patient to and from radiology? Dedicated versus general transporter, EM staff Does the radiologist give a \"wet read?\" This can decrease time-to-diagnosis, potentially more errors Does coronavirus patients have priority over other patients?",
            "latex": null,
            "type": "table"
        }
    },
    "back_matter": [
        {
            "text": "A Mass Casualty Incident Plan tailored to the COVID-19 outbreak will be needed to protect patients and staff from transmission as well as mobilize radiology resources to increase throughput efficiency.",
            "cite_spans": [],
            "ref_spans": [],
            "section": "Sentence Summary"
        },
        {
            "text": "\u2022 American College of Radiology does NOT recommend CT for screening for COVID-19 \u2022 Use portable imaging equipment for patients suspected of COVID-19 \u2022 Daily intradepartmental and interdepartmental communication for ongoing policy changes and needs for mobilization of resources",
            "cite_spans": [],
            "ref_spans": [],
            "section": "Take Home Points"
        }
    ]
}