{
    "paper_id": "PMC7086944",
    "metadata": {
        "title": "The proposed family toroviridae: Agents of enteric infections",
        "authors": [
            {
                "first": "Marianne",
                "middle": [],
                "last": "Weiss",
                "suffix": "",
                "email": null,
                "affiliation": {}
            },
            {
                "first": "M.",
                "middle": [
                    "C."
                ],
                "last": "Horzinek",
                "suffix": "",
                "email": null,
                "affiliation": {}
            }
        ]
    },
    "body_text": [],
    "ref_entries": {},
    "back_matter": [],
    "bib_entries": {
        "BIBREF0": {
            "title": "Studies with an unclassified virus isolated from diarrheic calves",
            "authors": [
                {
                    "first": "GN",
                    "middle": [],
                    "last": "Woode",
                    "suffix": ""
                },
                {
                    "first": "DE",
                    "middle": [],
                    "last": "Reed",
                    "suffix": ""
                },
                {
                    "first": "PM",
                    "middle": [],
                    "last": "Runnels",
                    "suffix": ""
                },
                {
                    "first": "MA",
                    "middle": [],
                    "last": "Herrig",
                    "suffix": ""
                },
                {
                    "first": "HT",
                    "middle": [],
                    "last": "Hill",
                    "suffix": ""
                }
            ],
            "year": 1982,
            "venue": "Vet Microbiol",
            "volume": "7",
            "issn": "",
            "pages": "221-240",
            "other_ids": {
                "DOI": []
            }
        },
        "BIBREF1": {
            "title": "Cellular lesions in intestinal mucosa of gnotobiotic calves experimentally infected with a new unclassified bovine virus (Breda virus)",
            "authors": [
                {
                    "first": "JF",
                    "middle": [],
                    "last": "Pohlenz",
                    "suffix": ""
                },
                {
                    "first": "NF",
                    "middle": [],
                    "last": "Cheville",
                    "suffix": ""
                },
                {
                    "first": "GN",
                    "middle": [],
                    "last": "Woode",
                    "suffix": ""
                },
                {
                    "first": "AH",
                    "middle": [],
                    "last": "Mokresh",
                    "suffix": ""
                }
            ],
            "year": 1984,
            "venue": "Vet Pathol",
            "volume": "21",
            "issn": "",
            "pages": "407-417",
            "other_ids": {
                "DOI": []
            }
        },
        "BIBREF2": {
            "title": "Astrovirus and Breda virus infections of dome cell epithelium of bovine ileum",
            "authors": [
                {
                    "first": "GN",
                    "middle": [],
                    "last": "Woode",
                    "suffix": ""
                },
                {
                    "first": "JF",
                    "middle": [],
                    "last": "Pohlenz",
                    "suffix": ""
                },
                {
                    "first": "NE",
                    "middle": [],
                    "last": "Kelso Gourley",
                    "suffix": ""
                },
                {
                    "first": "J",
                    "middle": [],
                    "last": "Fagerland",
                    "suffix": ""
                }
            ],
            "year": 1984,
            "venue": "J Clin Microbiol",
            "volume": "19",
            "issn": "",
            "pages": "623-630",
            "other_ids": {
                "DOI": []
            }
        },
        "BIBREF3": {
            "title": "A morphologic study of the replication of Breda virus (proposed family Toroviridae) in bovine intestinal cells",
            "authors": [
                {
                    "first": "JA",
                    "middle": [],
                    "last": "Fagerland",
                    "suffix": ""
                },
                {
                    "first": "JFL",
                    "middle": [],
                    "last": "Pohlenz",
                    "suffix": ""
                },
                {
                    "first": "GN",
                    "middle": [],
                    "last": "Woode",
                    "suffix": ""
                }
            ],
            "year": 1986,
            "venue": "J Gen Virol",
            "volume": "67",
            "issn": "",
            "pages": "1293-1304",
            "other_ids": {
                "DOI": []
            }
        },
        "BIBREF4": {
            "title": "Berne virus is not \u201ccoronavirus-like\u201d",
            "authors": [
                {
                    "first": "MC",
                    "middle": [],
                    "last": "Horzinek",
                    "suffix": ""
                },
                {
                    "first": "M",
                    "middle": [],
                    "last": "Weiss",
                    "suffix": ""
                },
                {
                    "first": "J",
                    "middle": [],
                    "last": "Ederveen",
                    "suffix": ""
                }
            ],
            "year": 1984,
            "venue": "J Gen Virol",
            "volume": "65",
            "issn": "",
            "pages": "645-649",
            "other_ids": {
                "DOI": []
            }
        },
        "BIBREF5": {
            "title": "The nucleocapsid of Berne virus",
            "authors": [
                {
                    "first": "MC",
                    "middle": [],
                    "last": "Horzinek",
                    "suffix": ""
                },
                {
                    "first": "J",
                    "middle": [],
                    "last": "Ederveen",
                    "suffix": ""
                },
                {
                    "first": "M",
                    "middle": [],
                    "last": "Weiss",
                    "suffix": ""
                }
            ],
            "year": 1985,
            "venue": "J Gen Virol",
            "volume": "66",
            "issn": "",
            "pages": "1287-1296",
            "other_ids": {
                "DOI": []
            }
        },
        "BIBREF6": {
            "title": "",
            "authors": [],
            "year": null,
            "venue": "",
            "volume": "",
            "issn": "",
            "pages": null,
            "other_ids": {
                "DOI": []
            }
        },
        "BIBREF7": {
            "title": "Resistance of Berne virus to physical and chemical treatment",
            "authors": [
                {
                    "first": "M",
                    "middle": [],
                    "last": "Weiss",
                    "suffix": ""
                },
                {
                    "first": "MC",
                    "middle": [],
                    "last": "Horzinek",
                    "suffix": ""
                }
            ],
            "year": 1986,
            "venue": "Vet Microbiol",
            "volume": "11",
            "issn": "",
            "pages": "41-49",
            "other_ids": {
                "DOI": []
            }
        },
        "BIBREF8": {
            "title": "Comparative studies on three isolates of Breda virus of calves",
            "authors": [
                {
                    "first": "GN",
                    "middle": [],
                    "last": "Woode",
                    "suffix": ""
                },
                {
                    "first": "LJ",
                    "middle": [],
                    "last": "Saif",
                    "suffix": ""
                },
                {
                    "first": "M",
                    "middle": [],
                    "last": "Quesada",
                    "suffix": ""
                },
                {
                    "first": "NJ",
                    "middle": [],
                    "last": "Winand",
                    "suffix": ""
                },
                {
                    "first": "JF",
                    "middle": [],
                    "last": "Pohlenz",
                    "suffix": ""
                },
                {
                    "first": "N",
                    "middle": [],
                    "last": "Kelso Gourley",
                    "suffix": ""
                }
            ],
            "year": 1985,
            "venue": "Am J Vet Res",
            "volume": "46",
            "issn": "",
            "pages": "1003-1010",
            "other_ids": {
                "DOI": []
            }
        },
        "BIBREF9": {
            "title": "Antibodies to Berne virus in horses and other animals",
            "authors": [
                {
                    "first": "M",
                    "middle": [],
                    "last": "Weiss",
                    "suffix": ""
                },
                {
                    "first": "F",
                    "middle": [],
                    "last": "Steck",
                    "suffix": ""
                },
                {
                    "first": "R",
                    "middle": [],
                    "last": "Kaderli",
                    "suffix": ""
                },
                {
                    "first": "M",
                    "middle": [],
                    "last": "Horzinek",
                    "suffix": ""
                }
            ],
            "year": 1984,
            "venue": "Vet Microbiol",
            "volume": "9",
            "issn": "",
            "pages": "523-531",
            "other_ids": {
                "DOI": []
            }
        },
        "BIBREF10": {
            "title": "",
            "authors": [],
            "year": null,
            "venue": "",
            "volume": "",
            "issn": "",
            "pages": null,
            "other_ids": {
                "DOI": []
            }
        },
        "BIBREF11": {
            "title": "Purification and partial characterization of a new enveloped RNA virus (Berne virus)",
            "authors": [
                {
                    "first": "M",
                    "middle": [],
                    "last": "Weiss",
                    "suffix": ""
                },
                {
                    "first": "F",
                    "middle": [],
                    "last": "Steck",
                    "suffix": ""
                },
                {
                    "first": "MC",
                    "middle": [],
                    "last": "Horzinek",
                    "suffix": ""
                }
            ],
            "year": 1983,
            "venue": "J Gen Virol",
            "volume": "64",
            "issn": "",
            "pages": "1849-1858",
            "other_ids": {
                "DOI": []
            }
        },
        "BIBREF12": {
            "title": "",
            "authors": [],
            "year": null,
            "venue": "",
            "volume": "",
            "issn": "",
            "pages": null,
            "other_ids": {
                "DOI": []
            }
        },
        "BIBREF13": {
            "title": "",
            "authors": [],
            "year": null,
            "venue": "",
            "volume": "",
            "issn": "",
            "pages": null,
            "other_ids": {
                "DOI": []
            }
        },
        "BIBREF14": {
            "title": "Toroviridae: a taxonomic proposal",
            "authors": [
                {
                    "first": "MC",
                    "middle": [],
                    "last": "Horzinek",
                    "suffix": ""
                },
                {
                    "first": "M",
                    "middle": [],
                    "last": "Weiss",
                    "suffix": ""
                }
            ],
            "year": 1984,
            "venue": "Zentralbl Veterin\u00e4rmed",
            "volume": "31",
            "issn": "",
            "pages": "649-659",
            "other_ids": {
                "DOI": []
            }
        },
        "BIBREF15": {
            "title": "",
            "authors": [],
            "year": null,
            "venue": "",
            "volume": "",
            "issn": "",
            "pages": null,
            "other_ids": {
                "DOI": []
            }
        },
        "BIBREF16": {
            "title": "",
            "authors": [],
            "year": null,
            "venue": "",
            "volume": "",
            "issn": "",
            "pages": null,
            "other_ids": {
                "DOI": []
            }
        },
        "BIBREF17": {
            "title": "Nouveaux virus intervenant dans l'\u00e9tiologie des ent\u00e9rites n\u00e9onatales des bovins",
            "authors": [
                {
                    "first": "A",
                    "middle": [],
                    "last": "Moussa",
                    "suffix": ""
                },
                {
                    "first": "G",
                    "middle": [],
                    "last": "Dannacher",
                    "suffix": ""
                },
                {
                    "first": "M",
                    "middle": [],
                    "last": "Fedida",
                    "suffix": ""
                }
            ],
            "year": 1983,
            "venue": "Rec M\u00e9d V\u00e9t",
            "volume": "159",
            "issn": "",
            "pages": "185-190",
            "other_ids": {
                "DOI": []
            }
        },
        "BIBREF18": {
            "title": "Nouvelle morphologie virale associ\u00e9e \u00e0 une infection bovine. Note pr\u00e9liminaire",
            "authors": [
                {
                    "first": "A",
                    "middle": [],
                    "last": "Moussa",
                    "suffix": ""
                },
                {
                    "first": "C",
                    "middle": [],
                    "last": "Bordas",
                    "suffix": ""
                },
                {
                    "first": "J",
                    "middle": [],
                    "last": "Mignon",
                    "suffix": ""
                }
            ],
            "year": 1984,
            "venue": "Rec M\u00e9d V\u00e9t",
            "volume": "160",
            "issn": "",
            "pages": "49-52",
            "other_ids": {
                "DOI": []
            }
        },
        "BIBREF19": {
            "title": "An enveloped virus in stools of children and adults with gastroenteritis that resembles the Breda virus of calves",
            "authors": [
                {
                    "first": "GM",
                    "middle": [],
                    "last": "Beards",
                    "suffix": ""
                },
                {
                    "first": "C",
                    "middle": [],
                    "last": "Hall",
                    "suffix": ""
                },
                {
                    "first": "J",
                    "middle": [],
                    "last": "Green",
                    "suffix": ""
                },
                {
                    "first": "TH",
                    "middle": [],
                    "last": "Flewett",
                    "suffix": ""
                },
                {
                    "first": "F",
                    "middle": [],
                    "last": "Lamouliatte",
                    "suffix": ""
                },
                {
                    "first": "P",
                    "middle": [],
                    "last": "du Pasquier",
                    "suffix": ""
                }
            ],
            "year": 1984,
            "venue": "Lancet Mai",
            "volume": "12",
            "issn": "",
            "pages": "1050-1052",
            "other_ids": {
                "DOI": []
            }
        },
        "BIBREF20": {
            "title": "Morphogenesis of Berne virus (proposed family Toroviridae)",
            "authors": [
                {
                    "first": "M",
                    "middle": [],
                    "last": "Weiss",
                    "suffix": ""
                },
                {
                    "first": "MC",
                    "middle": [],
                    "last": "Horzinek",
                    "suffix": ""
                }
            ],
            "year": 1986,
            "venue": "J Gen Virol",
            "volume": "67",
            "issn": "",
            "pages": "1305-1314",
            "other_ids": {
                "DOI": []
            }
        }
    }
}