{
    "paper_id": "25a880a0a0df248c3f584511470f730ab4304cec",
    "metadata": {
        "title": "A A N B E V E L I N G E N",
        "authors": [
            {
                "first": "",
                "middle": [],
                "last": "Vo O R B E D R I J F S A Rt S E N",
                "suffix": "",
                "affiliation": {
                    "laboratory": "",
                    "institution": "INFECTIEZIEKTE",
                    "location": {
                        "postCode": "MIDDEN-OOSTEN"
                    }
                },
                "email": ""
            }
        ]
    },
    "abstract": [
        {
            "text": "In september 2012 is een nieuw type coronavirus ontdekt, het Middle East Respiratory Syndrome Corona Virus (MERS-CoV) genoemd. Op 14 juni 2013 zijn er wereldwijd 60 pati\u00ebnten met een bevestigde besmetting van MERS-CoV gerapporteerd. 1 Van deze 60 pati\u00ebnten zijn er 31 overleden. Het gaat dus om een zeer ernstige infectieziekte.",
            "cite_spans": [],
            "ref_spans": [],
            "section": "Abstract"
        },
        {
            "text": "Alle ziektegevallen zijn terug te leiden naar vier landen in het Midden-Oosten. 2 De pati\u00ebnten zijn overwegend mannen, ouder dan 24 jaar. De mediane leeftijd is 56 jaar. Er is nog weinig bekend over de klinische presentatie van MERS-CoV. Bij de meeste pati\u00ebnten presenteert de infectie zich als een ernstig respiratoir beeld. 3 Op dit moment lijkt de incubatietijd ongeveer 14 dagen. De transmissieroute is respiratoir, via druppels. Het betreft zeer waarschijnlijk een zo\u00f6notische aandoening, maar welke diersoort(en) het reservoir vormen is nog onduidelijk. 4 Mens-op-menstransmissie is beschreven, maar lijkt beperkt.",
            "cite_spans": [],
            "ref_spans": [],
            "section": "Abstract"
        },
        {
            "text": "Hoewel MERS-CoV klinisch veel lijkt op SARS, is het epidemiologisch patroon tot nu toe heel anders. Ten tijde van het schrijven van dit artikel was er sprake van sporadische introductie in West-Europa. Het virus lijkt zich niet te verspreiden in de algemene populatie.",
            "cite_spans": [],
            "ref_spans": [],
            "section": "Abstract"
        }
    ],
    "body_text": [
        {
            "text": "Alle ziektegevallen zijn terug te leiden naar vier landen in het Midden-Oosten. 2 De pati\u00ebnten zijn overwegend mannen, ouder dan 24 jaar. De mediane leeftijd is 56 jaar. Er is nog weinig bekend over de klinische presentatie van MERS-CoV. Bij de meeste pati\u00ebnten presenteert de infectie zich als een ernstig respiratoir beeld. 3 Op dit moment lijkt de incubatietijd ongeveer 14 dagen. De transmissieroute is respiratoir, via druppels. Het betreft zeer waarschijnlijk een zo\u00f6notische aandoening, maar welke diersoort(en) het reservoir vormen is nog onduidelijk. 4 Mens-op-menstransmissie is beschreven, maar lijkt beperkt.",
            "cite_spans": [
                {
                    "start": 80,
                    "end": 81,
                    "text": "2",
                    "ref_id": "BIBREF1"
                },
                {
                    "start": 326,
                    "end": 327,
                    "text": "3",
                    "ref_id": "BIBREF3"
                },
                {
                    "start": 560,
                    "end": 561,
                    "text": "4",
                    "ref_id": "BIBREF4"
                }
            ],
            "ref_spans": [],
            "section": "K L I N I E K E N T R A N S M I S S I E"
        },
        {
            "text": "Hoewel MERS-CoV klinisch veel lijkt op SARS, is het epidemiologisch patroon tot nu toe heel anders. Ten tijde van het schrijven van dit artikel was er sprake van sporadische introductie in West-Europa. Het virus lijkt zich niet te verspreiden in de algemene populatie.",
            "cite_spans": [],
            "ref_spans": [],
            "section": "V E R S P R E I D I N G"
        },
        {
            "text": "Indien zich een pati\u00ebnt meldt met respiratoire ziekteverschijnselen die 14 dagen na terugkeer uit het Midden-Oosten zijn ontstaan, moet de bedrijfsarts denken aan MERS-CoV. Bij een mild ziektebeeld (bijvoorbeeld griepachtige klachten) wordt een expectatief beleid geadviseerd. Bij ernstige pulmonale klachten, of bij een verergering, luidt het advies om contact op te nemen met de huisarts of de internist/infectioloog. Bij een ongeplande blootstelling van een werknemer met een MERS-CoV-pati\u00ebnt wordt het volgende algoritme geadviseerd. 5 Als de blootgestelde werknemer geen acute respiratoire klachten heeft, kan men volstaan met het 14 dagen twee keer per 24 uur opnemen van de temperatuur. Treden er respiratoire klachten op, dan neemt de bedrijfsarts onmiddellijk contact op met de huisarts en/of een internist/infectioloog en de GGD. Voor werknemers in de zorg die met MERS-CoVpati\u00ebnten werken, en die gebruik maken van adequate persoonlijke beschermingsmiddelen, zoals adembescherming en handschoenen (zie de WIPrichtlijnen en de KIZA-nieuwsupdate van 5 juni 2013), wordt passieve monitoring geadviseerd. Dit houdt in dat een werknemer wordt ge\u00efnstrueerd zich te melden bij zijn bedrijfsarts, zodra hij respiratoire klachten ontwikkelt. ",
            "cite_spans": [
                {
                    "start": 538,
                    "end": 539,
                    "text": "5",
                    "ref_id": "BIBREF5"
                }
            ],
            "ref_spans": [],
            "section": "V E R S P R E I D I N G"
        }
    ],
    "bib_entries": {
        "BIBREF0": {
            "ref_id": "b0",
            "title": "Update: Severe Respiratory illness associated with Middle East Respiratory Syndrome Corona Virus (MERS-CoV) -Worldwide",
            "authors": [],
            "year": 2012,
            "venue": "Centers for Disease Control and Prevention. MMWR",
            "volume": "",
            "issn": "",
            "pages": "",
            "other_ids": {}
        },
        "BIBREF1": {
            "ref_id": "b1",
            "title": "Middle East Respiratory Syndrome Coronavirus",
            "authors": [
                {
                    "first": "",
                    "middle": [],
                    "last": "Groot Rj De",
                    "suffix": ""
                },
                {
                    "first": "S",
                    "middle": [
                        "C"
                    ],
                    "last": "Baker",
                    "suffix": ""
                },
                {
                    "first": "R",
                    "middle": [
                        "S"
                    ],
                    "last": "Baric",
                    "suffix": ""
                }
            ],
            "year": null,
            "venue": "",
            "volume": "",
            "issn": "",
            "pages": "",
            "other_ids": {}
        },
        "BIBREF3": {
            "ref_id": "b3",
            "title": "More MERS-CoV cases reported in Saudi Arabia",
            "authors": [
                {
                    "first": "R",
                    "middle": [],
                    "last": "Roos",
                    "suffix": ""
                }
            ],
            "year": null,
            "venue": "CIDRAP",
            "volume": "14",
            "issn": "2013",
            "pages": "",
            "other_ids": {}
        },
        "BIBREF4": {
            "ref_id": "b4",
            "title": "MERS-CoV: in search of answers",
            "authors": [
                {
                    "first": "A",
                    "middle": [],
                    "last": "Petherick",
                    "suffix": ""
                }
            ],
            "year": 2013,
            "venue": "Lancet",
            "volume": "381",
            "issn": "9883",
            "pages": "",
            "other_ids": {}
        },
        "BIBREF5": {
            "ref_id": "b5",
            "title": "Update: Middle East Respiratory Syndrome-Coronavirus (MERS-CoV). KIZA nieuwsbericht",
            "authors": [
                {
                    "first": "J",
                    "middle": [],
                    "last": "Maas",
                    "suffix": ""
                }
            ],
            "year": 2013,
            "venue": "",
            "volume": "",
            "issn": "",
            "pages": "",
            "other_ids": {}
        }
    },
    "ref_entries": {
        "FIGREF0": {
            "text": "AMT), onderdeel van het Outbreak Management Team van het RIVM. CORRESPONDENTIEADRES E-mail: j.j.maas@amc.uva.nl. MERS-COV, CORONAVIRUS, MIDDEN-OOSTEN, INFECTIEZIEKTE",
            "latex": null,
            "type": "figure"
        }
    },
    "back_matter": []
}