{
    "paper_id": "PMC7087753",
    "metadata": {
        "title": "A ribosomal frameshifting error during translation of the argl mRNA of Escherichla coli",
        "authors": [
            {
                "first": "Changwei",
                "middle": [],
                "last": "Fu",
                "suffix": "",
                "email": null,
                "affiliation": {}
            },
            {
                "first": "Jack",
                "middle": [],
                "last": "Parker",
                "suffix": "",
                "email": null,
                "affiliation": {}
            }
        ]
    },
    "body_text": [],
    "ref_entries": {},
    "back_matter": [],
    "bib_entries": {
        "BIBREF0": {
            "title": "Codon preferences in free-living microorganisms",
            "authors": [
                {
                    "first": "SGE",
                    "middle": [],
                    "last": "Andersson",
                    "suffix": ""
                },
                {
                    "first": "CG",
                    "middle": [],
                    "last": "Kurland",
                    "suffix": ""
                }
            ],
            "year": 1990,
            "venue": "Microbiol Rev",
            "volume": "54",
            "issn": "",
            "pages": "198-210",
            "other_ids": {
                "DOI": []
            }
        },
        "BIBREF1": {
            "title": "Characterization of an efficient coronavirus ribosomal framehshifting signal: requirement for an RNA pseudoknot",
            "authors": [
                {
                    "first": "I",
                    "middle": [],
                    "last": "Brierley",
                    "suffix": ""
                },
                {
                    "first": "P",
                    "middle": [],
                    "last": "Digard",
                    "suffix": ""
                },
                {
                    "first": "SC",
                    "middle": [],
                    "last": "Inglis",
                    "suffix": ""
                }
            ],
            "year": 1989,
            "venue": "Cell",
            "volume": "57",
            "issn": "",
            "pages": "537-547",
            "other_ids": {
                "DOI": []
            }
        },
        "BIBREF2": {
            "title": "\u03b2-galactosidase gene fusions for analyzing gene expression in Escherichia coli and yeast",
            "authors": [
                {
                    "first": "MJ",
                    "middle": [],
                    "last": "Casadaban",
                    "suffix": ""
                },
                {
                    "first": "A",
                    "middle": [],
                    "last": "Martinez-Arias",
                    "suffix": ""
                },
                {
                    "first": "SK",
                    "middle": [],
                    "last": "Shapira",
                    "suffix": ""
                },
                {
                    "first": "J",
                    "middle": [],
                    "last": "Chou",
                    "suffix": ""
                }
            ],
            "year": 1983,
            "venue": "Methods Enzymol",
            "volume": "100",
            "issn": "",
            "pages": "293-308",
            "other_ids": {
                "DOI": []
            }
        },
        "BIBREF3": {
            "title": "An RNA pseudoknot and an optimal heptameric shift site are required for highly efficient ribosomal frameshifting on a retroviral messenger RNA",
            "authors": [
                {
                    "first": "M",
                    "middle": [],
                    "last": "Chamorro",
                    "suffix": ""
                },
                {
                    "first": "N",
                    "middle": [],
                    "last": "Parkin",
                    "suffix": ""
                },
                {
                    "first": "HE",
                    "middle": [],
                    "last": "Varmus",
                    "suffix": ""
                }
            ],
            "year": 1992,
            "venue": "Proc Natl Acad Sci USA",
            "volume": "89",
            "issn": "",
            "pages": "713-717",
            "other_ids": {
                "DOI": []
            }
        },
        "BIBREF4": {
            "title": "Frameshifting in gene 10 of bacteriophage T7",
            "authors": [
                {
                    "first": "BG",
                    "middle": [],
                    "last": "Condron",
                    "suffix": ""
                },
                {
                    "first": "JF",
                    "middle": [],
                    "last": "Atkins",
                    "suffix": ""
                },
                {
                    "first": "RF",
                    "middle": [],
                    "last": "Gesteland",
                    "suffix": ""
                }
            ],
            "year": 1991,
            "venue": "J Bacteriol",
            "volume": "173",
            "issn": "",
            "pages": "6998-7003",
            "other_ids": {
                "DOI": []
            }
        },
        "BIBREF5": {
            "title": "An analysis of sequences stimulating frameshifting in the decoding of gene 10 of bacteriophage T7",
            "authors": [
                {
                    "first": "BG",
                    "middle": [],
                    "last": "Condron",
                    "suffix": ""
                },
                {
                    "first": "RF",
                    "middle": [],
                    "last": "Gesteland",
                    "suffix": ""
                },
                {
                    "first": "JF",
                    "middle": [],
                    "last": "Atkins",
                    "suffix": ""
                }
            ],
            "year": 1991,
            "venue": "Nucleic Acids Res",
            "volume": "19",
            "issn": "",
            "pages": "5607-5612",
            "other_ids": {
                "DOI": []
            }
        },
        "BIBREF6": {
            "title": "Expression of peptide release factor 2 requires high-efficiency frameshift",
            "authors": [
                {
                    "first": "WJ",
                    "middle": [],
                    "last": "Craigen",
                    "suffix": ""
                },
                {
                    "first": "CT",
                    "middle": [],
                    "last": "Caskey",
                    "suffix": ""
                }
            ],
            "year": 1986,
            "venue": "Nature",
            "volume": "322",
            "issn": "",
            "pages": "273-275",
            "other_ids": {
                "DOI": []
            }
        },
        "BIBREF7": {
            "title": "Bacterial peptide chain release factors: conserved primary structure and possible frameshift regulation of release factor 2",
            "authors": [
                {
                    "first": "WJ",
                    "middle": [],
                    "last": "Craigen",
                    "suffix": ""
                },
                {
                    "first": "RG",
                    "middle": [],
                    "last": "Cook",
                    "suffix": ""
                },
                {
                    "first": "WP",
                    "middle": [],
                    "last": "Tate",
                    "suffix": ""
                },
                {
                    "first": "CT",
                    "middle": [],
                    "last": "Caskey",
                    "suffix": ""
                }
            ],
            "year": 1985,
            "venue": "Proc Natl Acad Sci USA",
            "volume": "82",
            "issn": "",
            "pages": "3616-3620",
            "other_ids": {
                "DOI": []
            }
        },
        "BIBREF8": {
            "title": "Use of tRNA suppressors to probe regulation of Escherichia coli release factor 2",
            "authors": [
                {
                    "first": "JF",
                    "middle": [],
                    "last": "Curran",
                    "suffix": ""
                },
                {
                    "first": "M",
                    "middle": [],
                    "last": "Yarns",
                    "suffix": ""
                }
            ],
            "year": 1988,
            "venue": "J Mol Biol.",
            "volume": "203",
            "issn": "",
            "pages": "75-83",
            "other_ids": {
                "DOI": []
            }
        },
        "BIBREF9": {
            "title": "The tac promoter: a functional hybrid derived from the trp and lac promoters",
            "authors": [
                {
                    "first": "HA",
                    "middle": [],
                    "last": "de Boer",
                    "suffix": ""
                },
                {
                    "first": "LJ",
                    "middle": [],
                    "last": "Comstock",
                    "suffix": ""
                },
                {
                    "first": "M",
                    "middle": [],
                    "last": "Vasser",
                    "suffix": ""
                }
            ],
            "year": 1983,
            "venue": "Proc Natl Acad Sci USA",
            "volume": "80",
            "issn": "",
            "pages": "21-25",
            "other_ids": {
                "DOI": []
            }
        },
        "BIBREF10": {
            "title": "The \u03b3 subunit of DNA polymerase III holoenzyme of Escherichia coli is produced by ribosomal frameshifting",
            "authors": [
                {
                    "first": "AM",
                    "middle": [],
                    "last": "Flower",
                    "suffix": ""
                },
                {
                    "first": "CS",
                    "middle": [],
                    "last": "McHenry",
                    "suffix": ""
                }
            ],
            "year": 1990,
            "venue": "Proc Natl Acad Sci USA",
            "volume": "87",
            "issn": "",
            "pages": "3713-3717",
            "other_ids": {
                "DOI": []
            }
        },
        "BIBREF11": {
            "title": "Low activity of \u03b2-galacto-sidase in frameshift mutants of Escherichia coli",
            "authors": [
                {
                    "first": "JF",
                    "middle": [],
                    "last": "Atkins",
                    "suffix": ""
                },
                {
                    "first": "D",
                    "middle": [],
                    "last": "Elseviers",
                    "suffix": ""
                },
                {
                    "first": "L",
                    "middle": [],
                    "last": "Gorini",
                    "suffix": ""
                }
            ],
            "year": 1972,
            "venue": "Proc Natl Acad Sci USA",
            "volume": "69",
            "issn": "",
            "pages": "1192-1195",
            "other_ids": {
                "DOI": []
            }
        },
        "BIBREF12": {
            "title": "Leftward ribosome frameshifting at a hungry codon",
            "authors": [
                {
                    "first": "JA",
                    "middle": [],
                    "last": "Gallant",
                    "suffix": ""
                },
                {
                    "first": "D",
                    "middle": [],
                    "last": "Lindsley",
                    "suffix": ""
                }
            ],
            "year": 1992,
            "venue": "J Mol Biol",
            "volume": "223",
            "issn": "",
            "pages": "31-40",
            "other_ids": {
                "DOI": []
            }
        },
        "BIBREF13": {
            "title": "Recoding: reprogrammed genetic decoding",
            "authors": [
                {
                    "first": "RF",
                    "middle": [],
                    "last": "Gesteland",
                    "suffix": ""
                },
                {
                    "first": "RB",
                    "middle": [],
                    "last": "Weiss",
                    "suffix": ""
                },
                {
                    "first": "JF",
                    "middle": [],
                    "last": "Atkins",
                    "suffix": ""
                }
            ],
            "year": 1992,
            "venue": "Science",
            "volume": "257",
            "issn": "",
            "pages": "1640-1641",
            "other_ids": {
                "DOI": []
            }
        },
        "BIBREF14": {
            "title": "Correlation between the abundance of Escherichia coli transfer RNAs and the occurrence of the respective codons in its protein genes",
            "authors": [
                {
                    "first": "T",
                    "middle": [],
                    "last": "Ikemura",
                    "suffix": ""
                }
            ],
            "year": 1981,
            "venue": "J Mol Biol",
            "volume": "146",
            "issn": "",
            "pages": "1-21",
            "other_ids": {
                "DOI": []
            }
        },
        "BIBREF15": {
            "title": "Signals for ribosomal frameshifting in the Rous sarcoma virus gag-pol region",
            "authors": [
                {
                    "first": "T",
                    "middle": [],
                    "last": "Jacks",
                    "suffix": ""
                },
                {
                    "first": "HD",
                    "middle": [],
                    "last": "Madhani",
                    "suffix": ""
                },
                {
                    "first": "FR",
                    "middle": [],
                    "last": "Masiarz",
                    "suffix": ""
                },
                {
                    "first": "HE",
                    "middle": [],
                    "last": "Varmus",
                    "suffix": ""
                }
            ],
            "year": 1988,
            "venue": "Cell",
            "volume": "55",
            "issn": "",
            "pages": "447-458",
            "other_ids": {
                "DOI": []
            }
        },
        "BIBREF16": {
            "title": "Processivity errors of gene expression in Escherichia coli",
            "authors": [
                {
                    "first": "F",
                    "middle": [],
                    "last": "J\u00f8rgensen",
                    "suffix": ""
                },
                {
                    "first": "CG",
                    "middle": [],
                    "last": "Kurland",
                    "suffix": ""
                }
            ],
            "year": 1990,
            "venue": "J Mol Biol",
            "volume": "215",
            "issn": "",
            "pages": "511-521",
            "other_ids": {
                "DOI": []
            }
        },
        "BIBREF17": {
            "title": "The secret life of the ribosome",
            "authors": [
                {
                    "first": "CG",
                    "middle": [],
                    "last": "Kurland",
                    "suffix": ""
                },
                {
                    "first": "JA",
                    "middle": [],
                    "last": "Gallant",
                    "suffix": ""
                }
            ],
            "year": 1986,
            "venue": "Accuracy in molecular processes",
            "volume": "",
            "issn": "",
            "pages": "127-157",
            "other_ids": {
                "DOI": []
            }
        },
        "BIBREF18": {
            "title": "Transduction of linked genetic characters of the host by bacteriophage P1",
            "authors": [
                {
                    "first": "ES",
                    "middle": [],
                    "last": "Lennox",
                    "suffix": ""
                }
            ],
            "year": 1955,
            "venue": "Virology",
            "volume": "1",
            "issn": "",
            "pages": "190-206",
            "other_ids": {
                "DOI": []
            }
        },
        "BIBREF19": {
            "title": "On the directional specificity of ribosomal frameshifting at a \u201chungry\u201d codon",
            "authors": [
                {
                    "first": "D",
                    "middle": [],
                    "last": "Lindsley",
                    "suffix": ""
                },
                {
                    "first": "J",
                    "middle": [],
                    "last": "Gallant",
                    "suffix": ""
                }
            ],
            "year": 1993,
            "venue": "Proc Natl Acad Sci USA",
            "volume": "90",
            "issn": "",
            "pages": "5469-5473",
            "other_ids": {
                "DOI": []
            }
        },
        "BIBREF20": {
            "title": "",
            "authors": [
                {
                    "first": "JH",
                    "middle": [],
                    "last": "Miller",
                    "suffix": ""
                }
            ],
            "year": 1972,
            "venue": "Experiments in molecular genetics",
            "volume": "",
            "issn": "",
            "pages": null,
            "other_ids": {
                "DOI": []
            }
        },
        "BIBREF21": {
            "title": "Isolation and characterization of frameshift mutations in the lac operon",
            "authors": [
                {
                    "first": "A",
                    "middle": [],
                    "last": "Newton",
                    "suffix": ""
                }
            ],
            "year": 1970,
            "venue": "J Mol Biol",
            "volume": "49",
            "issn": "",
            "pages": "589-601",
            "other_ids": {
                "DOI": []
            }
        },
        "BIBREF22": {
            "title": "Ribosome gymnastics \u2014 degree of difficulty 9.5, style 10.0",
            "authors": [
                {
                    "first": "JF",
                    "middle": [],
                    "last": "Atkins",
                    "suffix": ""
                },
                {
                    "first": "RB",
                    "middle": [],
                    "last": "Weiss",
                    "suffix": ""
                },
                {
                    "first": "RF",
                    "middle": [],
                    "last": "Gesteland",
                    "suffix": ""
                }
            ],
            "year": 1990,
            "venue": "Cell",
            "volume": "62",
            "issn": "",
            "pages": "413-423",
            "other_ids": {
                "DOI": []
            }
        },
        "BIBREF23": {
            "title": "High resolution two-dimensional electrophoresis of proteins",
            "authors": [
                {
                    "first": "PH",
                    "middle": [],
                    "last": "O'Farrell",
                    "suffix": ""
                }
            ],
            "year": 1975,
            "venue": "J Biol Chem",
            "volume": "250",
            "issn": "",
            "pages": "4007-4021",
            "other_ids": {
                "DOI": []
            }
        },
        "BIBREF24": {
            "title": "Errors and alternatives in reading the universal genetic code",
            "authors": [
                {
                    "first": "J",
                    "middle": [],
                    "last": "Parker",
                    "suffix": ""
                }
            ],
            "year": 1989,
            "venue": "Microbiol Rev",
            "volume": "53",
            "issn": "",
            "pages": "273-298",
            "other_ids": {
                "DOI": []
            }
        },
        "BIBREF25": {
            "title": "Variations in reading the genetic code",
            "authors": [
                {
                    "first": "J",
                    "middle": [],
                    "last": "Parkera",
                    "suffix": ""
                }
            ],
            "year": 1992,
            "venue": "Transfer RNA in protein synthesis",
            "volume": "",
            "issn": "",
            "pages": "191-267",
            "other_ids": {
                "DOI": []
            }
        },
        "BIBREF26": {
            "title": "Mistranslation during phenylalanine starvation",
            "authors": [
                {
                    "first": "J",
                    "middle": [],
                    "last": "Parker",
                    "suffix": ""
                },
                {
                    "first": "J",
                    "middle": [],
                    "last": "Precup",
                    "suffix": ""
                }
            ],
            "year": 1986,
            "venue": "Mol Gen Genet",
            "volume": "204",
            "issn": "",
            "pages": "70-74",
            "other_ids": {
                "DOI": []
            }
        },
        "BIBREF27": {
            "title": "Mistranslation in cells infected with the bacteriophage MS2: direct evidence of Lys for Asn substitution",
            "authors": [
                {
                    "first": "J",
                    "middle": [],
                    "last": "Parker",
                    "suffix": ""
                },
                {
                    "first": "TC",
                    "middle": [],
                    "last": "Johnston",
                    "suffix": ""
                },
                {
                    "first": "PT",
                    "middle": [],
                    "last": "Borgia",
                    "suffix": ""
                }
            ],
            "year": 1980,
            "venue": "Mol Gen Genet",
            "volume": "180",
            "issn": "",
            "pages": "275-281",
            "other_ids": {
                "DOI": []
            }
        },
        "BIBREF28": {
            "title": "Context specific misreading of phenylalanine codons",
            "authors": [
                {
                    "first": "J",
                    "middle": [],
                    "last": "Precup",
                    "suffix": ""
                },
                {
                    "first": "AK",
                    "middle": [],
                    "last": "Ulrich",
                    "suffix": ""
                },
                {
                    "first": "O",
                    "middle": [],
                    "last": "Roopnarine",
                    "suffix": ""
                },
                {
                    "first": "J",
                    "middle": [],
                    "last": "Parker",
                    "suffix": ""
                }
            ],
            "year": 1989,
            "venue": "Mol Gen Genet",
            "volume": "218",
            "issn": "",
            "pages": "397-401",
            "other_ids": {
                "DOI": []
            }
        },
        "BIBREF29": {
            "title": "",
            "authors": [
                {
                    "first": "J",
                    "middle": [],
                    "last": "Sambrook",
                    "suffix": ""
                },
                {
                    "first": "EF",
                    "middle": [],
                    "last": "Fritsch",
                    "suffix": ""
                },
                {
                    "first": "T",
                    "middle": [],
                    "last": "Maniatis",
                    "suffix": ""
                }
            ],
            "year": 1989,
            "venue": "Molecular cloning: a laboratory manual",
            "volume": "",
            "issn": "",
            "pages": null,
            "other_ids": {
                "DOI": []
            }
        },
        "BIBREF30": {
            "title": "Translational termination: \u201cstop\u201d for protein synthesis or \u201cpause\u201d for regulation of gene expression",
            "authors": [
                {
                    "first": "WP",
                    "middle": [],
                    "last": "Tate",
                    "suffix": ""
                },
                {
                    "first": "CM",
                    "middle": [],
                    "last": "Brown",
                    "suffix": ""
                }
            ],
            "year": 1991,
            "venue": "Biochemistry",
            "volume": "31",
            "issn": "",
            "pages": "2443-2450",
            "other_ids": {
                "DOI": []
            }
        },
        "BIBREF31": {
            "title": " gene and the role of the unstable interaction between tRNALysSequence requirements for efficient translational frameshifting in the Escherichia coli dnaX and an AAG lysine codon",
            "authors": [
                {
                    "first": "Z",
                    "middle": [],
                    "last": "Tsuchihashi",
                    "suffix": ""
                },
                {
                    "first": "PO",
                    "middle": [],
                    "last": "Brown",
                    "suffix": ""
                }
            ],
            "year": 1992,
            "venue": "Genes Dev",
            "volume": "6",
            "issn": "",
            "pages": "511-519",
            "other_ids": {
                "DOI": []
            }
        },
        "BIBREF32": {
            "title": "Translational frameshifting generates the \u03b3 subunit of DNA polymerase III holoenzyme",
            "authors": [
                {
                    "first": "Z",
                    "middle": [],
                    "last": "Tsuchihashi",
                    "suffix": ""
                },
                {
                    "first": "A",
                    "middle": [],
                    "last": "Kornberg",
                    "suffix": ""
                }
            ],
            "year": 1990,
            "venue": "Proc Natl Acad Sci USA",
            "volume": "87",
            "issn": "",
            "pages": "2516-2520",
            "other_ids": {
                "DOI": []
            }
        },
        "BIBREF33": {
            "title": "Overproduction of release factor reduces spontaneous frameshifting and frameshift suppression by mutant elongation factor Tu",
            "authors": [
                {
                    "first": "MR",
                    "middle": [],
                    "last": "Aulin",
                    "suffix": ""
                },
                {
                    "first": "D",
                    "middle": [],
                    "last": "Hughes",
                    "suffix": ""
                }
            ],
            "year": 1990,
            "venue": "J Bacteriol",
            "volume": "172",
            "issn": "",
            "pages": "6721-6726",
            "other_ids": {
                "DOI": []
            }
        },
        "BIBREF34": {
            "title": "Ribosomal movement impeded at a pseudoknot required for frameshifting",
            "authors": [
                {
                    "first": "C",
                    "middle": [],
                    "last": "Tu",
                    "suffix": ""
                },
                {
                    "first": "T-H",
                    "middle": [],
                    "last": "Tzeng",
                    "suffix": ""
                },
                {
                    "first": "JA",
                    "middle": [],
                    "last": "Bruenn",
                    "suffix": ""
                }
            ],
            "year": 1992,
            "venue": "Proc Natl Acad Sci USA",
            "volume": "89",
            "issn": "",
            "pages": "8636-8640",
            "other_ids": {
                "DOI": []
            }
        },
        "BIBREF35": {
            "title": "Mechanism of ribosome frameshifting during translation of the genetic code",
            "authors": [
                {
                    "first": "R",
                    "middle": [],
                    "last": "Weiss",
                    "suffix": ""
                },
                {
                    "first": "J",
                    "middle": [],
                    "last": "Gallant",
                    "suffix": ""
                }
            ],
            "year": 1983,
            "venue": "Nature",
            "volume": "302",
            "issn": "",
            "pages": "389-393",
            "other_ids": {
                "DOI": []
            }
        },
        "BIBREF36": {
            "title": "Frameshift suppression in aminoacyltRNA limited cells",
            "authors": [
                {
                    "first": "RB",
                    "middle": [],
                    "last": "Weiss",
                    "suffix": ""
                },
                {
                    "first": "JA",
                    "middle": [],
                    "last": "Gallant",
                    "suffix": ""
                }
            ],
            "year": 1986,
            "venue": "Genetics",
            "volume": "112",
            "issn": "",
            "pages": "727-739",
            "other_ids": {
                "DOI": []
            }
        },
        "BIBREF37": {
            "title": "Slippery runs, shifty stops, backward steps, and forward hops: \u2212 2, \u2212 l, \u00f7 1, + 2, + 5, and + 6 ribosomal frameshifting",
            "authors": [
                {
                    "first": "RB",
                    "middle": [],
                    "last": "Weiss",
                    "suffix": ""
                },
                {
                    "first": "DM",
                    "middle": [],
                    "last": "Dunn",
                    "suffix": ""
                },
                {
                    "first": "JF",
                    "middle": [],
                    "last": "Atkins",
                    "suffix": ""
                },
                {
                    "first": "RF",
                    "middle": [],
                    "last": "Gesteland",
                    "suffix": ""
                }
            ],
            "year": 1987,
            "venue": "Cold Spring Harbor Symp Quant Biol",
            "volume": "52",
            "issn": "",
            "pages": "687-693",
            "other_ids": {
                "DOI": []
            }
        },
        "BIBREF38": {
            "title": "Reading frame switch caused by base-pair formation between the 3\u2032 end of 16S rRNA and the mRNA during elongation of protein synthesis in Escherichia coli",
            "authors": [
                {
                    "first": "RB",
                    "middle": [],
                    "last": "Weiss",
                    "suffix": ""
                },
                {
                    "first": "DM",
                    "middle": [],
                    "last": "Dunn",
                    "suffix": ""
                },
                {
                    "first": "AE",
                    "middle": [],
                    "last": "Dahlberg",
                    "suffix": ""
                },
                {
                    "first": "JF",
                    "middle": [],
                    "last": "Atkins",
                    "suffix": ""
                },
                {
                    "first": "RF",
                    "middle": [],
                    "last": "Gesteland",
                    "suffix": ""
                }
            ],
            "year": 1988,
            "venue": "EMBO J",
            "volume": "7",
            "issn": "",
            "pages": "1503-1507",
            "other_ids": {
                "DOI": []
            }
        },
        "BIBREF39": {
            "title": "Ribosomal frameshifting from \u2212 2 to + 50 nucleotides",
            "authors": [
                {
                    "first": "RB",
                    "middle": [],
                    "last": "Weiss",
                    "suffix": ""
                },
                {
                    "first": "DM",
                    "middle": [],
                    "last": "Dunn",
                    "suffix": ""
                },
                {
                    "first": "JF",
                    "middle": [],
                    "last": "Atkins",
                    "suffix": ""
                },
                {
                    "first": "RF",
                    "middle": [],
                    "last": "Gesteland",
                    "suffix": ""
                }
            ],
            "year": 1990,
            "venue": "Prog Nucleic Acid Res Mol Biol",
            "volume": "39",
            "issn": "",
            "pages": "159-183",
            "other_ids": {
                "DOI": []
            }
        },
        "BIBREF40": {
            "title": "Host genes that influence transposition in yeast: the abundance of a rare tRNA regulates Tyl transposition frequency",
            "authors": [
                {
                    "first": "H",
                    "middle": [],
                    "last": "Xu",
                    "suffix": ""
                },
                {
                    "first": "JD",
                    "middle": [],
                    "last": "Boeke",
                    "suffix": ""
                }
            ],
            "year": 1990,
            "venue": "Proc Natl Acad Sci USA",
            "volume": "87",
            "issn": "",
            "pages": "8360-8364",
            "other_ids": {
                "DOI": []
            }
        },
        "BIBREF41": {
            "title": "Ribosomal frameshifting in the yeast retrotransposon Ty: tRNAs induce slippage on a 7 nucleotide minimal site",
            "authors": [
                {
                    "first": "MF",
                    "middle": [],
                    "last": "Belcourt",
                    "suffix": ""
                },
                {
                    "first": "PJ",
                    "middle": [],
                    "last": "Farabaugh",
                    "suffix": ""
                }
            ],
            "year": 1990,
            "venue": "Cell",
            "volume": "62",
            "issn": "",
            "pages": "339-352",
            "other_ids": {
                "DOI": []
            }
        },
        "BIBREF42": {
            "title": "Frameshifting in the expression of the E. coli trpR gene occurs by the bypassing of a segment of its coding sequence",
            "authors": [
                {
                    "first": "I",
                    "middle": [],
                    "last": "Benhar",
                    "suffix": ""
                },
                {
                    "first": "H",
                    "middle": [],
                    "last": "Engelberg-Kulka",
                    "suffix": ""
                }
            ],
            "year": 1993,
            "venue": "Cell",
            "volume": "72",
            "issn": "",
            "pages": "121-130",
            "other_ids": {
                "DOI": []
            }
        },
        "BIBREF43": {
            "title": "Frameshifting in the expression of the Escherichia coli trpR gene",
            "authors": [
                {
                    "first": "I",
                    "middle": [],
                    "last": "Benhar",
                    "suffix": ""
                },
                {
                    "first": "C",
                    "middle": [],
                    "last": "Miller",
                    "suffix": ""
                },
                {
                    "first": "H",
                    "middle": [],
                    "last": "Engelberg-Kulka",
                    "suffix": ""
                }
            ],
            "year": 1992,
            "venue": "Mol Microbiol",
            "volume": "6",
            "issn": "",
            "pages": "2777-2784",
            "other_ids": {
                "DOI": []
            }
        },
        "BIBREF44": {
            "title": "Programmed ribosomal frameshifting generates the Escherichia coli DNA polymerase III \u03b3 subunit from within the \u03c4 subunit reading frame",
            "authors": [
                {
                    "first": "AL",
                    "middle": [],
                    "last": "Blinkowa",
                    "suffix": ""
                },
                {
                    "first": "JR",
                    "middle": [],
                    "last": "Walker",
                    "suffix": ""
                }
            ],
            "year": 1990,
            "venue": "Nucleic Acids Res",
            "volume": "18",
            "issn": "",
            "pages": "1725-1729",
            "other_ids": {
                "DOI": []
            }
        },
        "BIBREF45": {
            "title": "Effect of protein overexpression on mistranslation in Escherichia coli",
            "authors": [
                {
                    "first": "G",
                    "middle": [],
                    "last": "Bogosian",
                    "suffix": ""
                },
                {
                    "first": "BN",
                    "middle": [],
                    "last": "Violand",
                    "suffix": ""
                },
                {
                    "first": "PE",
                    "middle": [],
                    "last": "Jung",
                    "suffix": ""
                },
                {
                    "first": "JF",
                    "middle": [],
                    "last": "Kane",
                    "suffix": ""
                }
            ],
            "year": 1990,
            "venue": "The ribosome: structure, function, & evolution",
            "volume": "",
            "issn": "",
            "pages": "546-558",
            "other_ids": {
                "DOI": []
            }
        }
    }
}