{
    "paper_id": "PMC7099234",
    "metadata": {
        "title": "Effects of interleukin 17A (IL-17A) neutralization on murine hepatitis virus (MHV-A59) infection",
        "authors": [
            {
                "first": "Jos\u00e9",
                "middle": [
                    "L."
                ],
                "last": "Aparicio",
                "suffix": "",
                "email": null,
                "affiliation": {}
            },
            {
                "first": "Macarena",
                "middle": [],
                "last": "Ottobre",
                "suffix": "",
                "email": null,
                "affiliation": {}
            },
            {
                "first": "Maite",
                "middle": [],
                "last": "Duhalde Vega",
                "suffix": "",
                "email": null,
                "affiliation": {}
            },
            {
                "first": "Jean-Paul",
                "middle": [],
                "last": "Coutelier",
                "suffix": "",
                "email": null,
                "affiliation": {}
            },
            {
                "first": "Jacques",
                "middle": [],
                "last": "Van Snick",
                "suffix": "",
                "email": null,
                "affiliation": {}
            },
            {
                "first": "Lilia",
                "middle": [
                    "A."
                ],
                "last": "Retegui",
                "suffix": "",
                "email": "liliaretegui@fibertel.com.ar",
                "affiliation": {}
            }
        ]
    },
    "body_text": [],
    "ref_entries": {},
    "back_matter": [],
    "bib_entries": {
        "BIBREF0": {
            "title": "Interleukin-17 and innate immunity in infections and chronic inflammation",
            "authors": [
                {
                    "first": "N",
                    "middle": [],
                    "last": "Isailovic",
                    "suffix": ""
                },
                {
                    "first": "K",
                    "middle": [],
                    "last": "Daigo",
                    "suffix": ""
                },
                {
                    "first": "A",
                    "middle": [],
                    "last": "Mantovani",
                    "suffix": ""
                },
                {
                    "first": "C",
                    "middle": [],
                    "last": "Selmi",
                    "suffix": ""
                }
            ],
            "year": 2015,
            "venue": "J Autoimmun",
            "volume": "60",
            "issn": "",
            "pages": null,
            "other_ids": {
                "DOI": [
                    "10.1016/j.jaut.2015.04.006"
                ]
            }
        },
        "BIBREF1": {
            "title": "Uric acid andHMGB1are involved in the induction of autoantibodies elicited in mice infected with mouse hepatitis virus A59",
            "authors": [
                {
                    "first": "M",
                    "middle": [],
                    "last": "Duhalde-Vega",
                    "suffix": ""
                },
                {
                    "first": "LA",
                    "middle": [],
                    "last": "Retegui",
                    "suffix": ""
                }
            ],
            "year": 2011,
            "venue": "Autoimmunity",
            "volume": "44",
            "issn": "",
            "pages": null,
            "other_ids": {
                "DOI": [
                    "10.3109/08916934.2011.579927"
                ]
            }
        },
        "BIBREF2": {
            "title": "Autoimmune hepatitis-like disease in C57BL/6 mice infected with mouse hepatitis virus A59",
            "authors": [
                {
                    "first": "JL",
                    "middle": [],
                    "last": "Aparicio",
                    "suffix": ""
                },
                {
                    "first": "C",
                    "middle": [],
                    "last": "Pe\u02dcna",
                    "suffix": ""
                },
                {
                    "first": "LA",
                    "middle": [],
                    "last": "Retegui",
                    "suffix": ""
                }
            ],
            "year": 2011,
            "venue": "Int Immunopharmacol",
            "volume": "11",
            "issn": "",
            "pages": null,
            "other_ids": {
                "DOI": [
                    "10.1016/j.intimp.2011.05.020"
                ]
            }
        },
        "BIBREF3": {
            "title": "Pouring fuel on the fire: Th17 cells, the environment and autoimmunity",
            "authors": [
                {
                    "first": "PR",
                    "middle": [],
                    "last": "Burkett",
                    "suffix": ""
                },
                {
                    "first": "G",
                    "middle": [],
                    "last": "Meyer zu Horste",
                    "suffix": ""
                },
                {
                    "first": "VK",
                    "middle": [],
                    "last": "Kuchroo",
                    "suffix": ""
                }
            ],
            "year": 2015,
            "venue": "J Clin Invest",
            "volume": "125",
            "issn": "",
            "pages": null,
            "other_ids": {
                "DOI": [
                    "10.1172/JCI78085"
                ]
            }
        },
        "BIBREF4": {
            "title": "Ex-Th17 (Nonclassical Th1) cells are functionally distinct from classical Th1 and Th17 cells and are not constrained by regulatory T cells",
            "authors": [
                {
                    "first": "SA",
                    "middle": [],
                    "last": "Basdeo",
                    "suffix": ""
                },
                {
                    "first": "D",
                    "middle": [],
                    "last": "Cluxton",
                    "suffix": ""
                },
                {
                    "first": "J",
                    "middle": [],
                    "last": "Sulaimani",
                    "suffix": ""
                }
            ],
            "year": 2017,
            "venue": "J Immunol",
            "volume": "198",
            "issn": "",
            "pages": null,
            "other_ids": {
                "DOI": [
                    "10.4049/jimmunol.1600737"
                ]
            }
        },
        "BIBREF5": {
            "title": "In vivo polyclonal B-lymphocyte activation elicited by murine viruses",
            "authors": [
                {
                    "first": "J-P",
                    "middle": [],
                    "last": "Coutelier",
                    "suffix": ""
                },
                {
                    "first": "PG",
                    "middle": [],
                    "last": "Coulie",
                    "suffix": ""
                },
                {
                    "first": "P",
                    "middle": [],
                    "last": "Wauters",
                    "suffix": ""
                },
                {
                    "first": "H",
                    "middle": [],
                    "last": "Heremans",
                    "suffix": ""
                },
                {
                    "first": "JTM",
                    "middle": [],
                    "last": "van der Logt",
                    "suffix": ""
                }
            ],
            "year": 1990,
            "venue": "J Virol",
            "volume": "64",
            "issn": "",
            "pages": null,
            "other_ids": {
                "DOI": []
            }
        },
        "BIBREF6": {
            "title": "Development of an anti-IL-17A autovaccine that prevents experimental auto-immune encephalomyelitis",
            "authors": [
                {
                    "first": "C",
                    "middle": [],
                    "last": "Uyttenhove",
                    "suffix": ""
                },
                {
                    "first": "J",
                    "middle": [],
                    "last": "Van Snick",
                    "suffix": ""
                }
            ],
            "year": 2006,
            "venue": "Eur J Immunol",
            "volume": "36",
            "issn": "",
            "pages": null,
            "other_ids": {
                "DOI": [
                    "10.1002/eji.200636662"
                ]
            }
        },
        "BIBREF7": {
            "title": "Dual TCR expression biases lung inflammation in DO11.10 transgenic mice and promotes neutrophilia via microbiota-induced Th17 differentiation",
            "authors": [
                {
                    "first": "MM",
                    "middle": [],
                    "last": "Lemaire",
                    "suffix": ""
                },
                {
                    "first": "L",
                    "middle": [],
                    "last": "Dumoutier",
                    "suffix": ""
                },
                {
                    "first": "G",
                    "middle": [],
                    "last": "Warnier",
                    "suffix": ""
                }
            ],
            "year": 2011,
            "venue": "J Immunol",
            "volume": "187",
            "issn": "",
            "pages": null,
            "other_ids": {
                "DOI": [
                    "10.4049/jimmunol.1101720"
                ]
            }
        },
        "BIBREF8": {
            "title": "The antigenic topography of human growth hormone",
            "authors": [
                {
                    "first": "MM",
                    "middle": [],
                    "last": "Mazza",
                    "suffix": ""
                },
                {
                    "first": "LA",
                    "middle": [],
                    "last": "Retegui",
                    "suffix": ""
                }
            ],
            "year": 1989,
            "venue": "Mol Immunol",
            "volume": "26",
            "issn": "",
            "pages": null,
            "other_ids": {
                "DOI": []
            }
        },
        "BIBREF9": {
            "title": "A rapid and sensitive method for the quantification of microgram quantities of protein utilizing the principle of protein-dye binding",
            "authors": [
                {
                    "first": "MM",
                    "middle": [],
                    "last": "Bradford",
                    "suffix": ""
                }
            ],
            "year": 1976,
            "venue": "Anal Biochem",
            "volume": "72",
            "issn": "",
            "pages": null,
            "other_ids": {
                "DOI": [
                    "10.1016/0003-2697(76)90527-3"
                ]
            }
        },
        "BIBREF10": {
            "title": "Anti-cytokine antibodies as carrier proteins. Prolongation of in vivo effects of exogenous cytokines by injection of cytokine-anti-cytokine antibody complexes",
            "authors": [
                {
                    "first": "FD",
                    "middle": [],
                    "last": "Finkelman",
                    "suffix": ""
                },
                {
                    "first": "KB",
                    "middle": [],
                    "last": "Maddent",
                    "suffix": ""
                },
                {
                    "first": "SC",
                    "middle": [],
                    "last": "Morris",
                    "suffix": ""
                }
            ],
            "year": 1993,
            "venue": "J Immunol",
            "volume": "151",
            "issn": "",
            "pages": null,
            "other_ids": {
                "DOI": []
            }
        },
        "BIBREF11": {
            "title": "Regulation of inflammation by IL-17A and IL-17F modulates non-alcoholic fatty liver disease pathogenesis",
            "authors": [
                {
                    "first": "DA",
                    "middle": [],
                    "last": "Giles",
                    "suffix": ""
                },
                {
                    "first": "ME",
                    "middle": [],
                    "last": "Moreno-Fernandez",
                    "suffix": ""
                },
                {
                    "first": "TE",
                    "middle": [],
                    "last": "Stankiewicz",
                    "suffix": ""
                }
            ],
            "year": 2016,
            "venue": "PLoS One",
            "volume": "11",
            "issn": "",
            "pages": null,
            "other_ids": {
                "DOI": []
            }
        },
        "BIBREF12": {
            "title": "Development of an assay to measure in vivo cytokine production in the mouse",
            "authors": [
                {
                    "first": "FD",
                    "middle": [],
                    "last": "Finkelman",
                    "suffix": ""
                },
                {
                    "first": "SC",
                    "middle": [],
                    "last": "Morris",
                    "suffix": ""
                }
            ],
            "year": 1999,
            "venue": "Int Immunol",
            "volume": "11",
            "issn": "",
            "pages": null,
            "other_ids": {
                "DOI": [
                    "10.1093/intimm/11.11.1811"
                ]
            }
        },
        "BIBREF13": {
            "title": "Anti-cytokine auto-vaccination as tools for the analysis of cytokine function in vivo",
            "authors": [
                {
                    "first": "C",
                    "middle": [],
                    "last": "Uyttenhove",
                    "suffix": ""
                },
                {
                    "first": "J",
                    "middle": [],
                    "last": "Van Snick",
                    "suffix": ""
                }
            ],
            "year": 2012,
            "venue": "Cytokine Growth Factor Rev",
            "volume": "23",
            "issn": "",
            "pages": null,
            "other_ids": {
                "DOI": [
                    "10.1016/j.cytogfr.2011.12.001"
                ]
            }
        },
        "BIBREF14": {
            "title": "Can we replace liver biopsy with non-invasive procedures",
            "authors": [
                {
                    "first": "C",
                    "middle": [],
                    "last": "Fierbinteanu Braticevici",
                    "suffix": ""
                },
                {
                    "first": "R",
                    "middle": [],
                    "last": "Papacocea",
                    "suffix": ""
                },
                {
                    "first": "L",
                    "middle": [],
                    "last": "Tribus",
                    "suffix": ""
                },
                {
                    "first": "A",
                    "middle": [],
                    "last": "Badarau",
                    "suffix": ""
                }
            ],
            "year": 2011,
            "venue": "Liver biopsy",
            "volume": "",
            "issn": "",
            "pages": null,
            "other_ids": {
                "DOI": []
            }
        },
        "BIBREF15": {
            "title": "Functional specialization of interleukin-17 family members",
            "authors": [
                {
                    "first": "Y",
                    "middle": [],
                    "last": "Iwakura",
                    "suffix": ""
                },
                {
                    "first": "H",
                    "middle": [],
                    "last": "Ishigame",
                    "suffix": ""
                },
                {
                    "first": "S",
                    "middle": [],
                    "last": "Saijo",
                    "suffix": ""
                },
                {
                    "first": "S",
                    "middle": [],
                    "last": "Nakae",
                    "suffix": ""
                }
            ],
            "year": 2011,
            "venue": "Immunity",
            "volume": "34",
            "issn": "",
            "pages": null,
            "other_ids": {
                "DOI": [
                    "10.1016/j.immuni.2011.02.012"
                ]
            }
        },
        "BIBREF16": {
            "title": "Halothane-induced liver injury is mediated by interleukin-17 in mice",
            "authors": [
                {
                    "first": "E",
                    "middle": [],
                    "last": "Kobayashi",
                    "suffix": ""
                },
                {
                    "first": "M",
                    "middle": [],
                    "last": "Kobayashi",
                    "suffix": ""
                },
                {
                    "first": "K",
                    "middle": [],
                    "last": "Tsuneyama",
                    "suffix": ""
                },
                {
                    "first": "T",
                    "middle": [],
                    "last": "Fukami",
                    "suffix": ""
                },
                {
                    "first": "M",
                    "middle": [],
                    "last": "Nakajima",
                    "suffix": ""
                },
                {
                    "first": "T",
                    "middle": [],
                    "last": "Yokoi",
                    "suffix": ""
                }
            ],
            "year": 2009,
            "venue": "Toxicol Sci",
            "volume": "111",
            "issn": "",
            "pages": null,
            "other_ids": {
                "DOI": [
                    "10.1093/toxsci/kfp165"
                ]
            }
        },
        "BIBREF17": {
            "title": "Th17 cell derived IL17 is dispensable for B cell antibody production",
            "authors": [
                {
                    "first": "A",
                    "middle": [],
                    "last": "Shibui",
                    "suffix": ""
                },
                {
                    "first": "E",
                    "middle": [],
                    "last": "Shimura",
                    "suffix": ""
                },
                {
                    "first": "A",
                    "middle": [],
                    "last": "Nambu",
                    "suffix": ""
                }
            ],
            "year": 2012,
            "venue": "Cytokine",
            "volume": "59",
            "issn": "",
            "pages": null,
            "other_ids": {
                "DOI": [
                    "10.1016/j.cyto.2012.03.018"
                ]
            }
        },
        "BIBREF18": {
            "title": "Interferon-gamma negatively regulates Th17-mediated immunopathology during mouse hepatitis virus infection",
            "authors": [
                {
                    "first": "W",
                    "middle": [],
                    "last": "Yang",
                    "suffix": ""
                },
                {
                    "first": "X",
                    "middle": [],
                    "last": "Ding",
                    "suffix": ""
                },
                {
                    "first": "J",
                    "middle": [],
                    "last": "Deng",
                    "suffix": ""
                }
            ],
            "year": 2011,
            "venue": "J Mol Med",
            "volume": "89",
            "issn": "",
            "pages": null,
            "other_ids": {
                "DOI": [
                    "10.1007/s00109-010-0711-5"
                ]
            }
        },
        "BIBREF19": {
            "title": "Developmental plasticity of Th17 and Treg cells",
            "authors": [
                {
                    "first": "YK",
                    "middle": [],
                    "last": "Lee",
                    "suffix": ""
                },
                {
                    "first": "R",
                    "middle": [],
                    "last": "Mukasa",
                    "suffix": ""
                },
                {
                    "first": "RD",
                    "middle": [],
                    "last": "Hatton",
                    "suffix": ""
                },
                {
                    "first": "CT",
                    "middle": [],
                    "last": "Weaver",
                    "suffix": ""
                }
            ],
            "year": 2009,
            "venue": "Curr Opin Immunol",
            "volume": "21",
            "issn": "",
            "pages": null,
            "other_ids": {
                "DOI": [
                    "10.1016/j.coi.2009.05.021"
                ]
            }
        },
        "BIBREF20": {
            "title": "Interleukin-6 (IL-6) and IL-17 synergistically promote viral persistence by inhibiting cellular apoptosis and cytotoxic T cell function",
            "authors": [
                {
                    "first": "W",
                    "middle": [],
                    "last": "Hou",
                    "suffix": ""
                },
                {
                    "first": "Y",
                    "middle": [],
                    "last": "Hee Jin",
                    "suffix": ""
                },
                {
                    "first": "H",
                    "middle": [],
                    "last": "Seok Kang",
                    "suffix": ""
                },
                {
                    "first": "BS",
                    "middle": [],
                    "last": "Kim",
                    "suffix": ""
                }
            ],
            "year": 2014,
            "venue": "J Virol",
            "volume": "88",
            "issn": "",
            "pages": null,
            "other_ids": {
                "DOI": [
                    "10.1128/JVI.00724-14"
                ]
            }
        },
        "BIBREF21": {
            "title": "Hepatic immune regulation and its involvement in viral hepatitis infection",
            "authors": [
                {
                    "first": "PA",
                    "middle": [],
                    "last": "Knolle",
                    "suffix": ""
                },
                {
                    "first": "R",
                    "middle": [],
                    "last": "Thimme",
                    "suffix": ""
                }
            ],
            "year": 2014,
            "venue": "Gastroenterology",
            "volume": "146",
            "issn": "",
            "pages": null,
            "other_ids": {
                "DOI": [
                    "10.1053/j.gastro.2013.12.036"
                ]
            }
        },
        "BIBREF22": {
            "title": "Interleukin (IL)-17/IL-22-producing T cells enriched within the liver of patients with chronic hepatitis C viral (HCV) infection",
            "authors": [
                {
                    "first": "RG",
                    "middle": [],
                    "last": "Foster",
                    "suffix": ""
                },
                {
                    "first": "L",
                    "middle": [],
                    "last": "Golden-Mason",
                    "suffix": ""
                },
                {
                    "first": "A",
                    "middle": [],
                    "last": "Rutebemberwa",
                    "suffix": ""
                },
                {
                    "first": "HR",
                    "middle": [],
                    "last": "Rosen",
                    "suffix": ""
                }
            ],
            "year": 2012,
            "venue": "Dig Dis Sci",
            "volume": "57",
            "issn": "",
            "pages": null,
            "other_ids": {
                "DOI": [
                    "10.1007/s10620-011-1997-z"
                ]
            }
        },
        "BIBREF23": {
            "title": "Immunology in the liver\u2013from homeostasis to disease",
            "authors": [
                {
                    "first": "F",
                    "middle": [],
                    "last": "Heyman",
                    "suffix": ""
                },
                {
                    "first": "F",
                    "middle": [],
                    "last": "Tracke",
                    "suffix": ""
                }
            ],
            "year": 2016,
            "venue": "Nat Rev Gastroenterol Hepatol",
            "volume": "13",
            "issn": "",
            "pages": null,
            "other_ids": {
                "DOI": [
                    "10.1038/nrgastro.2015.200"
                ]
            }
        },
        "BIBREF24": {
            "title": "Role of IL-17 and Th 17 cells in liver disease",
            "authors": [
                {
                    "first": "H",
                    "middle": [],
                    "last": "Hammerich",
                    "suffix": ""
                },
                {
                    "first": "F",
                    "middle": [],
                    "last": "Heymann",
                    "suffix": ""
                },
                {
                    "first": "F",
                    "middle": [],
                    "last": "Tacke",
                    "suffix": ""
                }
            ],
            "year": 2011,
            "venue": "Clin Dev Immunol",
            "volume": "2011",
            "issn": "",
            "pages": null,
            "other_ids": {
                "DOI": [
                    "10.1155/2011/345803"
                ]
            }
        },
        "BIBREF25": {
            "title": "Interleukin-17 contributes to the pathogenesis of autoimmune hepatitis through inducing hepatic Interleukin-6 expression",
            "authors": [
                {
                    "first": "L",
                    "middle": [],
                    "last": "Zhao",
                    "suffix": ""
                },
                {
                    "first": "Y",
                    "middle": [],
                    "last": "Tang",
                    "suffix": ""
                },
                {
                    "first": "Z",
                    "middle": [],
                    "last": "You",
                    "suffix": ""
                }
            ],
            "year": 2011,
            "venue": "PLoS One",
            "volume": "6",
            "issn": "",
            "pages": null,
            "other_ids": {
                "DOI": [
                    "10.1371/journal.pone.0018909"
                ]
            }
        },
        "BIBREF26": {
            "title": "Interleukin-17-producing CD4+ T cells increase with severity of liver damage in patients with chronic hepatitis B",
            "authors": [
                {
                    "first": "JY",
                    "middle": [],
                    "last": "Zhang",
                    "suffix": ""
                },
                {
                    "first": "Z",
                    "middle": [],
                    "last": "Zhang",
                    "suffix": ""
                },
                {
                    "first": "F",
                    "middle": [],
                    "last": "Lin",
                    "suffix": ""
                }
            ],
            "year": 2010,
            "venue": "Hepatology",
            "volume": "51",
            "issn": "",
            "pages": null,
            "other_ids": {
                "DOI": [
                    "10.1002/hep.23273"
                ]
            }
        },
        "BIBREF27": {
            "title": "Coronavirus pathogenesis and the emerging pathogen severe acute respiratory syndrome coronavirus",
            "authors": [
                {
                    "first": "SR",
                    "middle": [],
                    "last": "Weiss",
                    "suffix": ""
                },
                {
                    "first": "S",
                    "middle": [],
                    "last": "Navas-Martin",
                    "suffix": ""
                }
            ],
            "year": 2005,
            "venue": "Microbiol Mol Biol Rev",
            "volume": "69",
            "issn": "",
            "pages": null,
            "other_ids": {
                "DOI": [
                    "10.1128/MMBR.69.4.635-664.2005"
                ]
            }
        },
        "BIBREF28": {
            "title": "Toll-like receptor-2 exacerbates murine acute viral hepatitis",
            "authors": [
                {
                    "first": "C",
                    "middle": [],
                    "last": "Bleau",
                    "suffix": ""
                },
                {
                    "first": "M",
                    "middle": [],
                    "last": "Burnette",
                    "suffix": ""
                },
                {
                    "first": "A",
                    "middle": [],
                    "last": "Filliol",
                    "suffix": ""
                },
                {
                    "first": "C",
                    "middle": [],
                    "last": "Piquet-Pellorce",
                    "suffix": ""
                },
                {
                    "first": "M",
                    "middle": [],
                    "last": "Samson",
                    "suffix": ""
                },
                {
                    "first": "L",
                    "middle": [],
                    "last": "Lamontagne",
                    "suffix": ""
                }
            ],
            "year": 2016,
            "venue": "Immunology",
            "volume": "149",
            "issn": "",
            "pages": null,
            "other_ids": {
                "DOI": [
                    "10.1111/imm.12627"
                ]
            }
        },
        "BIBREF29": {
            "title": "Brain invasion by mouse hepatitis virus depends on impairment of tight junctions and beta interferon production in brain microvascular endothelial cells",
            "authors": [
                {
                    "first": "C",
                    "middle": [],
                    "last": "Bleau",
                    "suffix": ""
                },
                {
                    "first": "A",
                    "middle": [],
                    "last": "Filliol",
                    "suffix": ""
                },
                {
                    "first": "M",
                    "middle": [],
                    "last": "Samson",
                    "suffix": ""
                },
                {
                    "first": "L",
                    "middle": [],
                    "last": "Lamontagne",
                    "suffix": ""
                }
            ],
            "year": 2015,
            "venue": "J Virol",
            "volume": "89",
            "issn": "",
            "pages": null,
            "other_ids": {
                "DOI": [
                    "10.1128/JVI.01501-15"
                ]
            }
        },
        "BIBREF30": {
            "title": "IL-33 protects murine viral fulminant hepatitis by targeting coagulation hallmark protein FGL2/fibroleukin expression",
            "authors": [
                {
                    "first": "H",
                    "middle": [],
                    "last": "Yua",
                    "suffix": ""
                },
                {
                    "first": "Y",
                    "middle": [],
                    "last": "Liub",
                    "suffix": ""
                },
                {
                    "first": "J",
                    "middle": [],
                    "last": "Huanga",
                    "suffix": ""
                }
            ],
            "year": 2017,
            "venue": "Mol Immunol",
            "volume": "87",
            "issn": "",
            "pages": null,
            "other_ids": {
                "DOI": [
                    "10.1016/j.molimm.2017.04.011"
                ]
            }
        }
    }
}