{
    "paper_id": "e36e46559cc272e329ebf3c0dd599c82c3e0283a",
    "metadata": {
        "title": "No novel coronaviruses identified in a large collection of human nasopharyngeal specimens using family-wide CODEHOP-based primers",
        "authors": [
            {
                "first": "Kalina",
                "middle": [
                    "T"
                ],
                "last": "Zlateva",
                "suffix": "",
                "affiliation": {},
                "email": ""
            },
            {
                "first": "\u2022",
                "middle": [],
                "last": "Frank",
                "suffix": "",
                "affiliation": {},
                "email": ""
            },
            {
                "first": "E",
                "middle": [
                    "J"
                ],
                "last": "Coenjaerts",
                "suffix": "",
                "affiliation": {},
                "email": ""
            },
            {
                "first": "Kelly",
                "middle": [
                    "M"
                ],
                "last": "Crusio",
                "suffix": "",
                "affiliation": {},
                "email": ""
            },
            {
                "first": "Christine",
                "middle": [],
                "last": "Lammens",
                "suffix": "",
                "affiliation": {},
                "email": ""
            },
            {
                "first": "Frank",
                "middle": [],
                "last": "Leus",
                "suffix": "",
                "affiliation": {},
                "email": ""
            },
            {
                "first": "Marco",
                "middle": [],
                "last": "Viveen",
                "suffix": "",
                "affiliation": {},
                "email": ""
            },
            {
                "first": "Margareta",
                "middle": [],
                "last": "Ieven",
                "suffix": "",
                "affiliation": {},
                "email": ""
            },
            {
                "first": "Willy",
                "middle": [
                    "J M"
                ],
                "last": "Spaan",
                "suffix": "",
                "affiliation": {},
                "email": ""
            },
            {
                "first": "Eric",
                "middle": [
                    "C J"
                ],
                "last": "Claas",
                "suffix": "",
                "affiliation": {},
                "email": ""
            },
            {
                "first": "Alexander",
                "middle": [
                    "E"
                ],
                "last": "Gorbalenya",
                "suffix": "",
                "affiliation": {},
                "email": ""
            }
        ]
    },
    "abstract": [
        {
            "text": "Novel viruses might be responsible for numerous disease cases with unknown etiology. In this study, we screened 1800 nasopharyngeal samples from adult outpatients with respiratory disease symptoms and healthy individuals. We employed a reverse transcription (RT)-PCR assay and CODEHOP-based primers (CT12-mCODEHOP) previously developed to recognize known and unknown corona-and toroviruses. The CT12-mCODEHOP assay detected 42.0 % (29/69) of samples positive for human coronaviruses (HCoV), including HCoV-229 (1/16), HCoV-NL63",
            "cite_spans": [],
            "ref_spans": [],
            "section": "Abstract"
        }
    ],
    "body_text": [
        {
            "text": "Respiratory tract infections (RTIs) are the most common diseases in humans and are responsible for significant morbidity and mortality worldwide, especially in young children, the elderly, and immunocompromised individuals. During the past decade, a growing variety of new viruses has been implicated in human RTIs, including severe acute respiratory syndrome coronavirus (SARS-HCoV) [1] [2] [3] , human CoVs (HCoV) NL63 [4, 5] and HKU1 [6] , human metapneumovirus (hMPV) [7] , human bocavirus (HBoV) [8] , WU and KI polyomaviruses (WUPyV and KIPyV, respectively) [9, 10] , and viruses that belong to the previously unrecognized species Human rhinovirus C (HRV-C) [11, 12] . These discoveries were facilitated by advancements in diagnostic methods. Still, in recently conducted studies, no causative agent could be established in 20 to 45 % of respiratory disease cases [13] [14] [15] [16] . These figures indicate that both the improvement of the current diagnostic methods and the search for new respiratory viruses must be continued.",
            "cite_spans": [
                {
                    "start": 384,
                    "end": 387,
                    "text": "[1]",
                    "ref_id": "BIBREF0"
                },
                {
                    "start": 388,
                    "end": 391,
                    "text": "[2]",
                    "ref_id": "BIBREF1"
                },
                {
                    "start": 392,
                    "end": 395,
                    "text": "[3]",
                    "ref_id": "BIBREF2"
                },
                {
                    "start": 421,
                    "end": 424,
                    "text": "[4,",
                    "ref_id": "BIBREF3"
                },
                {
                    "start": 425,
                    "end": 427,
                    "text": "5]",
                    "ref_id": "BIBREF4"
                },
                {
                    "start": 437,
                    "end": 440,
                    "text": "[6]",
                    "ref_id": "BIBREF5"
                },
                {
                    "start": 472,
                    "end": 475,
                    "text": "[7]",
                    "ref_id": "BIBREF6"
                },
                {
                    "start": 501,
                    "end": 504,
                    "text": "[8]",
                    "ref_id": "BIBREF7"
                },
                {
                    "start": 564,
                    "end": 567,
                    "text": "[9,",
                    "ref_id": "BIBREF8"
                },
                {
                    "start": 568,
                    "end": 571,
                    "text": "10]",
                    "ref_id": "BIBREF9"
                },
                {
                    "start": 664,
                    "end": 668,
                    "text": "[11,",
                    "ref_id": "BIBREF10"
                },
                {
                    "start": 669,
                    "end": 672,
                    "text": "12]",
                    "ref_id": "BIBREF11"
                },
                {
                    "start": 870,
                    "end": 874,
                    "text": "[13]",
                    "ref_id": "BIBREF12"
                },
                {
                    "start": 875,
                    "end": 879,
                    "text": "[14]",
                    "ref_id": "BIBREF13"
                },
                {
                    "start": 880,
                    "end": 884,
                    "text": "[15]",
                    "ref_id": "BIBREF14"
                },
                {
                    "start": 885,
                    "end": 889,
                    "text": "[16]",
                    "ref_id": "BIBREF15"
                }
            ],
            "ref_spans": [],
            "section": ""
        },
        {
            "text": "The main challenge to the identification of new viruses is their unknown characteristics. One of the popular approaches that have succeeded is the use of either degenerate or consensus primers that recognize highly conserved genome regions of already known viruses. These primers can detect new pathogens that are closely related to members of established species. For the identification of distantly related unknown viruses, the combined consensus and degenerate primer design strategy implemented in the consensus-degenerate hybrid oligonucleotide primer (CODEHOP) technique proved to be superior [17] [18] [19] [20] .",
            "cite_spans": [
                {
                    "start": 599,
                    "end": 603,
                    "text": "[17]",
                    "ref_id": "BIBREF16"
                },
                {
                    "start": 604,
                    "end": 608,
                    "text": "[18]",
                    "ref_id": "BIBREF17"
                },
                {
                    "start": 609,
                    "end": 613,
                    "text": "[19]",
                    "ref_id": "BIBREF18"
                },
                {
                    "start": 614,
                    "end": 618,
                    "text": "[20]",
                    "ref_id": "BIBREF19"
                }
            ],
            "ref_spans": [],
            "section": ""
        },
        {
            "text": "Also, other genetic-based techniques that are sequence independent have been developed and used in virus discovery. For instance, the VIDISCA method, based on recognition of restricted enzyme cleavage sites, was introduced [5] and advanced by employing non-rRNA hexamers for random priming, high-throughput genome sequencing [21] , and sample pooling using centrifugation [22] . It is highly sensitive and unbiased, but samples with an abundance of background RNA/DNA may not be suitable for VIDISCA, and its processivity remains relatively limited. Thus, CODEHOP-and VIDISCA-based techniques are complementary rather than an alternative for virus discovery at this stage of technology development.",
            "cite_spans": [
                {
                    "start": 223,
                    "end": 226,
                    "text": "[5]",
                    "ref_id": "BIBREF4"
                },
                {
                    "start": 325,
                    "end": 329,
                    "text": "[21]",
                    "ref_id": "BIBREF20"
                },
                {
                    "start": 372,
                    "end": 376,
                    "text": "[22]",
                    "ref_id": "BIBREF21"
                }
            ],
            "ref_spans": [],
            "section": ""
        },
        {
            "text": "We have recently described the development and validation of modified CODEHOP-based primers that were designed to recognize distantly related corona-and toroviruses of the family Coronaviridae (CT12-mCODEHOP) in a reverse transcription (RT)-PCR assay [23] . These primers detected four known circulating human coronaviruses and two bovine toroviruses directly from biological specimens. Additionally, in silico predictions indicated that the designed primers may recognize coronaviruses belonging to most recently discovered lineages. These results demonstrated that the CT12-mCODEHOP one-step RT-PCR assay can be a suitable tool for identification of novel members of the family Coronaviridae. In the current study, we present results of the first large-scale application of this method to a human respiratory specimen collection. We detected only the four currently known coronaviruses, providing further support for the prevalence of these respiratory coronaviruses in the human population.",
            "cite_spans": [
                {
                    "start": 251,
                    "end": 255,
                    "text": "[23]",
                    "ref_id": "BIBREF22"
                }
            ],
            "ref_spans": [],
            "section": ""
        },
        {
            "text": "A total of 1800 nasopharyngeal swabs collected from 10 primary-care networks (based in Antwerp, Gent, Rotenburg, Utrecht, Lodz, Barcelona, Mataro, Jonkoping, Cardiff and Southampton) in seven European countries (Belgium, Germany, the Netherlands, Poland, Spain, Sweden and the United Kingdom), as part of the EU Framework 6 supported GRACE (Genomics to Combat Resistance Against Antibiotics in Community-Acquired LRTI in Europe) Network were included in this study [21, 24] . The specimens were obtained from immunocompetent adult outpatients of C18 years of age with respiratory illness and asymptomatic matched controls over three consecutive winter seasons during the period 2007-2010. The inclusion criteria for symptomatic patients were acute cough with duration of up to and including 28 days or individuals in whom the general practitioner suspected the presence of acute lower respiratory tract infection. Control samples collected from the same practices were obtained from immunocompetent adults with no signs of acute respiratory illness of the same gender and age within 5 years of the patient's age (younger or older). One thousand sixty-four samples were collected from symptomatic adults at their first visit to the general practitioner (V1 samples), 484 were follow-up samples (V2 samples) obtained 4 weeks later, and 252 specimens were from subjects without respiratory disease symptoms. Total DNA/RNA nucleic acids were extracted using a NucliSENS EasyMAG (bioMerieux, Grenoble, France) and stored at -80\u00b0C until further use. The samples were screened by in-house monoplex or multiplex real-time RT-PCR assays for the following respiratory pathogens: HCoV-229E, -OC43, and -NL63, human rhinovirus (HRV) A/B/C, parainfluenza virus (PIV) 1-4, hMPV, adenovirus (HAdV), HBoV, respiratory syncytial virus (RSV), influenza (Inf) A/B viruses, WUPyV, and KIPyV. In addition, bacterial infections were detected as well, partly by conventional culture, but also by molecular methods, for Chlamydophila pneumoniae, Legionella pneumophila, Mycoplasma pneumoniae, Bordetella sp., Streptococcus pneumoniae and Haemophilus spp.",
            "cite_spans": [
                {
                    "start": 465,
                    "end": 469,
                    "text": "[21,",
                    "ref_id": "BIBREF20"
                },
                {
                    "start": 470,
                    "end": 473,
                    "text": "24]",
                    "ref_id": "BIBREF23"
                }
            ],
            "ref_spans": [],
            "section": ""
        },
        {
            "text": "For real-time PCR detection of HCoV, viral RNA was reverse-transcribed into cDNA by using a MultiScribe reverse transcriptase kit and random hexamers (Applied Biosystems, Foster City, CA, USA) according to the manufacturer's guidelines, followed by inactivation of reverse transcriptase for 5 min at 95\u00b0C. HCoV type-specific primers and probes were based on the conserved regions of the nucleocapsid gene (Table 1) . Their suitability for use in a multiplex assay was confirmed in a separate test that excluded that they cross-interact. Samples were assayed in a 50-ll reaction mixture containing 20 ll of cDNA, TaqMan universal PCR master mix (PE Applied Biosystems), primers, and fluorogenic probes labeled with the 5 0 reporter dye 6-carboxy-fluorescein (FAM) and the 3 0 quencher dye 6-carboxy-tetramethyl-rhodamine (TAM-RA). Amplification and detection were performed with the Taqman 7900HT system, essentially as described elsewhere [25] . The presence of possible inhibitors of the amplification reaction was controlled by using a murine encephalomyocarditis virus (RNA) or phocine herpes virus (DNA) as internal controls. Coronavirus identification was performed by re-testing of the multiplex real-time PCR positive samples with the separate type-specific (monoplex) primer and probe sets. Interquartile median (IQM) and interquartile range (IQR) estimates were obtained with SPSS v17.",
            "cite_spans": [
                {
                    "start": 939,
                    "end": 943,
                    "text": "[25]",
                    "ref_id": "BIBREF24"
                }
            ],
            "ref_spans": [
                {
                    "start": 405,
                    "end": 414,
                    "text": "(Table 1)",
                    "ref_id": null
                }
            ],
            "section": ""
        },
        {
            "text": "For virus discovery, GRACE samples were analyzed blindly in a pool of two as reported previously [23] . In brief, 8 ll of pooled RNA/DNA extractions containing 4 ll of each sample were digested with DNase using a DNase I Amplification Grade Kit, Life Technologies, Breda, The Netherlands) in a 10-ll final reaction volume following the manufacturer's instructions. The CT12-mCODEHOP RT-PCR assay was performed using a QIAGEN OneStep RT-PCR Kit (QIAGEN Benelux B.V., Venlo, The Netherlands) in a 50-ll final volume containing 2 lM A2 forward (5'-GGGIWGGGATTACMCIaartgygaymg-3') and 4 lM B1 reverse (5'-CCCASAIGWTGTIccnccnggytt-3') primers and 10 ll of the RNA sample. Amplification was carried out in a Biorad MyCycler (BioRad, Veenendaal, The Netherlands) using a touch-down thermocycling protocol as described elsewhere [23] . PCR products were analyzed in 2 % TAE agarose gels stained with ethidium bromide. Amplification products of about the expected 200-bp size were confirmed by individual re-testing of the pooled samples using 8 ll of RNA/DNA extract. The origin of the bands was established by sequence analysis of PCR products.",
            "cite_spans": [
                {
                    "start": 97,
                    "end": 101,
                    "text": "[23]",
                    "ref_id": "BIBREF22"
                },
                {
                    "start": 821,
                    "end": 825,
                    "text": "[23]",
                    "ref_id": "BIBREF22"
                }
            ],
            "ref_spans": [],
            "section": ""
        },
        {
            "text": "Employing a multiplex real-time PCR assay designed to detect HCoV-OC43, -229E and -NL63, 69 out of 1800 nasopharyngeal specimens were found to be positive and were subsequently typed using species-specific monoplex assays ( Table 2 ). The viral load in specimens containing viruses of different HCoV species was comparable, corresponding to median Ct values ranging between 26.8 and 27.9. Parallel screening of all specimens was conducted using the CT12-mCODEHOP RT-PCR assay in the search for new members of the family Coronaviridae. The assay amplified a virus sequence in 1.8 % (32/1800) of the tested samples and in 42.0 % (29/69) of the samples found to be HCoV positive in the real-time PCR assays. One specimen was positive for HCoV-229E, 9 for HCoV-NL63, and 19 for HCoV-OC43; viral loads were relatively high and characterized by a median interquartile Ct value of 25.32 (interquartile range, 22.03-27.52). Additionally, the CT12-mCODEHOP RT-PCR assay detected three samples that were positive for HCoV-HUK1, which was not targeted by the real-time PCR assays, bringing the total number of coronavirus-positives to 72 out of 1800 samples (4 %). The majority of coronaviruses 5.6 % (59/1064) were identified in V1 samples obtained from symptomatic patients during their first visit to the general practitioner, 1.9 % (9/484) were detected in V2 follow-up samples, and 1.6 % (4/252) in asymptomatic controls.",
            "cite_spans": [],
            "ref_spans": [
                {
                    "start": 224,
                    "end": 231,
                    "text": "Table 2",
                    "ref_id": "TABREF0"
                }
            ],
            "section": ""
        },
        {
            "text": "The CT12-mCODEHOP RT-PCR assay showed the highest sensitivity towards HCoV-OC43, closely followed by HCoV-NL63, and then HCoV-229E. HCoV-OC43 infection was confirmed in 52.8 % (19/36) of the samples typed by real-time PCR, with viral loads corresponding to a Ct interquartile range of 22.44-27.56 (median 26.21). The detection rate for HCoV-NL63 was 53 % (9/17), with a higher median interquartile viral load than for HCoV-OC43, corresponding to Ct 23.6. Only one (6.7 %) HCoV-229E sample with a high virus load (Ct 21.14) was confirmed. The viral load in positive samples not detected by the CT12-mCODEHOP RT-PCR assay (false negatives) was relatively low (interquartile Ct value range, 27.75-34.51, median, 30.68). False-negative HCoV-229E and HCoV-NL63 samples had a lower median interquartile Ct value, 28.3 and 28.9, respectively, in comparison to 32.32 for HCoV-OC43, indicating higher viral loads and a lower sensitivity of the assay towards HCoV-229E and HCoV-NL63. These results are in accordance with our previous findings using quantified copy RNA transcripts and HCoVpositive respiratory specimens [23] .",
            "cite_spans": [
                {
                    "start": 1110,
                    "end": 1114,
                    "text": "[23]",
                    "ref_id": "BIBREF22"
                }
            ],
            "ref_spans": [],
            "section": ""
        },
        {
            "text": "Our goal was to search for unknown respiratory human coronaviruses that are distantly related to known coronaviruses and are prototypes of new genera that might be circulating in the human population. No new coronaviruses were discovered in this study. Although this observation is negative and thus belongs to those rarely reported, its documentation is important for unbiased knowledgebuilding [26] . This study was the first, to our knowledge, in which a large collection of samples was screened using a primer set designed to recognize both corona-and toroviruses rather than targeting (human) coronaviruses exclusively (e.g., see ref. [27] ). Nonspecific amplification products were not observed for any of the analyzed specimens, including numerous samples that were positive for other virus pathogens (data in preparation), indicating that the CT12-mCODEHOP RT-PCR assay is highly selective with respect to coronaviruses in nasopharyngeal samples. The lack of false positives contributed to a relatively high Table 1 Species-specific primers and probes used for coronavirus detection in multiplex and monoplex PCR assays processivity and low cost of the assay that allowed us to analyze a large number of samples. In contrast, the rate of false negatives was considerable (*60 %) and varied for different HCoVs but was close to that established in our pilot study in which this assay was introduced [23] . If the false-negative rate of detection, especially for HCoV-229E, had been lower, even at the expense of an increase in false positives, our confidence about the lack of new coronaviruses in the analyzed samples probably would have been higher. Unfortunately, increasing the primer degeneracy in our assay, which controls sensitivity, was not practical. It is already high due to an enormous evolutionary distance between coronaviruses and toroviruses, which these primers were designed to cover [23] . The primer design was done according to an approach that minimizes bias with respect to any particular subset of coronaviruses, e.g., HCoVs, and thus covers the genetic diversity evenly. The validity of these primers was confirmed in in silico analysis of coronaviruses that were not used in the design of the CT12-mCODEHOP primers [23] . Thus, the observed falsenegative rate, obviously high by virus diagnostic standards, is the current state of the art for this method. Because of the characteristics of this method, the negative conclusion about new respiratory human coronaviruses reported in this study is restricted to pathogens that are comparable in their prevalence and load to the known circulating respiratory coronaviruses. Furthermore, we acknowledge that this conclusion may also depend on a number of other variables, including, but not limited to, the time frame, population and geographic location surveyed. Even with these limitations, we believe that the results we have obtained are a step forward in characterizing the natural diversity of human coronaviruses and how we study it. Improving the method and expanding the application of this assay to larger datasets that also include stool and cerebrospinal fluid clinical specimens obtained from acute disease cases of unknown etiology would be worth exploring. This line of research could also benefit from application of virus-discovery techniques that involve deep next-generation sequencing (e.g., see ref. [28] ). ",
            "cite_spans": [
                {
                    "start": 396,
                    "end": 400,
                    "text": "[26]",
                    "ref_id": "BIBREF25"
                },
                {
                    "start": 640,
                    "end": 644,
                    "text": "[27]",
                    "ref_id": "BIBREF26"
                },
                {
                    "start": 1406,
                    "end": 1410,
                    "text": "[23]",
                    "ref_id": "BIBREF22"
                },
                {
                    "start": 1910,
                    "end": 1914,
                    "text": "[23]",
                    "ref_id": "BIBREF22"
                },
                {
                    "start": 2249,
                    "end": 2253,
                    "text": "[23]",
                    "ref_id": "BIBREF22"
                },
                {
                    "start": 3400,
                    "end": 3404,
                    "text": "[28]",
                    "ref_id": "BIBREF27"
                }
            ],
            "ref_spans": [
                {
                    "start": 1016,
                    "end": 1023,
                    "text": "Table 1",
                    "ref_id": null
                }
            ],
            "section": ""
        }
    ],
    "bib_entries": {
        "BIBREF0": {
            "ref_id": "b0",
            "title": "Severe acute respiratory syndrome: identification of the etiological agent",
            "authors": [
                {
                    "first": "C",
                    "middle": [],
                    "last": "Drosten",
                    "suffix": ""
                },
                {
                    "first": "W",
                    "middle": [],
                    "last": "Preiser",
                    "suffix": ""
                },
                {
                    "first": "S",
                    "middle": [],
                    "last": "Gunther",
                    "suffix": ""
                },
                {
                    "first": "H",
                    "middle": [],
                    "last": "Schmitz",
                    "suffix": ""
                },
                {
                    "first": "H",
                    "middle": [
                        "W"
                    ],
                    "last": "Doerr",
                    "suffix": ""
                }
            ],
            "year": 2003,
            "venue": "Trends Mol Med",
            "volume": "9",
            "issn": "",
            "pages": "325--327",
            "other_ids": {}
        },
        "BIBREF1": {
            "ref_id": "b1",
            "title": "A novel coronavirus associated with severe acute respiratory syndrome",
            "authors": [
                {
                    "first": "T",
                    "middle": [
                        "G"
                    ],
                    "last": "Ksiazek",
                    "suffix": ""
                },
                {
                    "first": "D",
                    "middle": [],
                    "last": "Erdman",
                    "suffix": ""
                },
                {
                    "first": "C",
                    "middle": [
                        "S"
                    ],
                    "last": "Goldsmith",
                    "suffix": ""
                },
                {
                    "first": "S",
                    "middle": [
                        "R"
                    ],
                    "last": "Zaki",
                    "suffix": ""
                },
                {
                    "first": "T",
                    "middle": [],
                    "last": "Peret",
                    "suffix": ""
                },
                {
                    "first": "S",
                    "middle": [],
                    "last": "Emery",
                    "suffix": ""
                },
                {
                    "first": "S",
                    "middle": [
                        "X"
                    ],
                    "last": "Tong",
                    "suffix": ""
                },
                {
                    "first": "C",
                    "middle": [],
                    "last": "Urbani",
                    "suffix": ""
                },
                {
                    "first": "J",
                    "middle": [
                        "A"
                    ],
                    "last": "Comer",
                    "suffix": ""
                },
                {
                    "first": "W",
                    "middle": [],
                    "last": "Lim",
                    "suffix": ""
                },
                {
                    "first": "P",
                    "middle": [
                        "E"
                    ],
                    "last": "Rollin",
                    "suffix": ""
                },
                {
                    "first": "S",
                    "middle": [
                        "F"
                    ],
                    "last": "Dowell",
                    "suffix": ""
                },
                {
                    "first": "A",
                    "middle": [
                        "E"
                    ],
                    "last": "Ling",
                    "suffix": ""
                },
                {
                    "first": "C",
                    "middle": [
                        "D"
                    ],
                    "last": "Humphrey",
                    "suffix": ""
                },
                {
                    "first": "W",
                    "middle": [
                        "J"
                    ],
                    "last": "Shieh",
                    "suffix": ""
                },
                {
                    "first": "J",
                    "middle": [],
                    "last": "Guarner",
                    "suffix": ""
                },
                {
                    "first": "C",
                    "middle": [
                        "D"
                    ],
                    "last": "Paddock",
                    "suffix": ""
                },
                {
                    "first": "P",
                    "middle": [],
                    "last": "Rota",
                    "suffix": ""
                },
                {
                    "first": "B",
                    "middle": [],
                    "last": "Fields",
                    "suffix": ""
                },
                {
                    "first": "J",
                    "middle": [],
                    "last": "Derisi",
                    "suffix": ""
                },
                {
                    "first": "J",
                    "middle": [
                        "Y"
                    ],
                    "last": "Yang",
                    "suffix": ""
                },
                {
                    "first": "N",
                    "middle": [],
                    "last": "Cox",
                    "suffix": ""
                },
                {
                    "first": "J",
                    "middle": [
                        "M"
                    ],
                    "last": "Hughes",
                    "suffix": ""
                },
                {
                    "first": "J",
                    "middle": [
                        "W"
                    ],
                    "last": "Leduc",
                    "suffix": ""
                },
                {
                    "first": "W",
                    "middle": [
                        "J"
                    ],
                    "last": "Bellini",
                    "suffix": ""
                },
                {
                    "first": "L",
                    "middle": [
                        "J"
                    ],
                    "last": "Anderson",
                    "suffix": ""
                }
            ],
            "year": 2003,
            "venue": "N Engl J Med",
            "volume": "348",
            "issn": "",
            "pages": "1953--1966",
            "other_ids": {}
        },
        "BIBREF2": {
            "ref_id": "b2",
            "title": "The severe acute respiratory syndrome",
            "authors": [
                {
                    "first": "J",
                    "middle": [
                        "S"
                    ],
                    "last": "Peiris",
                    "suffix": ""
                },
                {
                    "first": "K",
                    "middle": [
                        "Y"
                    ],
                    "last": "Yuen",
                    "suffix": ""
                },
                {
                    "first": "A",
                    "middle": [
                        "D"
                    ],
                    "last": "Osterhaus",
                    "suffix": ""
                },
                {
                    "first": "K",
                    "middle": [],
                    "last": "Stohr",
                    "suffix": ""
                }
            ],
            "year": 2003,
            "venue": "N Engl J Med",
            "volume": "349",
            "issn": "",
            "pages": "2431--2441",
            "other_ids": {}
        },
        "BIBREF3": {
            "ref_id": "b3",
            "title": "A previously undescribed coronavirus associated with respiratory disease in humans",
            "authors": [
                {
                    "first": "Ram",
                    "middle": [],
                    "last": "Fouchier",
                    "suffix": ""
                },
                {
                    "first": "N",
                    "middle": [
                        "G"
                    ],
                    "last": "Hartwig",
                    "suffix": ""
                },
                {
                    "first": "T",
                    "middle": [
                        "M"
                    ],
                    "last": "Bestebroer",
                    "suffix": ""
                },
                {
                    "first": "B",
                    "middle": [],
                    "last": "Niemeyer",
                    "suffix": ""
                },
                {
                    "first": "J",
                    "middle": [
                        "C"
                    ],
                    "last": "De Jong",
                    "suffix": ""
                },
                {
                    "first": "J",
                    "middle": [
                        "H"
                    ],
                    "last": "Simon",
                    "suffix": ""
                },
                {
                    "first": "Adme",
                    "middle": [],
                    "last": "Osterhaus",
                    "suffix": ""
                }
            ],
            "year": 2004,
            "venue": "Proc Natl Acad Sci",
            "volume": "101",
            "issn": "",
            "pages": "6212--6216",
            "other_ids": {}
        },
        "BIBREF4": {
            "ref_id": "b4",
            "title": "Identification of a new human coronavirus",
            "authors": [
                {
                    "first": "L",
                    "middle": [],
                    "last": "Van Der Hoek",
                    "suffix": ""
                },
                {
                    "first": "K",
                    "middle": [],
                    "last": "Pyrc",
                    "suffix": ""
                },
                {
                    "first": "M",
                    "middle": [
                        "F"
                    ],
                    "last": "Jebbink",
                    "suffix": ""
                },
                {
                    "first": "W",
                    "middle": [],
                    "last": "Vermeulen-Oost",
                    "suffix": ""
                },
                {
                    "first": "Rjm",
                    "middle": [],
                    "last": "Berkhout",
                    "suffix": ""
                },
                {
                    "first": "K",
                    "middle": [
                        "C"
                    ],
                    "last": "Wolthers",
                    "suffix": ""
                },
                {
                    "first": "Pme",
                    "middle": [],
                    "last": "Van Wertheim-Dillen",
                    "suffix": ""
                },
                {
                    "first": "J",
                    "middle": [],
                    "last": "Kaandorp",
                    "suffix": ""
                },
                {
                    "first": "J",
                    "middle": [],
                    "last": "Spaargaren",
                    "suffix": ""
                },
                {
                    "first": "B",
                    "middle": [],
                    "last": "Berkhout",
                    "suffix": ""
                }
            ],
            "year": 2004,
            "venue": "Nat Med",
            "volume": "10",
            "issn": "",
            "pages": "368--373",
            "other_ids": {}
        },
        "BIBREF5": {
            "ref_id": "b5",
            "title": "Characterization and complete genome sequence of a novel coronavirus, coronavirus HKU1, from patients with pneumonia",
            "authors": [
                {
                    "first": "Pcy",
                    "middle": [],
                    "last": "Woo",
                    "suffix": ""
                },
                {
                    "first": "Skp",
                    "middle": [],
                    "last": "Lau",
                    "suffix": ""
                },
                {
                    "first": "C",
                    "middle": [
                        "M"
                    ],
                    "last": "Chu",
                    "suffix": ""
                },
                {
                    "first": "K",
                    "middle": [
                        "H"
                    ],
                    "last": "Chan",
                    "suffix": ""
                },
                {
                    "first": "H",
                    "middle": [
                        "W"
                    ],
                    "last": "Tsoi",
                    "suffix": ""
                },
                {
                    "first": "Y",
                    "middle": [],
                    "last": "Huang",
                    "suffix": ""
                },
                {
                    "first": "Bhl",
                    "middle": [],
                    "last": "Wong",
                    "suffix": ""
                },
                {
                    "first": "H",
                    "middle": [
                        "L"
                    ],
                    "last": "Wong",
                    "suffix": ""
                },
                {
                    "first": "Rws",
                    "middle": [],
                    "last": "Poon",
                    "suffix": ""
                },
                {
                    "first": "J",
                    "middle": [
                        "J"
                    ],
                    "last": "Cai",
                    "suffix": ""
                },
                {
                    "first": "W",
                    "middle": [
                        "K"
                    ],
                    "last": "Luk",
                    "suffix": ""
                },
                {
                    "first": "Llm",
                    "middle": [],
                    "last": "Poon",
                    "suffix": ""
                },
                {
                    "first": "Ssy",
                    "middle": [],
                    "last": "Wong",
                    "suffix": ""
                },
                {
                    "first": "Y",
                    "middle": [],
                    "last": "Guan",
                    "suffix": ""
                },
                {
                    "first": "Jsm",
                    "middle": [],
                    "last": "Peiris",
                    "suffix": ""
                },
                {
                    "first": "K",
                    "middle": [
                        "Y"
                    ],
                    "last": "Yuen",
                    "suffix": ""
                }
            ],
            "year": 2005,
            "venue": "J Virol",
            "volume": "79",
            "issn": "",
            "pages": "884--895",
            "other_ids": {}
        },
        "BIBREF6": {
            "ref_id": "b6",
            "title": "A newly discovered human pneumovirus isolated from young children with respiratory tract disease",
            "authors": [
                {
                    "first": "B",
                    "middle": [
                        "G"
                    ],
                    "last": "Van Den Hoogen",
                    "suffix": ""
                },
                {
                    "first": "J",
                    "middle": [],
                    "last": "De Jong",
                    "suffix": ""
                },
                {
                    "first": "J",
                    "middle": [],
                    "last": "Groen",
                    "suffix": ""
                },
                {
                    "first": "T",
                    "middle": [],
                    "last": "Kuiken",
                    "suffix": ""
                },
                {
                    "first": "De",
                    "middle": [],
                    "last": "Groot",
                    "suffix": ""
                },
                {
                    "first": "R",
                    "middle": [],
                    "last": "Fouchier",
                    "suffix": ""
                },
                {
                    "first": "Ram",
                    "middle": [],
                    "last": "Osterhaus",
                    "suffix": ""
                },
                {
                    "first": "Adme",
                    "middle": [],
                    "last": "",
                    "suffix": ""
                }
            ],
            "year": 2001,
            "venue": "Nat Med",
            "volume": "7",
            "issn": "",
            "pages": "719--724",
            "other_ids": {}
        },
        "BIBREF7": {
            "ref_id": "b7",
            "title": "Cloning of a human parvovirus by molecular screening of respiratory tract samples",
            "authors": [
                {
                    "first": "T",
                    "middle": [],
                    "last": "Allander",
                    "suffix": ""
                },
                {
                    "first": "M",
                    "middle": [
                        "T"
                    ],
                    "last": "Tammi",
                    "suffix": ""
                },
                {
                    "first": "M",
                    "middle": [],
                    "last": "Eriksson",
                    "suffix": ""
                },
                {
                    "first": "A",
                    "middle": [],
                    "last": "Bjerkner",
                    "suffix": ""
                },
                {
                    "first": "A",
                    "middle": [],
                    "last": "Tiveljung-Lindell",
                    "suffix": ""
                },
                {
                    "first": "B",
                    "middle": [],
                    "last": "Andersson",
                    "suffix": ""
                }
            ],
            "year": 2005,
            "venue": "Proc Natl Acad Sci",
            "volume": "102",
            "issn": "",
            "pages": "12891--12896",
            "other_ids": {}
        },
        "BIBREF8": {
            "ref_id": "b8",
            "title": "Identification of a third human polyomavirus",
            "authors": [
                {
                    "first": "T",
                    "middle": [],
                    "last": "Allander",
                    "suffix": ""
                },
                {
                    "first": "K",
                    "middle": [],
                    "last": "Andreasson",
                    "suffix": ""
                },
                {
                    "first": "S",
                    "middle": [],
                    "last": "Gupta",
                    "suffix": ""
                },
                {
                    "first": "A",
                    "middle": [],
                    "last": "Bjerkner",
                    "suffix": ""
                },
                {
                    "first": "G",
                    "middle": [],
                    "last": "Bogdanovic",
                    "suffix": ""
                },
                {
                    "first": "Maa",
                    "middle": [],
                    "last": "Persson",
                    "suffix": ""
                },
                {
                    "first": "T",
                    "middle": [],
                    "last": "Dalianis",
                    "suffix": ""
                },
                {
                    "first": "T",
                    "middle": [],
                    "last": "Ramqvist",
                    "suffix": ""
                },
                {
                    "first": "B",
                    "middle": [],
                    "last": "Andersson",
                    "suffix": ""
                }
            ],
            "year": 2007,
            "venue": "J Virol",
            "volume": "81",
            "issn": "",
            "pages": "4130--4136",
            "other_ids": {}
        },
        "BIBREF9": {
            "ref_id": "b9",
            "title": "Identification of a novel polyomavirus from patients with acute respiratory tract infections",
            "authors": [
                {
                    "first": "A",
                    "middle": [
                        "M"
                    ],
                    "last": "Gaynor",
                    "suffix": ""
                },
                {
                    "first": "M",
                    "middle": [
                        "D"
                    ],
                    "last": "Nissen",
                    "suffix": ""
                },
                {
                    "first": "D",
                    "middle": [
                        "M"
                    ],
                    "last": "Whiley",
                    "suffix": ""
                },
                {
                    "first": "I",
                    "middle": [
                        "M"
                    ],
                    "last": "Mackay",
                    "suffix": ""
                },
                {
                    "first": "S",
                    "middle": [
                        "B"
                    ],
                    "last": "Lambert",
                    "suffix": ""
                },
                {
                    "first": "G",
                    "middle": [],
                    "last": "Wu",
                    "suffix": ""
                },
                {
                    "first": "D",
                    "middle": [
                        "C"
                    ],
                    "last": "Brennan",
                    "suffix": ""
                },
                {
                    "first": "G",
                    "middle": [
                        "A"
                    ],
                    "last": "Storch",
                    "suffix": ""
                },
                {
                    "first": "T",
                    "middle": [
                        "P"
                    ],
                    "last": "Sloots",
                    "suffix": ""
                },
                {
                    "first": "D",
                    "middle": [],
                    "last": "Wang",
                    "suffix": ""
                }
            ],
            "year": 2007,
            "venue": "PLoS Pathog",
            "volume": "3",
            "issn": "",
            "pages": "595--604",
            "other_ids": {}
        },
        "BIBREF10": {
            "ref_id": "b10",
            "title": "MassTag polymerasechain-reaction detection of respiratory pathogens, including a new rhinovirus genotype, that caused influenza-like illness",
            "authors": [
                {
                    "first": "D",
                    "middle": [],
                    "last": "Lamson",
                    "suffix": ""
                },
                {
                    "first": "N",
                    "middle": [],
                    "last": "Renwick",
                    "suffix": ""
                },
                {
                    "first": "V",
                    "middle": [],
                    "last": "Kapoor",
                    "suffix": ""
                },
                {
                    "first": "Z",
                    "middle": [],
                    "last": "Liu",
                    "suffix": ""
                },
                {
                    "first": "G",
                    "middle": [],
                    "last": "Palacios",
                    "suffix": ""
                },
                {
                    "first": "J",
                    "middle": [],
                    "last": "Ju",
                    "suffix": ""
                },
                {
                    "first": "A",
                    "middle": [],
                    "last": "Dean",
                    "suffix": ""
                },
                {
                    "first": "K",
                    "middle": [
                        "S"
                    ],
                    "last": "George",
                    "suffix": ""
                },
                {
                    "first": "T",
                    "middle": [],
                    "last": "Briese",
                    "suffix": ""
                },
                {
                    "first": "W",
                    "middle": [
                        "I"
                    ],
                    "last": "Lipkin",
                    "suffix": ""
                }
            ],
            "year": 2004,
            "venue": "J Infect Dis",
            "volume": "194",
            "issn": "",
            "pages": "1398--1402",
            "other_ids": {}
        },
        "BIBREF11": {
            "ref_id": "b11",
            "title": "Clinical features and complete genome characterization of a distinct human rhinovirus (HRV) genetic previously undetected HRV cluster, probably representing a species, HRV-C, associated with acute respiratory illness in children",
            "authors": [
                {
                    "first": "Skp",
                    "middle": [],
                    "last": "Lau",
                    "suffix": ""
                },
                {
                    "first": "Ccy",
                    "middle": [],
                    "last": "Yip",
                    "suffix": ""
                },
                {
                    "first": "H",
                    "middle": [
                        "W"
                    ],
                    "last": "Tsoi",
                    "suffix": ""
                },
                {
                    "first": "R",
                    "middle": [
                        "A"
                    ],
                    "last": "Lee",
                    "suffix": ""
                },
                {
                    "first": "L",
                    "middle": [
                        "Y"
                    ],
                    "last": "So",
                    "suffix": ""
                },
                {
                    "first": "Y",
                    "middle": [
                        "L"
                    ],
                    "last": "Lau",
                    "suffix": ""
                },
                {
                    "first": "K",
                    "middle": [
                        "H"
                    ],
                    "last": "Chan",
                    "suffix": ""
                },
                {
                    "first": "Pcy",
                    "middle": [],
                    "last": "Woo",
                    "suffix": ""
                },
                {
                    "first": "K",
                    "middle": [
                        "Y"
                    ],
                    "last": "Yuen",
                    "suffix": ""
                }
            ],
            "year": 2007,
            "venue": "J Clin Microbiol",
            "volume": "45",
            "issn": "",
            "pages": "3655--3664",
            "other_ids": {}
        },
        "BIBREF12": {
            "ref_id": "b12",
            "title": "Real-world comparison of two molecular methods for detection of respiratory viruses",
            "authors": [
                {
                    "first": "S",
                    "middle": [
                        "A"
                    ],
                    "last": "Ali",
                    "suffix": ""
                },
                {
                    "first": "J",
                    "middle": [
                        "E"
                    ],
                    "last": "Gern",
                    "suffix": ""
                },
                {
                    "first": "T",
                    "middle": [
                        "V"
                    ],
                    "last": "Hartert",
                    "suffix": ""
                },
                {
                    "first": "K",
                    "middle": [
                        "M"
                    ],
                    "last": "Edwards",
                    "suffix": ""
                },
                {
                    "first": "M",
                    "middle": [
                        "R"
                    ],
                    "last": "Griffin",
                    "suffix": ""
                },
                {
                    "first": "E",
                    "middle": [
                        "K"
                    ],
                    "last": "Miller",
                    "suffix": ""
                },
                {
                    "first": "T",
                    "middle": [],
                    "last": "Gebretsadik",
                    "suffix": ""
                },
                {
                    "first": "T",
                    "middle": [],
                    "last": "Pappas",
                    "suffix": ""
                },
                {
                    "first": "W",
                    "middle": [
                        "M"
                    ],
                    "last": "Lee",
                    "suffix": ""
                },
                {
                    "first": "J",
                    "middle": [
                        "V"
                    ],
                    "last": "Williams",
                    "suffix": ""
                }
            ],
            "year": 2011,
            "venue": "Virol J",
            "volume": "8",
            "issn": "",
            "pages": "",
            "other_ids": {}
        },
        "BIBREF13": {
            "ref_id": "b13",
            "title": "Frequent detection of human rhinoviruses, paramyxoviruses, coronaviruses, and bocavirus during acute respiratory tract infections",
            "authors": [
                {
                    "first": "K",
                    "middle": [
                        "E"
                    ],
                    "last": "Arden",
                    "suffix": ""
                },
                {
                    "first": "P",
                    "middle": [],
                    "last": "Mcerlean",
                    "suffix": ""
                },
                {
                    "first": "M",
                    "middle": [
                        "D"
                    ],
                    "last": "Nissen",
                    "suffix": ""
                },
                {
                    "first": "T",
                    "middle": [
                        "P"
                    ],
                    "last": "Sloots",
                    "suffix": ""
                },
                {
                    "first": "I",
                    "middle": [
                        "M"
                    ],
                    "last": "Mackay",
                    "suffix": ""
                }
            ],
            "year": 2006,
            "venue": "J Med Virol",
            "volume": "78",
            "issn": "",
            "pages": "1232--1240",
            "other_ids": {}
        },
        "BIBREF14": {
            "ref_id": "b14",
            "title": "Seasonal variations of 15 respiratory agents illustrated by the application of a multiplex polymerase chain reaction assay",
            "authors": [
                {
                    "first": "R",
                    "middle": [],
                    "last": "Brittain-Long",
                    "suffix": ""
                },
                {
                    "first": "L",
                    "middle": [
                        "M"
                    ],
                    "last": "Andersson",
                    "suffix": ""
                },
                {
                    "first": "S",
                    "middle": [],
                    "last": "Olofsson",
                    "suffix": ""
                },
                {
                    "first": "M",
                    "middle": [],
                    "last": "Lindh",
                    "suffix": ""
                },
                {
                    "first": "J",
                    "middle": [],
                    "last": "Westin",
                    "suffix": ""
                }
            ],
            "year": 2012,
            "venue": "Scand J Infect Dis",
            "volume": "44",
            "issn": "",
            "pages": "9--17",
            "other_ids": {}
        },
        "BIBREF15": {
            "ref_id": "b15",
            "title": "Comparison of two multiplex methods for detection of respiratory viruses: FilmArray RP and xTAG RVP",
            "authors": [
                {
                    "first": "K",
                    "middle": [
                        "H"
                    ],
                    "last": "Rand",
                    "suffix": ""
                },
                {
                    "first": "H",
                    "middle": [],
                    "last": "Rampersaud",
                    "suffix": ""
                },
                {
                    "first": "H",
                    "middle": [
                        "J"
                    ],
                    "last": "Houck",
                    "suffix": ""
                }
            ],
            "year": 2011,
            "venue": "J Clin Microbiol",
            "volume": "49",
            "issn": "",
            "pages": "2449--2453",
            "other_ids": {}
        },
        "BIBREF16": {
            "ref_id": "b16",
            "title": "Consensus-degenerate hybrid oligonucleotide primers (CODEHOP) for the detection of novel papillomaviruses and their application to esophageal and tonsillar carcinomas",
            "authors": [
                {
                    "first": "J",
                    "middle": [
                        "E"
                    ],
                    "last": "Baines",
                    "suffix": ""
                },
                {
                    "first": "R",
                    "middle": [
                        "M"
                    ],
                    "last": "Mcgovern",
                    "suffix": ""
                },
                {
                    "first": "D",
                    "middle": [],
                    "last": "Persing",
                    "suffix": ""
                },
                {
                    "first": "B",
                    "middle": [
                        "S"
                    ],
                    "last": "Gostout",
                    "suffix": ""
                }
            ],
            "year": 2005,
            "venue": "J Virol Methods",
            "volume": "123",
            "issn": "",
            "pages": "81--87",
            "other_ids": {}
        },
        "BIBREF17": {
            "ref_id": "b17",
            "title": "CODEHOP (COnsensus-DEgenerate hybrid oligonucleotide primer) PCR primer design",
            "authors": [
                {
                    "first": "T",
                    "middle": [
                        "M"
                    ],
                    "last": "Rose",
                    "suffix": ""
                },
                {
                    "first": "J",
                    "middle": [
                        "G"
                    ],
                    "last": "Henikoff",
                    "suffix": ""
                },
                {
                    "first": "S",
                    "middle": [],
                    "last": "Henikoff",
                    "suffix": ""
                }
            ],
            "year": 2003,
            "venue": "Nucleic Acids Res",
            "volume": "31",
            "issn": "",
            "pages": "3763--3766",
            "other_ids": {}
        },
        "BIBREF18": {
            "ref_id": "b18",
            "title": "CODEHOP-mediated PCR-a powerful technique for the identification and characterization of viral genomes",
            "authors": [
                {
                    "first": "T",
                    "middle": [
                        "M"
                    ],
                    "last": "Rose",
                    "suffix": ""
                }
            ],
            "year": 2005,
            "venue": "Virol J",
            "volume": "2",
            "issn": "",
            "pages": "",
            "other_ids": {}
        },
        "BIBREF19": {
            "ref_id": "b19",
            "title": "Consensus-degenerate hybrid oligonucleotide primers (CODE-HOPs) for the detection of novel viruses in non-human primates",
            "authors": [
                {
                    "first": "J",
                    "middle": [
                        "P"
                    ],
                    "last": "Staheli",
                    "suffix": ""
                },
                {
                    "first": "J",
                    "middle": [
                        "T"
                    ],
                    "last": "Ryan",
                    "suffix": ""
                },
                {
                    "first": "A",
                    "middle": [
                        "G"
                    ],
                    "last": "Bruce",
                    "suffix": ""
                },
                {
                    "first": "R",
                    "middle": [],
                    "last": "Boyce",
                    "suffix": ""
                },
                {
                    "first": "T",
                    "middle": [
                        "M"
                    ],
                    "last": "Rose",
                    "suffix": ""
                }
            ],
            "year": 2009,
            "venue": "Methods",
            "volume": "49",
            "issn": "",
            "pages": "32--41",
            "other_ids": {}
        },
        "BIBREF20": {
            "ref_id": "b20",
            "title": "A sensitive assay for virus discovery in respiratory clinical samples",
            "authors": [
                {
                    "first": "M",
                    "middle": [],
                    "last": "De Vries",
                    "suffix": ""
                },
                {
                    "first": "M",
                    "middle": [],
                    "last": "Deijs",
                    "suffix": ""
                },
                {
                    "first": "M",
                    "middle": [],
                    "last": "Canuti",
                    "suffix": ""
                },
                {
                    "first": "Bdc",
                    "middle": [],
                    "last": "Van Schaik",
                    "suffix": ""
                },
                {
                    "first": "N",
                    "middle": [
                        "R"
                    ],
                    "last": "Faria",
                    "suffix": ""
                },
                {
                    "first": "Mdb",
                    "middle": [],
                    "last": "Van De Garde",
                    "suffix": ""
                },
                {
                    "first": "Lcm",
                    "middle": [],
                    "last": "Jachimowski",
                    "suffix": ""
                },
                {
                    "first": "M",
                    "middle": [
                        "F"
                    ],
                    "last": "Jebbink",
                    "suffix": ""
                },
                {
                    "first": "M",
                    "middle": [],
                    "last": "Jakobs",
                    "suffix": ""
                },
                {
                    "first": "Acm",
                    "middle": [],
                    "last": "Luyf",
                    "suffix": ""
                },
                {
                    "first": "Fej",
                    "middle": [],
                    "last": "Coenjaerts",
                    "suffix": ""
                },
                {
                    "first": "Ecj",
                    "middle": [],
                    "last": "Claas",
                    "suffix": ""
                },
                {
                    "first": "R",
                    "middle": [],
                    "last": "Molenkamp",
                    "suffix": ""
                },
                {
                    "first": "S",
                    "middle": [
                        "M"
                    ],
                    "last": "Koekkoek",
                    "suffix": ""
                },
                {
                    "first": "C",
                    "middle": [],
                    "last": "Lammens",
                    "suffix": ""
                },
                {
                    "first": "F",
                    "middle": [],
                    "last": "Leus",
                    "suffix": ""
                },
                {
                    "first": "H",
                    "middle": [],
                    "last": "Goossens",
                    "suffix": ""
                },
                {
                    "first": "M",
                    "middle": [],
                    "last": "Ieven",
                    "suffix": ""
                },
                {
                    "first": "F",
                    "middle": [],
                    "last": "Baas",
                    "suffix": ""
                },
                {
                    "first": "L",
                    "middle": [],
                    "last": "Van Der Hoek",
                    "suffix": ""
                }
            ],
            "year": 2011,
            "venue": "PLoS One",
            "volume": "6",
            "issn": "",
            "pages": "",
            "other_ids": {}
        },
        "BIBREF21": {
            "ref_id": "b21",
            "title": "Random PCR and ultracentrifugation increases sensitivity and throughput of VIDISCA for screening of pathogens in clinical specimens",
            "authors": [
                {
                    "first": "L",
                    "middle": [
                        "V"
                    ],
                    "last": "Tan",
                    "suffix": ""
                },
                {
                    "first": "H",
                    "middle": [
                        "R"
                    ],
                    "last": "Van Doorn",
                    "suffix": ""
                },
                {
                    "first": "L",
                    "middle": [],
                    "last": "Van Der Hoek",
                    "suffix": ""
                },
                {
                    "first": "V",
                    "middle": [
                        "M"
                    ],
                    "last": "Hien",
                    "suffix": ""
                },
                {
                    "first": "M",
                    "middle": [
                        "F"
                    ],
                    "last": "Jebbink",
                    "suffix": ""
                },
                {
                    "first": "D",
                    "middle": [
                        "Q"
                    ],
                    "last": "Ha",
                    "suffix": ""
                },
                {
                    "first": "J",
                    "middle": [],
                    "last": "Farrar",
                    "suffix": ""
                },
                {
                    "first": "Vvc",
                    "middle": [],
                    "last": "Nguyen",
                    "suffix": ""
                },
                {
                    "first": "M",
                    "middle": [
                        "D"
                    ],
                    "last": "De Jong",
                    "suffix": ""
                }
            ],
            "year": 2011,
            "venue": "J Infect Dev Ctries",
            "volume": "5",
            "issn": "",
            "pages": "142--148",
            "other_ids": {}
        },
        "BIBREF22": {
            "ref_id": "b22",
            "title": "Design and validation of consensus-degenerate hybrid oligonucleotide primers for broad and sensitive detection of corona-and toroviruses",
            "authors": [
                {
                    "first": "K",
                    "middle": [
                        "T"
                    ],
                    "last": "Zlateva",
                    "suffix": ""
                },
                {
                    "first": "K",
                    "middle": [
                        "M"
                    ],
                    "last": "Crusio",
                    "suffix": ""
                },
                {
                    "first": "A",
                    "middle": [
                        "M"
                    ],
                    "last": "Leontovich",
                    "suffix": ""
                },
                {
                    "first": "C",
                    "middle": [],
                    "last": "Lauber",
                    "suffix": ""
                },
                {
                    "first": "E",
                    "middle": [],
                    "last": "Claas",
                    "suffix": ""
                },
                {
                    "first": "A",
                    "middle": [
                        "A"
                    ],
                    "last": "Kravchenko",
                    "suffix": ""
                },
                {
                    "first": "Wjm",
                    "middle": [],
                    "last": "Spaan",
                    "suffix": ""
                },
                {
                    "first": "A",
                    "middle": [
                        "E"
                    ],
                    "last": "Gorbalenya",
                    "suffix": ""
                }
            ],
            "year": 2011,
            "venue": "J Virol Methods",
            "volume": "177",
            "issn": "",
            "pages": "174--183",
            "other_ids": {}
        },
        "BIBREF23": {
            "ref_id": "b23",
            "title": "Variation in antibiotic prescribing and its impact on recovery in patients with acute cough in primary care: prospective study in 13 countries",
            "authors": [
                {
                    "first": "C",
                    "middle": [
                        "C"
                    ],
                    "last": "Butler",
                    "suffix": ""
                },
                {
                    "first": "K",
                    "middle": [],
                    "last": "Hood",
                    "suffix": ""
                },
                {
                    "first": "T",
                    "middle": [],
                    "last": "Verheij",
                    "suffix": ""
                },
                {
                    "first": "P",
                    "middle": [],
                    "last": "Little",
                    "suffix": ""
                },
                {
                    "first": "H",
                    "middle": [],
                    "last": "Melbye",
                    "suffix": ""
                },
                {
                    "first": "J",
                    "middle": [],
                    "last": "Nuttall",
                    "suffix": ""
                },
                {
                    "first": "Mjk",
                    "middle": [],
                    "last": "Statistician",
                    "suffix": ""
                },
                {
                    "first": "S",
                    "middle": [],
                    "last": "Molstad",
                    "suffix": ""
                },
                {
                    "first": "M",
                    "middle": [],
                    "last": "Godycki-Cwirko",
                    "suffix": ""
                },
                {
                    "first": "J",
                    "middle": [],
                    "last": "Almirall",
                    "suffix": ""
                },
                {
                    "first": "A",
                    "middle": [],
                    "last": "Torres",
                    "suffix": ""
                },
                {
                    "first": "D",
                    "middle": [],
                    "last": "Gillespie",
                    "suffix": ""
                },
                {
                    "first": "U",
                    "middle": [],
                    "last": "Rautakorpi",
                    "suffix": ""
                },
                {
                    "first": "S",
                    "middle": [],
                    "last": "Coenen",
                    "suffix": ""
                },
                {
                    "first": "H",
                    "middle": [],
                    "last": "Goossens",
                    "suffix": ""
                }
            ],
            "year": 2009,
            "venue": "British Med J",
            "volume": "338",
            "issn": "",
            "pages": "",
            "other_ids": {}
        },
        "BIBREF24": {
            "ref_id": "b24",
            "title": "Detection of multiple respiratory pathogens during primary respiratory infection: nasal swab versus nasopharyngeal aspirate using real-time polymerase chain reaction",
            "authors": [
                {
                    "first": "T",
                    "middle": [
                        "J"
                    ],
                    "last": "Meerhoff",
                    "suffix": ""
                },
                {
                    "first": "M",
                    "middle": [
                        "L"
                    ],
                    "last": "Houben",
                    "suffix": ""
                },
                {
                    "first": "Fej",
                    "middle": [],
                    "last": "Coenjaerts",
                    "suffix": ""
                },
                {
                    "first": "Jll",
                    "middle": [],
                    "last": "Kimpen",
                    "suffix": ""
                },
                {
                    "first": "R",
                    "middle": [
                        "W"
                    ],
                    "last": "Hofland",
                    "suffix": ""
                },
                {
                    "first": "F",
                    "middle": [],
                    "last": "Schellevis",
                    "suffix": ""
                },
                {
                    "first": "L",
                    "middle": [
                        "J"
                    ],
                    "last": "Bont",
                    "suffix": ""
                }
            ],
            "year": 2010,
            "venue": "Eur J Clin Microbiol Infect Dis",
            "volume": "29",
            "issn": "",
            "pages": "365--371",
            "other_ids": {}
        },
        "BIBREF25": {
            "ref_id": "b25",
            "title": "Why most published research findings are false",
            "authors": [
                {
                    "first": "Jpa",
                    "middle": [],
                    "last": "Ioannidis",
                    "suffix": ""
                }
            ],
            "year": 2005,
            "venue": "PLoS Med",
            "volume": "2",
            "issn": "",
            "pages": "696--701",
            "other_ids": {}
        },
        "BIBREF26": {
            "ref_id": "b26",
            "title": "A novel pancoronavirus RT-PCR assay: frequent detection of human coronavirus NL63 in children hospitalized with respiratory tract infections in Belgium",
            "authors": [
                {
                    "first": "E",
                    "middle": [],
                    "last": "Moes",
                    "suffix": ""
                },
                {
                    "first": "L",
                    "middle": [],
                    "last": "Vijgen",
                    "suffix": ""
                },
                {
                    "first": "E",
                    "middle": [],
                    "last": "Keyaerts",
                    "suffix": ""
                },
                {
                    "first": "K",
                    "middle": [],
                    "last": "Zlateva",
                    "suffix": ""
                },
                {
                    "first": "S",
                    "middle": [],
                    "last": "Li",
                    "suffix": ""
                },
                {
                    "first": "P",
                    "middle": [],
                    "last": "Maes",
                    "suffix": ""
                },
                {
                    "first": "K",
                    "middle": [],
                    "last": "Pyrc",
                    "suffix": ""
                },
                {
                    "first": "B",
                    "middle": [],
                    "last": "Berkhout",
                    "suffix": ""
                },
                {
                    "first": "L",
                    "middle": [],
                    "last": "Van Der Hoek",
                    "suffix": ""
                },
                {
                    "first": "M",
                    "middle": [],
                    "last": "Van Ranst",
                    "suffix": ""
                }
            ],
            "year": 2005,
            "venue": "BMC Infect Dis",
            "volume": "5",
            "issn": "",
            "pages": "",
            "other_ids": {}
        },
        "BIBREF27": {
            "ref_id": "b27",
            "title": "A viral discovery methodology for clinical biopsy samples utilising massively parallel next generation sequencing",
            "authors": [
                {
                    "first": "G",
                    "middle": [
                        "M"
                    ],
                    "last": "Daly",
                    "suffix": ""
                },
                {
                    "first": "N",
                    "middle": [],
                    "last": "Bexfield",
                    "suffix": ""
                },
                {
                    "first": "J",
                    "middle": [],
                    "last": "Heaney",
                    "suffix": ""
                },
                {
                    "first": "S",
                    "middle": [],
                    "last": "Stubbs",
                    "suffix": ""
                },
                {
                    "first": "A",
                    "middle": [
                        "P"
                    ],
                    "last": "Mayer",
                    "suffix": ""
                },
                {
                    "first": "A",
                    "middle": [],
                    "last": "Palser",
                    "suffix": ""
                },
                {
                    "first": "P",
                    "middle": [],
                    "last": "Kellam",
                    "suffix": ""
                },
                {
                    "first": "N",
                    "middle": [],
                    "last": "Drou",
                    "suffix": ""
                },
                {
                    "first": "M",
                    "middle": [],
                    "last": "Caccamo",
                    "suffix": ""
                },
                {
                    "first": "L",
                    "middle": [],
                    "last": "Tiley",
                    "suffix": ""
                },
                {
                    "first": "Gjm",
                    "middle": [],
                    "last": "Alexander",
                    "suffix": ""
                },
                {
                    "first": "W",
                    "middle": [],
                    "last": "Bernal",
                    "suffix": ""
                },
                {
                    "first": "J",
                    "middle": [
                        "L"
                    ],
                    "last": "Heeney",
                    "suffix": ""
                }
            ],
            "year": 2011,
            "venue": "PLoS One",
            "volume": "6",
            "issn": "",
            "pages": "",
            "other_ids": {}
        }
    },
    "ref_entries": {
        "FIGREF0": {
            "text": "GTG GAA AAC CTT TGG CA 300 nM FAM-ATG TTA TTC AGT GCT TTG GTC CTC GTG AT-TAMRA 100 nM HCoV-OC43 S CGA TGA GGC TAT TCC GAC TAG GT 900 nM AS CCT TCC TGA GCC TTC AAT ATA GTA ACC 900 nM FAM-TCC GCC TGG CAC GGT ACT CCC T",
            "latex": null,
            "type": "figure"
        },
        "TABREF0": {
            "text": "Detection of human coronaviruses using the CT12-mCODEHOP one-step RT-PCR assay in nasopharyngeal swabs that were positive for coronavirus by real-time PCR a HCoVs were initially detected using a multiplex coronavirus real-time RT-PCR and then typed by monoplex real-time PCR assays. Cycle threshold number (Ct) values obtained by both methods were similar, and the monoplex-based results are presented in the table b Total number of HCoV-positives c IQM, interquartile median and IQR, interquartile range, for Ct values",
            "latex": null,
            "type": "table"
        }
    },
    "back_matter": [
        {
            "text": "Acknowledgments We thank our GRACE project colleagues Herman Goossens, Anton M. van Loon and all involved in the GRACE Primary Care Network for the opportunity to conduct this study, and Lia van der Hoek, Igor Sidorov, Chris Lauber and Michael Rozanov for advice and discussions. This study was partially supported by an EU FP6 GRACE grant (LSHM-CT12-2005-518226).",
            "cite_spans": [],
            "ref_spans": [],
            "section": "acknowledgement"
        }
    ]
}