Governorate,data,se,prop,margin,lower,upper,ci,variable
Al-Anbar,Overall,0.02206558712855009,0.21875,0.043248550771958175,0.17550144922804184,0.26199855077195816,0.176-0.262,USAID-message
Al-Basra,Overall,0.020385652689714297,0.26439232409381663,0.03995587927184002,0.2244364448219766,0.30434820336565666,0.224-0.304,USAID-message
Baghdad,Overall,0.01154052797957251,0.15242018537590113,0.022619434839962118,0.129800750535939,0.17503962021586325,0.13-0.175,USAID-message
Erbil,Overall,0.019927565795595216,0.17222222222222222,0.03905802895936662,0.1331641932628556,0.21128025118158883,0.133-0.211,USAID-message
Ninawa,Overall,0.01684689177168138,0.2358490566037736,0.03301990787249551,0.20282914873127808,0.26886896447626907,0.203-0.269,USAID-message
Al-Anbar,Household,0.0326022473063975,0.20261437908496732,0.0639004047205391,0.13871397436442823,0.2665147838055064,0.139-0.267,USAID-message
Al-Basra,Household,0.030066761582977983,0.31092436974789917,0.05893085270263684,0.2519935170452623,0.36985522245053604,0.252-0.37,USAID-message
Baghdad,Household,0.013514594096081545,0.14454277286135694,0.026488604428319826,0.11805416843303712,0.17103137728967677,0.118-0.171,USAID-message
Erbil,Household,0,0,0,0,0,0-0,USAID-message
Ninawa,Household,0.02348782689405016,0.21122112211221122,0.04603614071233831,0.16518498139987292,0.2572572628245495,0.165-0.257,USAID-message
Al-Anbar,Crowdsource,0.02995980343914042,0.23115577889447236,0.05872121474071522,0.17243456415375713,0.2898769936351876,0.172-0.29,USAID-message
Al-Basra,Crowdsource,0.027154911498168278,0.21645021645021645,0.05322362653640982,0.16322658991380662,0.2696738429866263,0.163-0.27,USAID-message
Baghdad,Crowdsource,0.022015527353792506,0.17064846416382254,0.04315043361343331,0.12749803055038922,0.21379889777725586,0.127-0.214,USAID-message
Erbil,Crowdsource,0.03155253554505403,0.29523809523809524,0.061842969668305894,0.23339512556978936,0.3570810649064011,0.233-0.357,USAID-message
Ninawa,Crowdsource,0.02402063183837315,0.25825825825825827,0.04708043840321137,0.2111778198550469,0.3053386966614696,0.211-0.305,USAID-message
Al-Anbar,Overall,0.025632850101854468,0.36079545454545453,0.05024038619963476,0.31055506834581975,0.4110358407450893,0.311-0.411,seen
Al-Basra,Overall,0.021443261111961064,0.31343283582089554,0.042028791779443686,0.27140404404145185,0.3554616276003392,0.271-0.355,seen
Baghdad,Overall,0.012583202353196992,0.18949536560247168,0.024663076612266105,0.16483228899020558,0.2141584422147378,0.165-0.214,seen
Erbil,Overall,0.02424936578797517,0.30277777777777776,0.04752875694443133,0.25524902083334644,0.3503065347222091,0.255-0.35,seen
Ninawa,Overall,0.01917087868101527,0.3710691823899371,0.03757492221478993,0.33349426017514716,0.408644104604727,0.333-0.409,seen
Al-Anbar,Household,0.03892074617361964,0.35947712418300654,0.07628466250029449,0.28319246168271206,0.435761786683301,0.283-0.436,seen
Al-Basra,Household,0.030868682604121605,0.3445378151260504,0.06050261790407834,0.28403519722197207,0.40504043303012877,0.284-0.405,seen
Baghdad,Household,0.012978623154648941,0.13126843657817108,0.025438101383111925,0.10583033519505916,0.156706537961283,0.106-0.157,seen
Erbil,Household,0.009396399265931733,0.013333333333333334,0.018416942561226196,-0.005083609227892862,0.03175027589455953,-0.005-0.032,seen
Ninawa,Household,0.024608166018380166,0.24092409240924093,0.048232005396025124,0.1926920870132158,0.2891560978052661,0.193-0.289,seen
Al-Anbar,Crowdsource,0.03414934964098813,0.36180904522613067,0.06693272529633675,0.2948763199297939,0.4287417705224674,0.295-0.429,seen
Al-Basra,Crowdsource,0.029650691377305288,0.2813852813852814,0.05811535509951836,0.22326992628576303,0.3395006364847998,0.223-0.34,seen
Baghdad,Crowdsource,0.027392732198469952,0.3242320819112628,0.053689755109001105,0.2705423268022617,0.3779218370202639,0.271-0.378,seen
Erbil,Crowdsource,0.03457944857003125,0.5095238095238095,0.06777571919726125,0.44174809032654827,0.5772995287210707,0.442-0.577,seen
Ninawa,Crowdsource,0.027435001452985688,0.4894894894894895,0.053772602847851944,0.43571688664163755,0.5432620923373415,0.436-0.543,seen
Al-Anbar,Overall,0.02284382748947434,0.7585227272727273,0.04477390187936971,0.7137488253933576,0.803296629152097,0.714-0.803,performance
Al-Basra,Overall,0.020882333793024507,0.7142857142857143,0.040929374234328034,0.6733563400513862,0.7552150885200424,0.673-0.755,performance
Baghdad,Overall,0.015791149675026678,0.5901132852729145,0.030950653363052288,0.5591626319098623,0.6210639386359668,0.559-0.621,performance
Erbil,Overall,0.025762137193610708,0.6083333333333333,0.05049378889947699,0.5578395444338563,0.6588271222328103,0.558-0.659,performance
Ninawa,Overall,0.01824469213249501,0.6965408805031447,0.035759596579690224,0.6607812839234545,0.7323004770828349,0.661-0.732,performance
Al-Anbar,Household,0.027911513594011398,0.8627450980392157,0.054706566644262336,0.8080385313949534,0.917451664683478,0.808-0.917,performance
Al-Basra,Household,0.028510251512341933,0.7394957983193278,0.055880092964190185,0.6836157053551376,0.7953758912835179,0.684-0.795,performance
Baghdad,Household,0.01891317849483117,0.588495575221239,0.03706982984986909,0.5514257453713699,0.625565405071108,0.551-0.626,performance
Erbil,Household,0.03821521535414603,0.68,0.07490182209412621,0.6050981779058738,0.7549018220941263,0.605-0.755,performance
Ninawa,Household,0.023074191917529456,0.7986798679867987,0.045225416158357734,0.753454451828441,0.8439052841451564,0.753-0.844,performance
Al-Anbar,Crowdsource,0.03319488739074454,0.678391959798995,0.0650619792858593,0.6133299805131357,0.7434539390848544,0.613-0.743,performance
Al-Basra,Crowdsource,0.03054139799519459,0.6883116883116883,0.059861140070581395,0.6284505482411069,0.7481728283822697,0.628-0.748,performance
Baghdad,Crowdsource,0.02874015187242137,0.5938566552901023,0.05633069766994588,0.5375259576201564,0.6501873529600483,0.538-0.65,performance
Erbil,Crowdsource,0.03435911486831023,0.5571428571428572,0.06734386514188806,0.4897989920009691,0.6244867222847452,0.49-0.624,performance
Ninawa,Crowdsource,0.026845513710610724,0.6036036036036037,0.05261720687279702,0.5509863967308066,0.6562208104764007,0.551-0.656,performance
Al-Anbar,Overall,0.05148961455006562,0.6292134831460674,0.10091964451812861,0.5282938386279388,0.730133127664196,0.528-0.73,perception
Al-Basra,Overall,0.04865042554105199,0.6923076923076923,0.0953548340604619,0.5969528582472304,0.7876625263681541,0.597-0.788,perception
Baghdad,Overall,0.05016135580465919,0.47,0.09831625737713201,0.37168374262286796,0.568316257377132,0.372-0.568,perception
Erbil,Overall,0.052072996911863435,0.3037974683544304,0.10206307394725234,0.20173439440717805,0.4058605423016827,0.202-0.406,perception
Ninawa,Overall,0.038470214204560226,0.6012269938650306,0.07540161984093804,0.5258253740240926,0.6766286137059687,0.526-0.677,perception
Al-Anbar,Household,0.07584124375059005,0.6190476190476191,0.1486488377511565,0.47039878129646256,0.7676964567987756,0.47-0.768,perception
Al-Basra,Household,0.06443794794178424,0.7058823529411765,0.1262983779658971,0.5795839749752794,0.8321807309070737,0.58-0.832,perception
Baghdad,Household,0.07069708383262724,0.49019607843137253,0.1385662843119494,0.35162979411942313,0.6287623627433219,0.352-0.629,perception
Erbil,Household,0,1,0,1,1,1-1,perception
Ninawa,Household,0.06520506636966264,0.7142857142857143,0.12780193008453877,0.5864837842011755,0.8420876443702531,0.586-0.842,perception
Al-Anbar,Crowdsource,0.07084485475872633,0.6382978723404256,0.13885591532710362,0.49944195701332195,0.7771537876675292,0.499-0.777,perception
Al-Basra,Crowdsource,0.075,0.675,0.147,0.528,0.8220000000000001,0.528-0.822,perception
Baghdad,Crowdsource,0.07179207795648106,0.4489795918367347,0.14071247279470286,0.30826711904203186,0.5896920646314375,0.308-0.59,perception
Erbil,Crowdsource,0.05181973215071512,0.2857142857142857,0.10156667501540163,0.18414761069888408,0.3872809607296873,0.184-0.387,perception
Ninawa,Crowdsource,0.04677473004491205,0.5526315789473685,0.09167847088802761,0.46095310805934087,0.6443100498353961,0.461-0.644,perception
Al-Anbar,Overall,0.042767188024559935,0.582089552238806,0.08382368852813747,0.4982658637106685,0.6659132407669435,0.498-0.666,percept-message
Al-Basra,Overall,0.034074953225440845,0.649746192893401,0.06678690832186406,0.5829592845715369,0.716533101215265,0.583-0.717,percept-message
Baghdad,Overall,0.03334625674242722,0.5560538116591929,0.06535866321515735,0.4906951484440355,0.6214124748743503,0.491-0.621,percept-message
Erbil,Overall,0.03954388684106444,0.3581081081081081,0.07750601820848631,0.2806020898996218,0.4356141263165944,0.281-0.436,percept-message
Ninawa,Overall,0.032337819067980667,0.5083333333333333,0.0633821253732421,0.4449512079600912,0.5717154587065754,0.445-0.572,percept-message
Al-Anbar,Household,0.09245003270420485,0.6666666666666666,0.1812020641002415,0.4854646025664251,0.8478687307669082,0.485-0.848,percept-message
Al-Basra,Household,0.04453930581352027,0.8243243243243243,0.08729703939449973,0.7370272849298246,0.9116213637188241,0.737-0.912,percept-message
Baghdad,Household,0.054246814530142434,0.6623376623376623,0.10632375647907917,0.5560139058585831,0.7686614188167415,0.556-0.769,percept-message
Erbil,Household,NA,NA,NA,NA,NA,NaN-NA,percept-message
Ninawa,Household,0.029839300500728465,0.9473684210526315,0.05848502898142779,0.8888833920712037,1.0058534500340592,0.889-1.006,percept-message
Al-Anbar,Crowdsource,0.048204529006379115,0.5607476635514018,0.09448087685250306,0.46626678669889876,0.6552285404039049,0.466-0.655,percept-message
Al-Basra,Crowdsource,0.04508648599697628,0.5447154471544715,0.0883695125540735,0.456345934600398,0.6330849597085451,0.456-0.633,percept-message
Baghdad,Crowdsource,0.041522739926869986,0.5,0.08138457025666518,0.4186154297433348,0.5813845702566651,0.419-0.581,percept-message
Erbil,Crowdsource,0.03954388684106444,0.3581081081081081,0.07750601820848631,0.2806020898996218,0.4356141263165944,0.281-0.436,percept-message
Ninawa,Crowdsource,0.03581925863179859,0.37158469945355194,0.07020574691832523,0.30137895253522673,0.44179044637187714,0.301-0.442,percept-message
Al-Anbar,Overall,0.01078113187207316,0.04261363636363636,0.021131018469263393,0.021482617894372967,0.06374465483289976,0.021-0.064,participation
Al-Basra,Overall,0.008133505912442102,0.031982942430703626,0.01594167158838652,0.016041270842317105,0.04792461401909015,0.016-0.048,participation
Baghdad,Overall,0.004330894513217283,0.018537590113285273,0.008488553245905875,0.010049036867379398,0.027026143359191148,0.01-0.027,participation
Erbil,Overall,0.016586519352490576,0.1111111111111111,0.03250957793088153,0.07860153318022958,0.14362068904199263,0.079-0.144,participation
Ninawa,Overall,0.009745551771294375,0.06446540880503145,0.019101281471736977,0.045364127333294466,0.08356669027676843,0.045-0.084,participation
Al-Anbar,Household,0,0,0,0,0,0-0,participation
Al-Basra,Household,0,0,0,0,0,0-0,participation
Baghdad,Household,0,0,0,0,0,0-0,participation
Erbil,Household,0,0,0,0,0,0-0,participation
Ninawa,Household,0,0,0,0,0,0-0,participation
Al-Anbar,Crowdsource,0.018761556669726134,0.07537688442211055,0.036772651072663226,0.03860423334944732,0.11214953549477377,0.039-0.112,participation
Al-Basra,Crowdsource,0.016247876420031802,0.06493506493506493,0.03184583778326233,0.0330892271518026,0.09678090271832726,0.033-0.097,participation
Baghdad,Crowdsource,0.014052175120048069,0.06143344709897611,0.027542263235294216,0.033891183863681895,0.08897571033427032,0.034-0.089,participation
Erbil,Crowdsource,0.027162017117022062,0.19047619047619047,0.05323755354936324,0.13723863692682722,0.2437137440255537,0.137-0.244,participation
Ninawa,Crowdsource,0.01803308703296104,0.12312312312312312,0.03534485058460364,0.08777827253851948,0.15846797370772675,0.088-0.158,participation
Al-Anbar,Overall,0.026686302436398333,0.5056818181818182,0.05230515277534073,0.4533766654064775,0.557986970957159,0.453-0.558,info-treat
Al-Basra,Overall,0.023061964140174186,0.4669509594882729,0.0452014497147414,0.42174950977353154,0.5121524092030143,0.422-0.512,info-treat
Baghdad,Overall,0.016054023963048294,0.49948506694129763,0.03146588696757466,0.468019179973723,0.5309509539088723,0.468-0.531,info-treat
Erbil,Overall,0.026387361698140523,0.5055555555555555,0.051719228928355426,0.4538363266272001,0.557274784483911,0.454-0.557,info-treat
Ninawa,Overall,0.019835614927305706,0.5125786163522013,0.03887780525751918,0.4737008110946821,0.5514564216097204,0.474-0.551,info-treat
Al-Anbar,Household,0.04054755842492702,0.49019607843137253,0.07947321451285697,0.41072286391851553,0.5696692929442295,0.411-0.57,info-treat
Al-Basra,Household,0.032284106267163944,0.44537815126050423,0.06327684828364133,0.3821013029768629,0.5086549995441456,0.382-0.509,info-treat
Baghdad,Household,0.019215808566566645,0.49557522123893805,0.03766298479047062,0.4579122364484674,0.5332382060294086,0.458-0.533,info-treat
Erbil,Household,0.04095795483335619,0.49333333333333335,0.08027759147337812,0.4130557418599552,0.5736109248067115,0.413-0.574,info-treat
Ninawa,Household,0.02877161018838728,0.5016501650165016,0.05639235596923907,0.44525780904726253,0.5580425209857407,0.445-0.558,info-treat
Al-Anbar,Crowdsource,0.03551146239597602,0.5175879396984925,0.06960246629611301,0.4479854734023795,0.5871904059946055,0.448-0.587,info-treat
Al-Basra,Crowdsource,0.032961299656434816,0.48917748917748916,0.06460414732661224,0.4245733418508769,0.5537816365041014,0.425-0.554,info-treat
Baghdad,Crowdsource,0.029256026059635003,0.5085324232081911,0.0573418110768846,0.4511906121313065,0.5658742342850758,0.451-0.566,info-treat
Erbil,Crowdsource,0.034571603689472485,0.5142857142857142,0.06776034323136607,0.4465253710543482,0.5820460575170803,0.447-0.582,info-treat
Ninawa,Crowdsource,0.02741321113105377,0.5225225225225225,0.05372989381686538,0.46879262870565713,0.5762524163393878,0.469-0.576,info-treat
Al-Anbar,Overall,0.023284969782200696,0.2556818181818182,0.04563854077311336,0.21004327740870482,0.30132035895493153,0.21-0.301,aware
Al-Basra,Overall,0.019268573861728443,0.22388059701492538,0.037766404768987745,0.18611419224593764,0.26164700178391315,0.186-0.262,aware
Baghdad,Overall,0.01029621893388144,0.11637487126673532,0.020180589110407623,0.09619428215632769,0.13655546037714295,0.096-0.137,aware
Erbil,Overall,0.02268172408154014,0.24444444444444444,0.044456179199818674,0.19998826524462576,0.2889006236442631,0.2-0.289,aware
Ninawa,Overall,0.01746226918297067,0.26257861635220126,0.03422604759862251,0.22835256875357873,0.2968046639508238,0.228-0.297,aware
Al-Anbar,Household,0.0361970276724367,0.27450980392156865,0.07094617423797593,0.2035636296835927,0.3454559781595446,0.204-0.345,aware
Al-Basra,Household,0.02720537153827948,0.226890756302521,0.05332252821502778,0.17356822808749323,0.2802132845175488,0.174-0.28,aware
Baghdad,Household,0.010405552543132851,0.07964601769911504,0.02039488298454039,0.05925113471457465,0.10004090068365543,0.059-0.1,aware
Erbil,Household,0.009396399265931733,0.013333333333333334,0.018416942561226196,-0.005083609227892862,0.03175027589455953,-0.005-0.032,aware
Ninawa,Household,0.021186967399752617,0.1617161716171617,0.04152645610351513,0.12018971551364657,0.20324262772067683,0.12-0.203,aware
Al-Anbar,Crowdsource,0.030403488732701916,0.24120603015075376,0.059590837916095755,0.181615192234658,0.3007968680668495,0.182-0.301,aware
Al-Basra,Crowdsource,0.027349251357001322,0.22077922077922077,0.05360453265972259,0.16717468811949818,0.2743837534389434,0.167-0.274,aware
Baghdad,Crowdsource,0.0234679356367286,0.20136518771331058,0.045997153847988054,0.15536803386532252,0.24736234156129863,0.155-0.247,aware
Erbil,Crowdsource,0.03401477718256439,0.4095238095238095,0.0666689632778262,0.3428548462459833,0.47619277280163574,0.343-0.476,aware
Ninawa,Crowdsource,0.026251066868994692,0.35435435435435436,0.051452091063229594,0.3029022632911248,0.4058064454175839,0.303-0.406,aware
Al-Anbar,Overall,0.02284382748947434,0.24147727272727273,0.04477390187936971,0.19670337084790301,0.28625117460664246,0.197-0.286,activity
Al-Basra,Overall,0.016074176087986697,0.14072494669509594,0.03150538513245393,0.10921956156264201,0.17223033182754988,0.109-0.172,activity
Baghdad,Overall,0.008571948230302846,0.07723995880535531,0.016801018531393576,0.06043894027396173,0.09404097733674888,0.06-0.094,activity
Erbil,Overall,0.023261355283166196,0.2638888888888889,0.045592256355005745,0.21829663253388315,0.30948114524389464,0.218-0.309,activity
Ninawa,Overall,0.016807907004400106,0.23427672955974843,0.032943497728624205,0.20133323183112423,0.26722022728837264,0.201-0.267,activity
Al-Anbar,Household,0.027911513594011398,0.13725490196078433,0.054706566644262336,0.08254833531652199,0.19196146860504665,0.083-0.192,activity
Al-Basra,Household,0.012390472434097532,0.037815126050420166,0.024285325970831162,0.013529800079589004,0.06210045202125133,0.014-0.062,activity
Baghdad,Household,0.005067616125149316,0.017699115044247787,0.00993252760529266,0.007766587438955128,0.027631642649540447,0.008-0.028,activity
Erbil,Household,0,0,0,0,0,0-0,activity
Ninawa,Household,0.01360230731501221,0.0594059405940594,0.02666052233742393,0.032745418256635475,0.08606646293148333,0.033-0.086,activity
Al-Anbar,Crowdsource,0.03319488739074454,0.32160804020100503,0.0650619792858593,0.25654606091514576,0.3866700194868643,0.257-0.387,activity
Al-Basra,Crowdsource,0.028427335433864883,0.24675324675324675,0.05571757745037517,0.19103566930287158,0.3024708242036219,0.191-0.302,activity
Baghdad,Crowdsource,0.024042252096266682,0.2150170648464164,0.047122814108682694,0.1678942507377337,0.2621398789550991,0.168-0.262,activity
Erbil,Crowdsource,0.03442851454672482,0.4523809523809524,0.06747988851158064,0.38490106386937173,0.519860840892533,0.385-0.52,activity
Ninawa,Crowdsource,0.02681007674632896,0.3933933933933934,0.05254775042280476,0.34084564297058867,0.44594114381619815,0.341-0.446,activity
