Data Source,Percent,Margin of error,Sample
Household survey,0.012483574244415244,0.005364070003375274,1522
Crowdsource survey,0.20342857142857143,0.023101207132842732,1750
Crowdsource complete,0.19984202211690363,0.026983436358154447,1266
Merged survey,0.0975609756097561,0.013489310713052519,2788
