project,heard,prop_se,prop_deff,Sample,Sample_se,ind_type,disag,margin,lower,upper,ci
Construction or repair of schools,0.2352168199737188,0.021805745374992996,4.020354831240689,358,38.13202836594963,Overall,disag,0.04273926093498627,0.19247755903873254,0.27795608090870505,0.192-0.278
"Construction or repair of roads, bridges, retaining/flood walls",0.17082785808147175,0.014598188598816996,2.288356883506832,260,25.355488432503005,Overall,disag,0.028612449653681312,0.14221540842779043,0.19944030773515306,0.142-0.199
Construction or repair of mosques,0.1287779237844941,0.015511492789052967,3.261865986190279,196,26.051612386501297,Overall,disag,0.030402525866543816,0.09837539791795027,0.15918044965103792,0.098-0.159
Electricity,0.09592641261498029,0.010727834285308826,2.0184190748727957,146,18.13332457982982,Overall,disag,0.021026555199205297,0.074899857415775,0.11695296781418558,0.075-0.117
Health project,0.09395532194480946,0.012853053007534542,2.9516904661443015,143,20.482377249181255,Overall,disag,0.025191983894767702,0.06876333805004176,0.11914730583957717,0.069-0.119
Drinking water project,0.06044678055190539,0.007054795221779626,1.3329181396047296,92,12.168786508085558,Overall,disag,0.013827398634688067,0.04661938191721732,0.07427417918659346,0.047-0.074
Reconciliation with Anti-Government Elements,0.02628120893561104,0.005142255046598825,1.5716561998733942,40,7.745198205216909,Overall,disag,0.010078819891333697,0.016202389044277343,0.03636002882694474,0.016-0.036
Agriculture projects,0.02431011826544021,0.004763235472520977,1.454904356601088,37,7.286647932708022,Overall,disag,0.009335941526141115,0.014974176739299095,0.03364605979158133,0.015-0.034
Irrigation project,0.022339027595269383,0.0036890643931135527,0.9477834974098748,34,5.927806414592913,Overall,disag,0.007230566210502563,0.01510846138476682,0.029569593805771947,0.015-0.03
Construction or repair of factories,0.0164257555847569,0.0036656652742570635,1.2650343569669618,25,5.881771679964982,Overall,disag,0.007184703937543844,0.009241051647213054,0.023610459522300745,0.009-0.024
"Farm produce, processing, or storage facilities",0.013797634691195795,0.0033219404999670914,1.2335087394297866,21,5.048573584498422,Overall,disag,0.006511003379935499,0.007286631311260295,0.020308638071131292,0.007-0.02
