Data Source,Percent,Margin of error,Sample
Household survey,0.6358974358974359,0.10160811601944224,1522
Crowdsource survey,0.346723044397463,0.0525751191258073,2464
Crowdsource complete,0.31223628691983124,0.07239633088283293,1266
Merged survey,0.4583333333333333,0.05760091517705546,2788
