Data Source,Percent,Margin of error,Sample
Household survey,0,0,1522
Crowdsource survey,0.10529986052998605,0.019459908639791898,1434
Crowdsource complete,0.1018957345971564,0.02041302468577758,1266
Merged survey,0.04626972740315639,0.009550014076942968,2788
