Disaggregate.x,Disaggregate type,Percent.x,Margin of error.x,Sample.x,Percent.y,Margin of error.y,Sample.y
Overall,Overall,0,0,1522,0.10529986052998605,0.019459908639791898,1434
Locality,Urban,0,0,1522,0.08959044368600683,0.02003005038456957,1434
Locality,Rural,0,0,1522,0.17557251908396945,0.05651913260460973,1434
Sex,Male,0,0,1522,0.1141804788213628,0.02317207502540048,1431
Sex,Female,0,0,1522,0.0782608695652174,0.034754285738489814,1431
Age group,16-25,0,0,1517,0.10092687950566426,0.023212734514106978,1434
Age group,26-35,0,0,1517,0.12460063897763578,0.04487424885898899,1434
Age group,36-45,0,0,1517,0.07368421052631578,0.06467166850162254,1434
Age group,46+,0,0,1517,0.12727272727272726,0.10884821488796921,1434
Education level,Elementary education or less,0,0,1522,0.1680327868852459,0.05756496247453892,1379
Education level,Complementary to secondary education,0,0,1522,0.09546925566343042,0.02839305308198545,1379
Education level,Post-secondary education,0,0,1522,0.08704061895551257,0.029783319746996918,1379
Religious group,Sunni,0,0,1517,0.09866666666666667,0.03700866208766154,1326
Religious group,Shiite,0,0,1517,0.07420494699646643,0.03745937655653726,1326
Religious group,Muslim (other),0,0,1517,0.12612612612612611,0.03385191685625643,1326
Religious group,Christian,0,0,1517,0.17307692307692307,0.1271388540159431,1326
Religious group,Other,0,0,1517,0.14754098360655737,0.10988254460670642,1326
Governorate,Erbil,0,0,1522,0.18846153846153846,0.058321311197853554,1434
Governorate,Ninawa,0,0,1522,0.13043478260869565,0.04219160035419396,1434
Governorate,Al-Anbar,0,0,1522,0.08695652173913043,0.04468793737287884,1434
Governorate,Baghdad,0,0,1522,0.06031746031746032,0.03224471330579411,1434
Governorate,Al-Basra,0,0,1522,0.05747126436781609,0.034641544227723094,1434
