Gov,station,prop,prop_se,prop_deff,Sample,Sample_se,ind_type,disag,margin,lower,upper,ci
1,Al Sharqia,0,0,NA,0,0,Governorate,Erbil,0,0,0,0-0
2,Al Sharqia,0.55,0.05546702084829971,1.976476258116883,88,16.22608129788934,Governorate,Ninawa,0.10871536086266742,0.4412846391373326,0.6587153608626675,0.441-0.659
3,Al Sharqia,0.6486486486486487,0.06044898281384426,1.1704414913874377,48,11.372481406154655,Governorate,Al-Anbar,0.11848000631513475,0.5301686423335139,0.7671286549637835,0.53-0.767
4,Al Sharqia,0.43333333333333335,0.03246038347887603,1.411735793420286,143,17.825543469975887,Governorate,Baghdad,0.06362235161859701,0.3697109817147363,0.4969556849519304,0.37-0.497
5,Al Sharqia,0.37974683544303794,0.060113698330613564,2.4087037866651935,60,8.692269873603532,Governorate,Al-Basra,0.11782284872800258,0.26192398671503536,0.4975696841710405,0.262-0.498
1,Al Iraqiya,0,0,NA,0,0,Governorate,Erbil,0,0,0,0-0
2,Al Iraqiya,0.13103448275862067,0.025497313547262902,0.8221729795867277,19,4.735881272643079,Governorate,Ninawa,0.049974734552635285,0.08105974820598538,0.18100921731125597,0.081-0.181
3,Al Iraqiya,0.15625,0.041881326226018624,0.8381998697916668,10,3.366501646120693,Governorate,Al-Anbar,0.0820873994029965,0.0741626005970035,0.2383373994029965,0.074-0.238
4,Al Iraqiya,0.344311377245509,0.042438490505855755,2.6565321004430236,115,18.257418583505537,Governorate,Baghdad,0.08317944139147727,0.2611319358540317,0.42749081863698624,0.261-0.427
5,Al Iraqiya,0.2709677419354839,0.058338433027963606,2.653175039247808,42,11.234866364235145,Governorate,Al-Basra,0.11434332873480867,0.15662441320067522,0.3853110706702926,0.157-0.385
1,MBC Iraq,0,0,NA,0,0,Governorate,Erbil,0,0,0,0-0
2,MBC Iraq,0.22818791946308725,0.02577718469781108,0.5583782091729534,34,7.240757655699536,Governorate,Ninawa,0.05052328200770972,0.17766463745537753,0.278711201470797,0.178-0.279
3,MBC Iraq,0.29411764705882354,0.055435362586841605,0.9917339484813539,20,7.0710678118654755,Governorate,Al-Anbar,0.10865331067020954,0.18546433638861398,0.4027709577290331,0.185-0.403
4,MBC Iraq,0.21296296296296297,0.030826301853164175,1.8312436217305164,69,11.018923117377064,Governorate,Baghdad,0.06041955163220178,0.15254341133076119,0.2733825145951647,0.153-0.273
5,MBC Iraq,0.10256410256410256,0.03325261254684076,1.8620203395844426,16,5.41602560309064,Governorate,Al-Basra,0.06517512059180788,0.03738898197229468,0.16773922315591044,0.037-0.168
1,MBC Group,0,0,NA,0,0,Governorate,Erbil,0,0,0,0-0
2,MBC Group,0.1644736842105263,0.04287613407015601,2.020001230801828,25,7.699721701835352,Governorate,Ninawa,0.08403722277750578,0.08043646143302052,0.24851090698803208,0.08-0.249
3,MBC Group,0.14705882352941177,0.050954910466683156,1.3868730859483758,10,3.6968455021364726,Governorate,Al-Anbar,0.09987162451469898,0.047187199014712786,0.24693044804411074,0.047-0.247
4,MBC Group,0.19701492537313434,0.02570056262716359,1.3945212195526264,66,10.19395245558202,Governorate,Baghdad,0.05037310274924064,0.1466418226238937,0.24738802812237498,0.147-0.247
5,MBC Group,0.14743589743589744,0.05174618743226221,3.3018560262150025,23,8.306623862918075,Governorate,Al-Basra,0.10142252736723394,0.0460133700686635,0.24885842480313136,0.046-0.249
1,MBC 2,0,0,NA,0,0,Governorate,Erbil,0,0,0,0-0
2,MBC 2,0.0547945205479452,0.023281117487375446,1.517442646529187,8,3.545621041711674,Governorate,Ninawa,0.04563099027525588,0.009163530272689326,0.10042551082320109,0.009-0.1
3,MBC 2,0.04838709677419355,0.02014911854394513,0.5378387037984209,3,1.4142135623730951,Governorate,Al-Anbar,0.03949227234613245,0.008894824428061096,0.087879369120326,0.009-0.088
4,MBC 2,0.12111801242236024,0.02550792119023292,1.9620761840072487,39,8.669871202426634,Governorate,Baghdad,0.04999552553285652,0.07112248688950372,0.17111353795521678,0.071-0.171
5,MBC 2,0.14102564102564102,0.03512815618116537,1.5789345415254339,22,5.120763831912406,Governorate,Al-Basra,0.06885118611508412,0.0721744549105569,0.20987682714072514,0.072-0.21
1,Zee Alwan,0,0,NA,0,0,Governorate,Erbil,0,0,0,0-0
2,Zee Alwan,0.09523809523809523,0.027767943858031295,1.3064575223982486,14,4.2594432902501635,Governorate,Ninawa,0.054425169961741335,0.0408129252763539,0.14966326519983658,0.041-0.15
3,Zee Alwan,0.13846153846153847,0.05669334904769029,1.724409379793995,9,3.6514837167011076,Governorate,Al-Anbar,0.11111896413347297,0.0273425743280655,0.24958050259501144,0.027-0.25
4,Zee Alwan,0.09119496855345913,0.01837934276276021,1.2920449288209963,29,6.238322424070968,Governorate,Baghdad,0.03602351181501001,0.055171456738449115,0.12721848036846914,0.055-0.127
5,Zee Alwan,0.06535947712418301,0.02626235543757429,1.7161599465841424,10,4.216370213557839,Governorate,Al-Basra,0.05147421665764561,0.013885260466537402,0.11683369378182862,0.014-0.117
1,Al Hadath,0,0,NA,0,0,Governorate,Erbil,0,0,0,0-0
2,Al Hadath,0.19205298013245034,0.04882790822390319,2.304748623600387,29,8.211490207542807,Governorate,Ninawa,0.09570270011885025,0.09635028001360009,0.2877556802513006,0.096-0.288
3,Al Hadath,0.2463768115942029,0.08587764448502337,2.700940871073197,17,5.033222956847167,Governorate,Al-Anbar,0.16832018319064582,0.0780566284035571,0.4146969947848487,0.078-0.415
4,Al Hadath,0.03225806451612903,0.01563401237814608,2.4193656781130777,10,5.204164998665331,Governorate,Baghdad,0.030642664261166314,0.001615400254962717,0.06290072877729534,0.002-0.063
5,Al Hadath,0.032679738562091505,0.01266822756500413,0.7716608060065706,5,2.23606797749979,Governorate,Al-Basra,0.024829726027408093,0.007850012534683412,0.0575094645894996,0.008-0.058
1,Al Mouseliah,0,0,NA,0,0,Governorate,Erbil,0,0,0,0-0
2,Al Mouseliah,0.3464052287581699,0.05192492096091948,1.8100987490815785,53,12.750350135248388,Governorate,Ninawa,0.10177284508340219,0.24463238367476775,0.4481780738415721,0.245-0.448
3,Al Mouseliah,0,0,NA,0,0,Governorate,Al-Anbar,0,0,0,0-0
4,Al Mouseliah,0,0,NA,0,0,Governorate,Baghdad,0,0,0,0-0
5,Al Mouseliah,0,0,NA,0,0,Governorate,Al-Basra,0,0,0,0-0
1,Dijla,0,0,NA,0,0,Governorate,Erbil,0,0,0,0-0
2,Dijla,0.048611111111111105,0.027190479376573182,2.285999564312747,7,4.358898943540674,Governorate,Ninawa,0.05329333957808344,-0.004682228466972332,0.10190445068919454,-0.005-0.102
3,Dijla,0.09836065573770492,0.04738022696373561,1.5187673564454003,6,3.214550253664319,Governorate,Al-Anbar,0.0928652448489218,0.005495410888783123,0.1912259005866267,0.005-0.191
4,Dijla,0.06129032258064516,0.013304631146727391,0.9506944416997956,19,4.8476798574163285,Governorate,Baghdad,0.026077077047585686,0.035213245533059476,0.08736739962823084,0.035-0.087
5,Dijla,0.08496732026143791,0.022671561810609208,1.0048886470775493,13,3.34995854037363,Governorate,Al-Basra,0.044436261148794044,0.04053105911264387,0.12940358141023195,0.041-0.129
1,Beinsport,0.10101010101010102,0.02307218582795387,0.5744919401712048,10,3.1622776601683795,Governorate,Erbil,0.045221484222789585,0.05578861678731144,0.1462315852328906,0.056-0.146
2,Beinsport,0.02040816326530612,0.015336634192192718,1.7177655804790335,3,2.1712405933672376,Governorate,Ninawa,0.030059803016697726,-0.009651639751391605,0.05046796628200385,-0.01-0.05
3,Beinsport,0.01639344262295082,0.0165687316762143,1.0214995968825584,1,1.0000000000000002,Governorate,Al-Anbar,0.032474714085380024,-0.016081271462429204,0.04886815670833085,-0.016-0.049
4,Beinsport,0.056782334384858045,0.015523196777140648,1.4217532811066949,18,4.453463071962462,Governorate,Baghdad,0.03042546568319567,0.026356868701662376,0.08720780006805372,0.026-0.087
5,Beinsport,0.07547169811320756,0.03401258191962739,2.6195817514537967,12,4.666666666666667,Governorate,Al-Basra,0.06666466056246968,0.008807037550737876,0.14213635867567725,0.009-0.142
1,Al Arabiah,0,0,NA,0,0,Governorate,Erbil,0,0,0,0-0
2,Al Arabiah,0.10204081632653061,0.027537184424123604,1.208262790936677,15,5.669467095138408,Governorate,Ninawa,0.053972881471282264,0.04806793485524835,0.15601369779781288,0.048-0.156
3,Al Arabiah,0.11290322580645161,0.03773427832874956,0.8672106076372467,7,1.5275252316519468,Governorate,Al-Anbar,0.07395918552434913,0.03894404028210248,0.18686241133080073,0.039-0.187
4,Al Arabiah,0.035256410256410256,0.012488350280927683,1.426003329339365,11,4.349329450233297,Governorate,Baghdad,0.024477166550618257,0.010779243705791999,0.05973357680702851,0.011-0.06
5,Al Arabiah,0.05194805194805195,0.016760033602475844,0.8726494107209283,8,2.4944382578492945,Governorate,Al-Basra,0.03284966586085265,0.0190983860871993,0.0847977178089046,0.019-0.085
1,Kurdmax,0.33962264150943394,0.05028125450228062,1.183621098848938,36,6.782329983125268,Governorate,Erbil,0.09855125882447001,0.24107138268496392,0.43817390033390397,0.241-0.438
2,Kurdmax,0,0,NA,0,0,Governorate,Ninawa,0,0,0,0-0
3,Kurdmax,0,0,NA,0,0,Governorate,Al-Anbar,0,0,0,0-0
4,Kurdmax,0,0,NA,0,0,Governorate,Baghdad,0,0,0,0-0
5,Kurdmax,0,0,NA,0,0,Governorate,Al-Basra,0,0,0,0-0
1,MBC 1,0,0,NA,0,0,Governorate,Erbil,0,0,0,0-0
2,MBC 1,0.034482758620689655,0.01919724110838158,1.593962483923415,5,2.8030595529069404,Governorate,Ninawa,0.03762659257242789,-0.0031438339517382355,0.07210935119311754,-0.003-0.072
3,MBC 1,0.06451612903225806,0.028622330841178326,0.8280093174016533,4,2.081665999466133,Governorate,Al-Anbar,0.056099768448709515,0.008416360583548547,0.12061589748096757,0.008-0.121
4,MBC 1,0.05448717948717949,0.013179764532308008,1.0486098726680468,17,4.262237284181475,Governorate,Baghdad,0.025832338483323697,0.02865484100385579,0.08031951797050318,0.029-0.08
5,MBC 1,0.07142857142857144,0.029277576968615243,1.9773084058798354,11,5.044248650140519,Governorate,Al-Basra,0.05738405085848588,0.01404452057008556,0.1288126222870573,0.014-0.129
1,Karbalaa,0,0,NA,0,0,Governorate,Erbil,0,0,0,0-0
2,Karbalaa,0,0,NA,0,0,Governorate,Ninawa,0,0,0,0-0
3,Karbalaa,0,0,NA,0,0,Governorate,Al-Anbar,0,0,0,0-0
4,Karbalaa,0.06369426751592357,0.014857287959637687,1.1585249447595718,20,4.7871355387816905,Governorate,Baghdad,0.029120284400889866,0.0345739831150337,0.09281455191681343,0.035-0.093
5,Karbalaa,0.08387096774193549,0.02454465828057944,1.2074423398542935,13,4.229525846816507,Governorate,Al-Basra,0.0481075302299357,0.03576343751199979,0.1319784979718712,0.036-0.132
1,Al Anwar,0,0,NA,0,0,Governorate,Erbil,0,0,0,0-0
2,Al Anwar,0,0,NA,0,0,Governorate,Ninawa,0,0,0,0-0
3,Al Anwar,0,0,NA,0,0,Governorate,Al-Anbar,0,0,0,0-0
4,Al Anwar,0.05769230769230769,0.010389551177907776,0.6175090331168629,18,3.3911649915626345,Governorate,Baghdad,0.02036352030869924,0.03732878738360845,0.07805582800100692,0.037-0.078
5,Al Anwar,0.07792207792207792,0.02181158301377757,1.0130658013409064,12,3.5901098714230026,Governorate,Al-Basra,0.04275070270700403,0.03517137521507389,0.12067278062908196,0.035-0.121
1,Al Sumaria,0,0,NA,0,0,Governorate,Erbil,0,0,0,0-0
2,Al Sumaria,0.013888888888888888,0.01266539158294086,1.6748654542998729,2,2,Governorate,Ninawa,0.024824167502564085,-0.010935278613675197,0.03871305639145298,-0.011-0.039
3,Al Sumaria,0,0,NA,0,0,Governorate,Al-Anbar,0,0,0,0-0
4,Al Sumaria,0.0641025641025641,0.015239979736106772,1.2039972890004174,20,5.000000000000001,Governorate,Baghdad,0.029870360282769272,0.034232203819794825,0.09397292438533336,0.034-0.094
5,Al Sumaria,0.04575163398692811,0.022213495940799095,1.717945489062675,7,3.34995854037363,Governorate,Al-Basra,0.043538452043966225,0.0022131819429618838,0.08929008603089433,0.002-0.089
1,Rudaw,0.2571428571428572,0.0775211781703984,3.271856890904511,27,6.041522986797286,Governorate,Erbil,0.15194150921398086,0.10520134792887631,0.40908436635683804,0.105-0.409
2,Rudaw,0,0,NA,0,0,Governorate,Ninawa,0,0,0,0-0
3,Rudaw,0,0,NA,0,0,Governorate,Al-Anbar,0,0,0,0-0
4,Rudaw,0,0,NA,0,0,Governorate,Baghdad,0,0,0,0-0
5,Rudaw,0,0,NA,0,0,Governorate,Al-Basra,0,0,0,0-0
1,MBC Drama,0,0,NA,0,0,Governorate,Erbil,0,0,0,0-0
2,MBC Drama,0.041666666666666664,0.012500631505946892,0.5596217578214859,6,1.963961012123931,Governorate,Ninawa,0.024501237751655906,0.017165428915010758,0.06616790441832257,0.017-0.066
3,MBC Drama,0.01639344262295082,0.017474623173350023,1.1362536952432143,1,1,Governorate,Al-Anbar,0.034250261419766045,-0.017856818796815225,0.05064370404271687,-0.018-0.051
4,MBC Drama,0.025559105431309903,0.008606647890284648,0.9279434578586163,8,2.7838821814150103,Governorate,Baghdad,0.01686902986495791,0.008690075566351992,0.042428135296267815,0.009-0.042
5,MBC Drama,0.06451612903225806,0.017351368103629257,0.7682163774165642,10,3.3333333333333335,Governorate,Al-Basra,0.03400868148311334,0.030507447549144723,0.0985248105153714,0.031-0.099
1,Al Furat,0,0,NA,0,0,Governorate,Erbil,0,0,0,0-0
2,Al Furat,0,0,NA,0,0,Governorate,Ninawa,0,0,0,0-0
3,Al Furat,0.01639344262295082,0.01747462317335002,1.1362536952432138,1,1,Governorate,Al-Anbar,0.03425026141976604,-0.017856818796815218,0.050643704042716856,-0.018-0.051
4,Al Furat,0.03870967741935484,0.014926166892831706,1.8500392546447946,12,4.813176359397883,Governorate,Baghdad,0.02925528710995014,0.0094543903094047,0.06796496452930498,0.009-0.068
5,Al Furat,0.05228758169934641,0.027339541175854368,2.2927193899454794,8,4.163331998932266,Governorate,Al-Basra,0.05358550070467456,-0.0012979190053281561,0.10587308240402096,-0.001-0.106
1,Sport Channels,0.0297029702970297,0.031244774082260243,3.387272956432844,3,3,Governorate,Erbil,0.06123975720123007,-0.03153678690420037,0.09094272749825977,-0.032-0.091
2,Sport Channels,0.04054054054054054,0.017881061357915274,1.208336119713166,6,2.853569193634026,Governorate,Ninawa,0.03504688026151394,0.005493660279026605,0.07558742080205448,0.005-0.076
3,Sport Channels,0.047619047619047616,0.021662066273826833,0.6415049970605525,3,1.4142135623730951,Governorate,Al-Anbar,0.042457649896700596,0.005161397722347021,0.0900766975157482,0.005-0.09
4,Sport Channels,0.015873015873015872,0.008421903845953928,1.4257376387432716,5,2.500000000000001,Governorate,Baghdad,0.0165069315380697,-6.339156650538268e-4,0.032379947411085575,-0.001-0.032
5,Sport Channels,0.012903225806451613,0.009371768388440605,1.0619541947121474,2,1.3333333333333337,Governorate,Al-Basra,0.018368666041343587,-0.005465440234891974,0.0312718918477952,-0.005-0.031
1,Ava TV,0.1764705882352941,0.01720465269916528,0.20571300415591068,18,2.5495097567963927,Governorate,Erbil,0.03372111929036394,0.14274946894493015,0.21019170752565805,0.143-0.21
2,Ava TV,0,0,NA,0,0,Governorate,Ninawa,0,0,0,0-0
3,Ava TV,0,0,NA,0,0,Governorate,Al-Anbar,0,0,0,0-0
4,Ava TV,0,0,NA,0,0,Governorate,Baghdad,0,0,0,0-0
5,Ava TV,0,0,NA,0,0,Governorate,Al-Basra,0,0,0,0-0
1,National Geographic,0,0,NA,0,0,Governorate,Erbil,0,0,0,0-0
2,National Geographic,0.013888888888888888,0.009491236423477637,0.9405638111073847,2,1.3627702877384937,Governorate,Ninawa,0.018602823390016166,-0.004713934501127278,0.03249171227890506,-0.005-0.032
3,National Geographic,0.031746031746031744,0.020786219463078646,0.871493142895693,2,1.2909944487358058,Governorate,Al-Anbar,0.040740990147634146,-0.008994958401602401,0.07248702189366589,-0.009-0.072
4,National Geographic,0.03164556962025317,0.010457480265981079,1.124132230804516,10,3.227486121839514,Governorate,Baghdad,0.020496661321322916,0.011148908298930251,0.05214223094157608,0.011-0.052
5,National Geographic,0.026143790849673203,0.020073303839307707,2.405569487684697,4,3.055050463303893,Governorate,Al-Basra,0.03934367552504311,-0.013199884675369904,0.06548746637471631,-0.013-0.065
1,Net TV,0.18,0.018409236811991966,0.22731097560975613,18,3.7416573867739413,Governorate,Erbil,0.03608210415150425,0.14391789584849574,0.21608210415150425,0.144-0.216
2,Net TV,0,0,NA,0,0,Governorate,Ninawa,0,0,0,0-0
3,Net TV,0,0,NA,0,0,Governorate,Al-Anbar,0,0,0,0-0
4,Net TV,0,0,NA,0,0,Governorate,Baghdad,0,0,0,0-0
5,Net TV,0,0,NA,0,0,Governorate,Al-Basra,0,0,0,0-0
1,K 24,0.17171717171717174,0.049164735221237564,1.6654864369094193,17,4.636809247747852,Governorate,Erbil,0.09636288103362563,0.07535429068354611,0.2680800527507974,0.075-0.268
2,K 24,0,0,NA,0,0,Governorate,Ninawa,0,0,0,0-0
3,K 24,0,0,NA,0,0,Governorate,Al-Anbar,0,0,0,0-0
4,K 24,0,0,NA,0,0,Governorate,Baghdad,0,0,0,0-0
5,K 24,0,0,NA,0,0,Governorate,Al-Basra,0,0,0,0-0
