Data Source,Percent,Margin of error,Sample
Household survey,0.19776609724047306,0.030733187632792685,1522
Crowdsource survey,0.40137987012987014,0.02370459219374843,2464
Crowdsource complete,0.39652448657187994,0.033008881693458704,1266
Merged survey,0.2880200860832138,0.020586760690310808,2788
