activity,aware,prop_se,prop_deff,Sample,Sample_se,ind_type,disag,margin,lower,upper,ci
Supporting displaced populations in Ninewa,0.34625492772667543,0.0195691812603441,2.573179808218925,527,37.39482605753122,Overall,disag,0.038355595270274434,0.307899332456401,0.38461052299694987,0.308-0.385
Iraq Provincial Elections Activity,0.2720105124835743,0.019380806026400077,2.885108081337622,414,35.54440549375896,Overall,disag,0.03798637981174415,0.23402413267183012,0.3099968922953184,0.234-0.31
Safe Return,0.15243101182654403,0.012539987903805002,1.851292573143904,232,21.10254629937962,Overall,disag,0.024578376291457805,0.12785263553508622,0.17700938811800185,0.128-0.177
Camp Coordination and Camp Management,0.13534822601839686,0.012812550541234095,2.1335685077050575,206,22.120072763162856,Overall,disag,0.025112599060818825,0.11023562695757803,0.1604608250792157,0.11-0.16
"Water, Sanitation, and Hygiene",0.12417871222076216,0.011149311794778852,1.7384519321024365,189,18.724506478333225,Overall,disag,0.02185265111776655,0.10232606110299561,0.1460313633385287,0.102-0.146
Building Community Resilience in Ninawa Post,0.11103810775295664,0.009864489736974121,1.4994198927651277,169,16.929358363599448,Overall,disag,0.019334399884469278,0.09170370786848736,0.13037250763742592,0.092-0.13
Business Competitiveness Initiative,0.09724047306176084,0.009623341782856398,1.604581910349072,148,16.189600816671625,Overall,disag,0.018861749894398542,0.0783787231673623,0.11610222295615938,0.078-0.116
Funding Facility for Stabilization,0.07030223390275953,0.00712855516166575,1.1825549505770194,107,12.497618820818476,Overall,disag,0.01397196811686487,0.05633026578589466,0.08427420201962439,0.056-0.084
Iraq Community Resilience Initiative (Taafi),0.042706964520367936,0.008139097651385697,2.4645528107278967,65,12.432037465981013,Overall,disag,0.015952631396715964,0.026754333123651972,0.058659595917083904,0.027-0.059
Shared Future - Ninewa Plain,0.03613666228646518,0.005016011059146808,1.0987090107422794,55,8.38058034888557,Overall,disag,0.009831381675927743,0.026305280610537433,0.04596804396239292,0.026-0.046
Iraq Governance and Performance Accountability (Takamol),0.03416557161629435,0.005500596383868704,1.3946248471966696,52,8.797321020791337,Overall,disag,0.01078116891238266,0.023384402703911688,0.044946740528677004,0.023-0.045
