variable,val,label,frq,raw.prc,cum.prc
"(Radio) You mentioned reading, seeing, or hearing a message about USAID in {0} in the past year. Can you describe in a few words the content of that message? (x)",100,Providing aids,4,0.26,99.21
"(Radio) You mentioned reading, seeing, or hearing a message about USAID in {0} in the past year. Can you describe in a few words the content of that message? (x)",101,Help the displaced people and solve disputes,1,0.06999999999999999,99.28
"(Radio) You mentioned reading, seeing, or hearing a message about USAID in {0} in the past year. Can you describe in a few words the content of that message? (x)",102,Reconstruction of cities,1,0.06999999999999999,99.33999999999999
"(Radio) You mentioned reading, seeing, or hearing a message about USAID in {0} in the past year. Can you describe in a few words the content of that message? (x)",103,Investments projects,1,0.06999999999999999,99.41
"(Radio) You mentioned reading, seeing, or hearing a message about USAID in {0} in the past year. Can you describe in a few words the content of that message? (x)",104,Reconstruction in Mosul city,1,0.06999999999999999,99.47
"(Radio) You mentioned reading, seeing, or hearing a message about USAID in {0} in the past year. Can you describe in a few words the content of that message? (x)",106,their work in the agriculture sector,1,0.06999999999999999,99.53999999999999
"(Radio) You mentioned reading, seeing, or hearing a message about USAID in {0} in the past year. Can you describe in a few words the content of that message? (x)",107,their work on Safety and security,1,0.06999999999999999,99.61
"(Radio) You mentioned reading, seeing, or hearing a message about USAID in {0} in the past year. Can you describe in a few words the content of that message? (x)",108,Developing the country,1,0.06999999999999999,99.67
"(Radio) You mentioned reading, seeing, or hearing a message about USAID in {0} in the past year. Can you describe in a few words the content of that message? (x)",109,News about Iraq,1,0.06999999999999999,99.74
"(Radio) You mentioned reading, seeing, or hearing a message about USAID in {0} in the past year. Can you describe in a few words the content of that message? (x)",110,About immagrants and immigration,1,0.06999999999999999,99.8
"(Radio) You mentioned reading, seeing, or hearing a message about USAID in {0} in the past year. Can you describe in a few words the content of that message? (x)",111,Working on the infrastructre and schools,1,0.06999999999999999,99.87
"(Radio) You mentioned reading, seeing, or hearing a message about USAID in {0} in the past year. Can you describe in a few words the content of that message? (x)",112,Developing the country and the removal of the armed militias,1,0.06999999999999999,99.92999999999999
"(Radio) You mentioned reading, seeing, or hearing a message about USAID in {0} in the past year. Can you describe in a few words the content of that message? (x)",113,Aids from International Monetary Fund,1,0.06999999999999999,100
