Gov,media,use,prop_se,prop_deff,Sample,Sample_se,ind_type,disag,margin,lower,upper,ci,gov_rank
3,Facebook,0.6416666666666666,0.048480495818362244,1.2164223142275468,77,10.692676621563628,Governorate,Al-Anbar,0.09502177180398999,0.5466448948626766,0.7366884384706566,0.547-0.737,1
3,WhatsApp,0.5833333333333334,0.039761619286854476,0.7740509259259262,70,13.662601021279466,Governorate,Al-Anbar,0.07793277380223478,0.5054005595310986,0.6612661071355681,0.505-0.661,2.5
3,Reddit,0.5833333333333334,0.039761619286854476,0.7740509259259262,70,13.662601021279466,Governorate,Al-Anbar,0.07793277380223478,0.5054005595310986,0.6612661071355681,0.505-0.661,2.5
3,Instagram,0.2583333333333333,0.032739673983899355,0.6657427627428081,31,8.062257748298551,Governorate,Al-Anbar,0.06416976100844274,0.19416357232489057,0.32250309434177604,0.194-0.323,4
3,TikTok,0.15,0.05144385198842916,2.470038580246913,18,7.916228058025278,Governorate,Al-Anbar,0.10082994989732115,0.049170050102678844,0.25082994989732116,0.049-0.251,5
3,Telegram,0.05,0.012681551926292747,0.40290082846003894,6,1.8257418583505538,Governorate,Al-Anbar,0.024855841775533783,0.02514415822446622,0.07485584177553378,0.025-0.075,6
3,SnapChat,0.025,0.01110177559205267,0.6017099952516625,3,1.4142135623730951,Governorate,Al-Anbar,0.021759480160423235,0.0032405198395767665,0.046759480160423236,0.003-0.047,7
3,Twitter,0.016666666666666666,0.009385368066562757,0.6395876490897675,2,1.2909944487358058,Governorate,Al-Anbar,0.018395321410463003,-0.0017286547437963366,0.035061988077129666,-0.002-0.035,8
3,Viber,0.008333333333333333,0.00733168033418219,0.7740509259259276,1,1.0000000000000002,Governorate,Al-Anbar,0.014370093454997093,-0.006036760121663759,0.022703426788330427,-0.006-0.023,9
3,BOTIM,0,0,NA,0,0,Governorate,Al-Anbar,0,0,0,0-0,12
3,LinkedIn,0,0,NA,0,0,Governorate,Al-Anbar,0,0,0,0-0,12
3,Pinterest,0,0,NA,0,0,Governorate,Al-Anbar,0,0,0,0-0,12
3,V Chat,0,0,NA,0,0,Governorate,Al-Anbar,0,0,0,0-0,12
3,VKontakte,0,0,NA,0,0,Governorate,Al-Anbar,0,0,0,0-0,12
5,WhatsApp,0.8863636363636364,0.026744030227138726,1.5551366815003176,195,21.717888172349234,Governorate,Al-Basra,0.0524182992451919,0.8339453371184444,0.9387819356088283,0.834-0.939,1.5
5,Reddit,0.8863636363636364,0.026744030227138726,1.5551366815003176,195,21.717888172349234,Governorate,Al-Basra,0.0524182992451919,0.8339453371184444,0.9387819356088283,0.834-0.939,1.5
5,Instagram,0.5272727272727272,0.0682623282905901,4.094117872722887,116,17.46106780494506,Governorate,Al-Basra,0.1337941634495566,0.3934785638231706,0.6610668907222839,0.393-0.661,3
5,Facebook,0.4909090909090909,0.07312531943214427,4.68579463465827,108,16.852299546352718,Governorate,Al-Basra,0.14332562608700278,0.34758346482208813,0.6342347169960937,0.348-0.634,4
5,Telegram,0.2727272727272727,0.03706744395076,1.5170626721763087,60,10,Governorate,Al-Basra,0.07265219014348959,0.20007508258378312,0.34537946287076227,0.2-0.345,5
5,TikTok,0.13636363636363635,0.027049550163724206,1.3606133101348417,30,7.302967433402215,Governorate,Al-Basra,0.05301711832089944,0.0833465180427369,0.1893807546845358,0.083-0.189,6
5,Twitter,0.06818181818181818,0.023199759315015812,1.8552879123832575,15,5.000000000000001,Governorate,Al-Basra,0.04547152825743099,0.022710289924387186,0.11365334643924917,0.023-0.114,7
5,SnapChat,0.05454545454545454,0.020217457996593708,1.735793247156887,12,4.666666666666666,Governorate,Al-Basra,0.039626217673323666,0.014919236872130877,0.0941716722187782,0.015-0.094,8
5,Viber,0.02727272727272727,0.01696229400973041,2.375164130686647,6,4,Governorate,Al-Basra,0.0332460962590716,-0.005973368986344329,0.06051882353179887,-0.006-0.061,9
5,Pinterest,0.004545454545454545,0.004563679134167856,1.008034894398531,1,1,Governorate,Al-Basra,0.008944811102968997,-0.004399356557514451,0.013490265648423542,-0.004-0.013,10
5,BOTIM,0,0,NA,0,0,Governorate,Al-Basra,0,0,0,0-0,12.5
5,LinkedIn,0,0,NA,0,0,Governorate,Al-Basra,0,0,0,0-0,12.5
5,V Chat,0,0,NA,0,0,Governorate,Al-Basra,0,0,0,0-0,12.5
5,VKontakte,0,0,NA,0,0,Governorate,Al-Basra,0,0,0,0-0,12.5
4,Facebook,0.6161449752883031,0.03308034782644467,2.80390062710947,374,31.44041984452498,Governorate,Baghdad,0.06483748173983156,0.5513074935484716,0.6809824570281346,0.551-0.681,1
4,WhatsApp,0.5601317957166392,0.03033013887813466,2.262604391461532,340,28.321075779944046,Governorate,Baghdad,0.05944707220114393,0.5006847235154952,0.6195788679177832,0.501-0.62,2.5
4,Reddit,0.5601317957166392,0.03033013887813466,2.262604391461532,340,28.321075779944046,Governorate,Baghdad,0.05944707220114393,0.5006847235154952,0.6195788679177832,0.501-0.62,2.5
4,Instagram,0.4695222405271829,0.03955294054005738,3.8063334137830154,285,28.431203515386635,Governorate,Baghdad,0.07752376345851247,0.3919984770686704,0.5470460039856954,0.392-0.547,4
4,Telegram,0.18780889621087316,0.027988360758426912,3.1120972657707355,114,19.043809142780937,Governorate,Baghdad,0.05485718708651675,0.13295170912435642,0.2426660832973899,0.133-0.243,5
4,TikTok,0.12355848434925865,0.021080415766840624,2.486769058083221,75,14.288690166235206,Governorate,Baghdad,0.04131761490300762,0.08224086944625103,0.16487609925226626,0.082-0.165,6
4,Viber,0.11696869851729819,0.016728072114797286,1.6417939540178041,71,11.69757809691106,Governorate,Baghdad,0.03278702134500268,0.08418167717229551,0.14975571986230085,0.084-0.15,7
4,SnapChat,0.09719934102141681,0.018999248235843702,2.492816268998831,59,12.737739202856998,Governorate,Baghdad,0.03723852654225365,0.059960814479163155,0.13443786756367046,0.06-0.134,8
4,Twitter,0.03789126853377265,0.007855922123649392,1.0258967698628623,23,4.983305462575352,Governorate,Baghdad,0.015397607362352808,0.022493661171419842,0.05328887589612546,0.022-0.053,9
4,BOTIM,0,0,NA,0,0,Governorate,Baghdad,0,0,0,0-0,12
4,LinkedIn,0,0,NA,0,0,Governorate,Baghdad,0,0,0,0-0,12
4,Pinterest,0,0,NA,0,0,Governorate,Baghdad,0,0,0,0-0,12
4,V Chat,0,0,NA,0,0,Governorate,Baghdad,0,0,0,0-0,12
4,VKontakte,0,0,NA,0,0,Governorate,Baghdad,0,0,0,0-0,12
1,Facebook,0.8623853211009175,0.044130246043371464,1.772271837566507,94,7.968688725254614,Governorate,Erbil,0.08649528224500806,0.7758900388559095,0.9488806033459255,0.776-0.949,1
1,Instagram,0.8256880733944955,0.017596447059742507,0.2323435471938832,90,7.582875444051551,Governorate,Erbil,0.034489036237095316,0.7911990371574001,0.8601771096315908,0.791-0.86,2
1,Viber,0.6972477064220184,0.06800037314820433,2.3657661361934883,76,6.9641941385920605,Governorate,Erbil,0.13328073137048047,0.5639669750515379,0.8305284377924989,0.564-0.831,3
1,SnapChat,0.5963302752293578,0.09972931239485125,4.462275372973127,65,14.577379737113253,Governorate,Erbil,0.19546945229390844,0.40086082293544933,0.7917997275232662,0.401-0.792,4
1,TikTok,0.27522935779816515,0.1323317969248616,9.481058471189508,30,14.832396974191328,Governorate,Erbil,0.25937032197272875,0.015859035825436407,0.5345996797708938,0.016-0.535,5
1,WhatsApp,0.13761467889908258,0.10137755129715469,9.352791064581925,15,11.291589790636216,Governorate,Erbil,0.19870000054242318,-0.0610853216433406,0.3363146794415057,-0.061-0.336,6.5
1,Reddit,0.13761467889908258,0.10137755129715469,9.352791064581925,15,11.291589790636216,Governorate,Erbil,0.19870000054242318,-0.0610853216433406,0.3363146794415057,-0.061-0.336,6.5
1,Telegram,0.06422018348623854,0.06354502790290352,7.256742104298999,7,7.000000000000001,Governorate,Erbil,0.1245482546896909,-0.06032807120345236,0.18876843817592942,-0.06-0.189,8
1,Twitter,0.05504587155963303,0.05446716677391735,6.159675683538134,6,5.999999999999999,Governorate,Erbil,0.10675564687687801,-0.05170977531724498,0.16180151843651103,-0.052-0.162,9
1,LinkedIn,0.01834862385321101,0.018155722257972448,1.97646914456208,2,2,Governorate,Erbil,0.035585215625626,-0.01723659177241499,0.05393383947883701,-0.017-0.054,10
1,BOTIM,0,0,NA,0,0,Governorate,Erbil,0,0,0,0-0,12.5
1,Pinterest,0,0,NA,0,0,Governorate,Erbil,0,0,0,0-0,12.5
1,V Chat,0,0,NA,0,0,Governorate,Erbil,0,0,0,0-0,12.5
1,VKontakte,0,0,NA,0,0,Governorate,Erbil,0,0,0,0-0,12.5
2,Facebook,0.8483606557377049,0.0236492387360434,1.0564481517569453,207,27.237054592175394,Governorate,Ninawa,0.04635250792264506,0.8020081478150598,0.89471316366035,0.802-0.895,1
2,Instagram,0.3442622950819672,0.03574188004282692,1.3751226748761851,84,13.076696830622021,Governorate,Ninawa,0.07005408488394076,0.27420821019802644,0.414316379965908,0.274-0.414,2
2,WhatsApp,0.2418032786885246,0.05177902034729848,3.553610668176019,59,16.46207763315433,Governorate,Ninawa,0.10148687988070501,0.1403163988078196,0.3432901585692296,0.14-0.343,3.5
2,Reddit,0.2418032786885246,0.05177902034729848,3.553610668176019,59,16.46207763315433,Governorate,Ninawa,0.10148687988070501,0.1403163988078196,0.3432901585692296,0.14-0.343,3.5
2,TikTok,0.1762295081967213,0.04368834535765672,3.1948656984469928,43,13.721724173212134,Governorate,Ninawa,0.08562915690100717,0.09060035129571414,0.2618586650977285,0.091-0.262,5
2,Telegram,0.09836065573770492,0.019452542427981574,1.0368232949528295,24,6,Governorate,Ninawa,0.038126983158843886,0.06023367257886103,0.1364876388965488,0.06-0.136,6
2,Viber,0.0819672131147541,0.018857682824960174,1.1483772123469118,20,5.794085654478071,Governorate,Ninawa,0.03696105833692194,0.045006154777832166,0.11892827145167605,0.045-0.119,7
2,SnapChat,0.06967213114754099,0.017213336861744196,1.1108138434953632,17,4.358898943540674,Governorate,Ninawa,0.033738140249018625,0.03593399089852237,0.10341027139655962,0.036-0.103,8
2,Twitter,0.028688524590163935,0.009546373342838208,0.7947240759522828,7,2,Governorate,Ninawa,0.018710891751962888,0.009977632838201047,0.04739941634212683,0.01-0.047,9
2,BOTIM,0.012295081967213115,0.008735676195248728,1.5270057920353663,3,2.171240593367237,Governorate,Ninawa,0.017121925342687506,-0.004826843375474392,0.02941700730990062,-0.005-0.029,10
2,LinkedIn,0,0,NA,0,0,Governorate,Ninawa,0,0,0,0-0,12.5
2,Pinterest,0,0,NA,0,0,Governorate,Ninawa,0,0,0,0-0,12.5
2,V Chat,0,0,NA,0,0,Governorate,Ninawa,0,0,0,0-0,12.5
2,VKontakte,0,0,NA,0,0,Governorate,Ninawa,0,0,0,0-0,12.5
