Disaggregate.x,Disaggregate type,Percent.x,Margin of error.x,Sample.x,Percent.y,Margin of error.y,Sample.y
Overall,Overall,0.69053876478318,0.03514557626449812,1522,0.632711038961039,0.02331232985660502,2464
Locality,Urban,0.6745562130177515,0.03577874517590263,1522,0.6456456456456456,0.025688468274856636,2464
Locality,Rural,0.7463126843657817,0.10661083736266291,1522,0.5772532188841202,0.05498042614335849,2464
Sex,Male,0.6636481241914619,0.04295117430177217,1522,0.6488033298647242,0.026138417414724075,2461
Sex,Female,0.7182910547396528,0.04502642101559353,1522,0.5732838589981447,0.05117696140693352,2461
Age group,16-25,0.7336683417085427,0.05130590841590367,1517,0.6324293133294865,0.027804412846896043,2464
Age group,26-35,0.7191601049868767,0.05907849246122296,1517,0.6264591439688716,0.051258747535927705,2464
Age group,36-45,0.6642066420664207,0.061702313473651044,1517,0.6541353383458647,0.09935990721844719,2464
Age group,46+,0.5746268656716418,0.08066150528835841,1517,0.6428571428571429,0.12622646408755267,2464
Education level,Elementary education or less,0.630901287553648,0.06028684811786853,1522,0.481994459833795,0.044661348796278325,2464
Education level,Complementary to secondary education,0.7015130674002751,0.03674768249424607,1522,0.7039274924471299,0.03478711478562728,2464
Education level,Post-secondary education,0.7507598784194529,0.05510476814633137,1522,0.6835781041388518,0.0408119906583726,2464
Religious group,Sunni,0.7814465408805031,0.0535172137088582,1517,0.6644182124789207,0.04657687470103392,2286
Religious group,Shiite,0.6098591549295775,0.048431431557472135,1517,0.6186770428015564,0.051467258556205,2286
Religious group,Muslim (other),0.6863905325443787,0.06035231496481863,1517,0.634320735444331,0.03696123175620127,2286
Religious group,Christian,0,0,1517,0.55,0.12,2286
Religious group,Other,0.5,0.7072540797572916,1517,0.61,0.11764971120004734,2286
Governorate,Erbil,0.68,0.14777238858009528,1522,0.5389221556886228,0.053502784581517464,2464
Governorate,Ninawa,0.7986798679867987,0.09432067993325358,1522,0.639763779527559,0.05116945308417465,2464
Governorate,Al-Anbar,0.8627450980392157,0.07520658790498187,1522,0.7090464547677262,0.0539672553988123,2464
Governorate,Baghdad,0.588495575221239,0.04260099358653226,1522,0.6130268199233716,0.05121209600160692,2464
Governorate,Al-Basra,0.7394957983193277,0.117029612059303,1522,0.6755725190839694,0.04913095455083485,2464
