Indicator,Overall,Urban,Rural,Erbil,Ninawa,Al-Anbar,Baghdad,Al-Basra,Male,Female,Youth (18-24),Adult (25-54),Mature (55+),Elementary education or less,Complementary to secondary education,Post-secondary education,Sunni,Shiite,Muslim (no sect)
Exposed to development activity,0.442838370565046,0.4446322907861369,0.4365781710914454,0.013333333333333334,0.5016501650165016,0.6928104575163399,0.39823008849557523,0.6050420168067226,0.4967658473479949,0.3871829105473965,0.4613861386138614,0.4489571899012075,0.2871287128712871,0.4334763948497854,0.44154057771664373,0.45896656534954405,0.41823899371069184,0.45774647887323944,0.46745562130177515
Number of development activity,0.9244415243101183,0.926458157227388,0.9174041297935103,0.013333333333333334,1.0198019801980198,1.8366013071895426,0.7654867256637168,1.2436974789915967,1.1125485122897802,0.7303070761014686,0.9881188118811881,0.9286498353457739,0.5544554455445545,0.8927038626609443,0.921595598349381,0.9756838905775076,0.9371069182389937,0.8859154929577465,1.0059171597633136
Exposed to USAID-branded activity,0.03942181340341656,0.034657650042265425,0.05604719764011799,0,0.0594059405940594,0.13725490196078433,0.017699115044247787,0.037815126050420166,0.04139715394566624,0.037383177570093455,0.04554455445544554,0.038419319429198684,0.019801980198019802,0.04291845493562232,0.03988995873452545,0.03343465045592705,0.06446540880503145,0.01971830985915493,0.023668639053254437
Number of USAID-branded activity,0.052562417871222074,0.04564666103127642,0.07669616519174041,0,0.0957095709570957,0.18300653594771243,0.017699115044247787,0.046218487394957986,0.054333764553686936,0.050734312416555405,0.06534653465346535,0.048298572996706916,0.0297029702970297,0.05150214592274678,0.0577716643741403,0.0425531914893617,0.08647798742138366,0.022535211267605635,0.023668639053254437
