brand,prop,prop_se,prop_deff,Sample,Sample_se,ind_type,disag,margin,lower,upper,ci
Public signage/logo,0.11366622864651774,0.013408431281917288,2.7142910038764243,173,22.206373316528207,Overall,disag,0.026280525312557885,0.08738570333395985,0.13994675395907563,0.087-0.14
Heard about it through friends/family,0.09855453350854139,0.012351746131503064,2.6119800909783235,150,19.856728898277343,Overall,disag,0.024209422417746006,0.07434511109079539,0.12276395592628739,0.074-0.123
Heard about it at work,0.070959264126149807,0.009661490460539972,2.153642498909802,108,14.863799638132226,Overall,disag,0.018936521302658344,0.052022742823491466,0.08989578542880815,0.052-0.09
Advertisement/information on internet,0.051248357424441525,0.007872109759227319,1.938558916087991,78,12.41654681949192,Overall,disag,0.015429335128085545,0.03581902229635598,0.06667769255252706,0.036-0.067
Advertisement/information in television,0.049277266754270695,0.008140515322847685,2.151456257535448,75,12.743189902410185,Overall,disag,0.01595541003278146,0.03332185672148923,0.06523267678705216,0.033-0.065
Advertisement/information on social media,0.02956636005256242,0.005948530507648747,1.8757929373340017,45,9.166017293016253,Overall,disag,0.011659119794991544,0.017907240257570876,0.04122547984755397,0.018-0.041
Heard about it at mosque,0.022339027595269383,0.006036857246172716,2.5380401208616794,34,9.308214498111717,Overall,disag,0.011832240202498524,0.01050678739277086,0.034171267797767906,0.011-0.034
Advertisement/information in print media,0.013797634691195795,0.0030903009988424847,1.06748085909504,21,4.602449313413422,Overall,disag,0.00605698995773127,0.007740644733464525,0.019854624648927066,0.008-0.02
Heard about it through elders/shuras,0.009198423127463863,0.00286100589905647,1.36605016550988,14,4.272001872658766,Overall,disag,0.0056075715621506815,0.0035908515653131816,0.014805994689614545,0.004-0.015
Advertisement/information in radio,0.0019710906701708277,0.0011305391536095208,0.988213325464497,3,1.707825127659933,Overall,disag,0.002215856741074661,-2.4476607090383315e-4,0.004186947411245489,0-0.004
