Disaggregate.x,Disaggregate type,Percent.x,Margin of error.x,Sample.x,Percent.y,Margin of error.y,Sample.y
Overall,Overall,0.08278580814717477,0.022282205935886718,1522,0.38057142857142856,0.02786313915823523,1750
Locality,Urban,0.08622147083685544,0.02709102352052391,1522,0.3649685973482205,0.030532691026340285,1750
Locality,Rural,0.07079646017699115,0.03407554620079547,1522,0.45110410094637227,0.06718171420142009,1750
Sex,Male,0.12548512289780078,0.03513289988811117,1522,0.4052434456928839,0.03225974610233544,1747
Sex,Female,0.03871829105473965,0.015004869465739128,1522,0.30097087378640774,0.0543000464628463,1747
Age group,16-25,0.11557788944723618,0.03325241792030506,1517,0.3857024106400665,0.03369570831013502,1750
Age group,26-35,0.07086614173228346,0.03524645320481867,1517,0.38522427440633245,0.06007316590570562,1750
Age group,36-45,0.055350553505535055,0.030896454391859996,1517,0.2857142857142857,0.1063154867907501,1750
Age group,46+,0.055970149253731345,0.024026956307624844,1517,0.4126984126984127,0.15005911594470672,1750
Education level,Elementary education or less,0.034334763948497854,0.017374441907669496,1522,0.41533546325878595,0.06695558797408172,1683
Education level,Complementary to secondary education,0.08940852819807428,0.03098890218853964,1522,0.39210526315789473,0.04253102812779313,1683
Education level,Post-secondary education,0.13677811550151975,0.04577041622339823,1522,0.3475409836065574,0.04631079398246171,1683
Religious group,Sunni,0.07861635220125787,0.032888319699497195,1517,0.3783783783783784,0.055301331801134494,1623
Religious group,Shiite,0.07042253521126761,0.02671852046095733,1517,0.32577903682719545,0.0599518519528988,1623
Religious group,Muslim (other),0.14792899408284024,0.057095656773746256,1517,0.3854014598540146,0.04466173915075139,1623
Religious group,Christian,0,0,1517,0.4927536231884058,0.14550609157114358,1623
Religious group,Other,0,0,1517,0.5277777777777778,0.1421938547609157,1623
Governorate,Erbil,0,0,1522,0.5,0.0653681652843412,1750
Governorate,Ninawa,0.12211221122112212,0.06764393278956665,1522,0.3791469194312796,0.05675032850370479,1750
Governorate,Al-Anbar,0.058823529411764705,0.030584857566647472,1522,0.36298932384341637,0.06896877424411786,1750
Governorate,Baghdad,0.058997050147492625,0.02292668142695389,1522,0.3403693931398417,0.05849126194126143,1750
Governorate,Al-Basra,0.1680672268907563,0.08869736007027249,1522,0.3212121212121212,0.06178403881330274,1750
