variable,val,label,frq,raw.prc,cum.prc
"(Television) You mentioned reading, seeing, or hearing a message about USAID in {0} in the past year. Can you describe in a few words the content of that message? (x)",114,Help the displaced people/refugees,6,0.38999999999999996,96.71
"(Television) You mentioned reading, seeing, or hearing a message about USAID in {0} in the past year. Can you describe in a few words the content of that message? (x)",100,Providing aids,5,0.33,95.14
"(Television) You mentioned reading, seeing, or hearing a message about USAID in {0} in the past year. Can you describe in a few words the content of that message? (x)",102,Reconstruction of cities,5,0.33,95.47
"(Television) You mentioned reading, seeing, or hearing a message about USAID in {0} in the past year. Can you describe in a few words the content of that message? (x)",125,Working on the infrastructre,5,0.33,97.89999999999999
"(Television) You mentioned reading, seeing, or hearing a message about USAID in {0} in the past year. Can you describe in a few words the content of that message? (x)",137,intellectual/human development,5,0.33,99.00999999999999
"(Television) You mentioned reading, seeing, or hearing a message about USAID in {0} in the past year. Can you describe in a few words the content of that message? (x)",110,About immagrants and immigration,4,0.26,96.25
"(Television) You mentioned reading, seeing, or hearing a message about USAID in {0} in the past year. Can you describe in a few words the content of that message? (x)",104,Reconstruction in Mosul city,2,0.13,95.66
"(Television) You mentioned reading, seeing, or hearing a message about USAID in {0} in the past year. Can you describe in a few words the content of that message? (x)",108,Developing the country,2,0.13,95.86
"(Television) You mentioned reading, seeing, or hearing a message about USAID in {0} in the past year. Can you describe in a few words the content of that message? (x)",109,News about Iraq,2,0.13,95.99
"(Television) You mentioned reading, seeing, or hearing a message about USAID in {0} in the past year. Can you describe in a few words the content of that message? (x)",118,"help children, women",2,0.13,97.04
"(Television) You mentioned reading, seeing, or hearing a message about USAID in {0} in the past year. Can you describe in a few words the content of that message? (x)",120,Help african countries,2,0.13,97.24000000000001
"(Television) You mentioned reading, seeing, or hearing a message about USAID in {0} in the past year. Can you describe in a few words the content of that message? (x)",122,provide aids and help with the infrastructure,2,0.13,97.44
"(Television) You mentioned reading, seeing, or hearing a message about USAID in {0} in the past year. Can you describe in a few words the content of that message? (x)",126,Help the poor,2,0.13,98.03
"(Television) You mentioned reading, seeing, or hearing a message about USAID in {0} in the past year. Can you describe in a few words the content of that message? (x)",144,A content that gives hope,2,0.13,99.53999999999999
"(Television) You mentioned reading, seeing, or hearing a message about USAID in {0} in the past year. Can you describe in a few words the content of that message? (x)",103,Investments projects,1,0.06999999999999999,95.53
"(Television) You mentioned reading, seeing, or hearing a message about USAID in {0} in the past year. Can you describe in a few words the content of that message? (x)",105,working to develop the country,1,0.06999999999999999,95.73
"(Television) You mentioned reading, seeing, or hearing a message about USAID in {0} in the past year. Can you describe in a few words the content of that message? (x)",113,Aids from International Monetary Fund,1,0.06999999999999999,96.32
"(Television) You mentioned reading, seeing, or hearing a message about USAID in {0} in the past year. Can you describe in a few words the content of that message? (x)",115,Aids for Albasra city,1,0.06999999999999999,96.78
"(Television) You mentioned reading, seeing, or hearing a message about USAID in {0} in the past year. Can you describe in a few words the content of that message? (x)",116,Aids from world bank,1,0.06999999999999999,96.85000000000001
"(Television) You mentioned reading, seeing, or hearing a message about USAID in {0} in the past year. Can you describe in a few words the content of that message? (x)",117,Investments and providing aids,1,0.06999999999999999,96.91
"(Television) You mentioned reading, seeing, or hearing a message about USAID in {0} in the past year. Can you describe in a few words the content of that message? (x)",119,"Help the displaced people in yemen, syria and Iraq",1,0.06999999999999999,97.11
"(Television) You mentioned reading, seeing, or hearing a message about USAID in {0} in the past year. Can you describe in a few words the content of that message? (x)",121,About USA and their help in IRAQ,1,0.06999999999999999,97.31
"(Television) You mentioned reading, seeing, or hearing a message about USAID in {0} in the past year. Can you describe in a few words the content of that message? (x)",123,Providing jobs,1,0.06999999999999999,97.5
"(Television) You mentioned reading, seeing, or hearing a message about USAID in {0} in the past year. Can you describe in a few words the content of that message? (x)",124,Provide weapons to Iraq,1,0.06999999999999999,97.57000000000001
"(Television) You mentioned reading, seeing, or hearing a message about USAID in {0} in the past year. Can you describe in a few words the content of that message? (x)",127,Providing aids and infrastructure,1,0.06999999999999999,98.09
"(Television) You mentioned reading, seeing, or hearing a message about USAID in {0} in the past year. Can you describe in a few words the content of that message? (x)",128,About iraqs economy and oil,1,0.06999999999999999,98.16
"(Television) You mentioned reading, seeing, or hearing a message about USAID in {0} in the past year. Can you describe in a few words the content of that message? (x)",129,"support the agriculture, roads and bridges",1,0.06999999999999999,98.22999999999999
"(Television) You mentioned reading, seeing, or hearing a message about USAID in {0} in the past year. Can you describe in a few words the content of that message? (x)",130,Threatning iran,1,0.06999999999999999,98.29
"(Television) You mentioned reading, seeing, or hearing a message about USAID in {0} in the past year. Can you describe in a few words the content of that message? (x)",131,Reconstruction of the westren area,1,0.06999999999999999,98.36
"(Television) You mentioned reading, seeing, or hearing a message about USAID in {0} in the past year. Can you describe in a few words the content of that message? (x)",132,Seeking refuge,1,0.06999999999999999,98.42
"(Television) You mentioned reading, seeing, or hearing a message about USAID in {0} in the past year. Can you describe in a few words the content of that message? (x)",133,About the political issues,1,0.06999999999999999,98.49
"(Television) You mentioned reading, seeing, or hearing a message about USAID in {0} in the past year. Can you describe in a few words the content of that message? (x)",134,Help the children,1,0.06999999999999999,98.55000000000001
"(Television) You mentioned reading, seeing, or hearing a message about USAID in {0} in the past year. Can you describe in a few words the content of that message? (x)",135,The Murder of al mohandes,1,0.06999999999999999,98.61999999999999
"(Television) You mentioned reading, seeing, or hearing a message about USAID in {0} in the past year. Can you describe in a few words the content of that message? (x)",136,cleaning campaigns,1,0.06999999999999999,98.69
"(Television) You mentioned reading, seeing, or hearing a message about USAID in {0} in the past year. Can you describe in a few words the content of that message? (x)",138,About public services/electricity,1,0.06999999999999999,99.08
"(Television) You mentioned reading, seeing, or hearing a message about USAID in {0} in the past year. Can you describe in a few words the content of that message? (x)",139,About iraq war,1,0.06999999999999999,99.15
"(Television) You mentioned reading, seeing, or hearing a message about USAID in {0} in the past year. Can you describe in a few words the content of that message? (x)",140,Military training,1,0.06999999999999999,99.21
"(Television) You mentioned reading, seeing, or hearing a message about USAID in {0} in the past year. Can you describe in a few words the content of that message? (x)",141,USA threatning IRAN,1,0.06999999999999999,99.28
"(Television) You mentioned reading, seeing, or hearing a message about USAID in {0} in the past year. Can you describe in a few words the content of that message? (x)",142,Covid-19,1,0.06999999999999999,99.33999999999999
"(Television) You mentioned reading, seeing, or hearing a message about USAID in {0} in the past year. Can you describe in a few words the content of that message? (x)",143,About the return of the displaced people,1,0.06999999999999999,99.41
"(Television) You mentioned reading, seeing, or hearing a message about USAID in {0} in the past year. Can you describe in a few words the content of that message? (x)",145,"Covid-19, infrastructre, providing aids",1,0.06999999999999999,99.61
"(Television) You mentioned reading, seeing, or hearing a message about USAID in {0} in the past year. Can you describe in a few words the content of that message? (x)",146,Saving a child that was neglected from his parents,1,0.06999999999999999,99.67
"(Television) You mentioned reading, seeing, or hearing a message about USAID in {0} in the past year. Can you describe in a few words the content of that message? (x)",147,"The situation, human rights and projects",1,0.06999999999999999,99.74
