Data Source,Percent,Margin of error,Sample
Household survey,0.17674113009198422,0.023164688020823002,1522
Crowdsource survey,0.3982857142857143,0.028093694983628695,1750
Crowdsource complete,0.3909952606635071,0.03292775045496078,1266
Merged survey,0.27403156384505023,0.020276916899250614,2788
